[Libvirt-ci] Build failed in Jenkins: libvirt-go-xml-check » libvirt-freebsd-12 #173

See <https://ci.centos.org/job/libvirt-go-xml-check/systems=libvirt-freebsd-12/173/display/redirect> ------------------------------------------ Started by upstream project "libvirt-go-xml-check" build number 173 originally caused by: Started by upstream project "libvirt-go-xml-build" build number 173 originally caused by: Started by upstream project "libvirt-build" build number 205 originally caused by: Started by an SCM change [EnvInject] - Loading node environment variables. Building remotely on libvirt-freebsd-12 (libvirt) in workspace <https://ci.centos.org/job/libvirt-go-xml-check/systems=libvirt-freebsd-12/ws/> [libvirt-go-xml] $ /bin/sh -xe /tmp/jenkins3437129023092098377.sh + export 'TEST_ARGS=-tags xmlroundtrip' + go test -tags xmlroundtrip --- FAIL: TestRoundTrip (17.24s) xml_test.go:400: testdata/libvirt/tests/qemuxml2argvdata/memory-hotplug-nvdimm-align.xml: /domain[0]/devices[0]/memory[0]/source[0]/alignsize[0]: element in expected XML missing in actual XML FAIL exit status 1 FAIL _/usr<https://ci.centos.org/job/libvirt-go-xml-check/systems=libvirt-freebsd-12/ws/> 17.347s Build step 'Execute shell' marked build as failure

See <https://ci.centos.org/job/libvirt-go-xml-check/systems=libvirt-freebsd-12/174/display/redirect> ------------------------------------------ Started by upstream project "libvirt-go-xml-check" build number 174 originally caused by: Started by upstream project "libvirt-go-xml-build" build number 174 originally caused by: Started by upstream project "libvirt-build" build number 206 originally caused by: Started by an SCM change [EnvInject] - Loading node environment variables. Building remotely on libvirt-freebsd-12 (libvirt) in workspace <https://ci.centos.org/job/libvirt-go-xml-check/systems=libvirt-freebsd-12/ws/> [libvirt-go-xml] $ /bin/sh -xe /tmp/jenkins7632291140322107789.sh + export 'TEST_ARGS=-tags xmlroundtrip' + go test -tags xmlroundtrip --- FAIL: TestRoundTrip (5.84s) xml_test.go:400: testdata/libvirt/tests/qemuxml2argvdata/memory-hotplug-nvdimm-align.xml: /domain[0]/devices[0]/memory[0]/source[0]/alignsize[0]: element in expected XML missing in actual XML FAIL exit status 1 FAIL _/usr<https://ci.centos.org/job/libvirt-go-xml-check/systems=libvirt-freebsd-12/ws/> 5.930s Build step 'Execute shell' marked build as failure

See <https://ci.centos.org/job/libvirt-go-xml-check/systems=libvirt-freebsd-12/175/display/redirect> ------------------------------------------ Started by upstream project "libvirt-go-xml-check" build number 175 originally caused by: Started by upstream project "libvirt-go-xml-build" build number 175 originally caused by: Started by upstream project "libvirt-build" build number 209 originally caused by: Started by an SCM change [EnvInject] - Loading node environment variables. Building remotely on libvirt-freebsd-12 (libvirt) in workspace <https://ci.centos.org/job/libvirt-go-xml-check/systems=libvirt-freebsd-12/ws/> [libvirt-go-xml] $ /bin/sh -xe /tmp/jenkins834113008888359149.sh + export 'TEST_ARGS=-tags xmlroundtrip' + go test -tags xmlroundtrip --- FAIL: TestRoundTrip (15.04s) xml_test.go:400: testdata/libvirt/tests/qemuxml2argvdata/memory-hotplug-nvdimm-align.xml: /domain[0]/devices[0]/memory[0]/source[0]/alignsize[0]: element in expected XML missing in actual XML FAIL exit status 1 FAIL _/usr<https://ci.centos.org/job/libvirt-go-xml-check/systems=libvirt-freebsd-12/ws/> 15.104s Build step 'Execute shell' marked build as failure

See <https://ci.centos.org/job/libvirt-go-xml-check/systems=libvirt-freebsd-12/176/display/redirect> ------------------------------------------ Started by upstream project "libvirt-go-xml-check" build number 176 originally caused by: Started by upstream project "libvirt-go-xml-build" build number 176 originally caused by: Started by upstream project "libvirt-build" build number 210 originally caused by: Started by an SCM change [EnvInject] - Loading node environment variables. Building remotely on libvirt-freebsd-12 (libvirt) in workspace <https://ci.centos.org/job/libvirt-go-xml-check/systems=libvirt-freebsd-12/ws/> [libvirt-go-xml] $ /bin/sh -xe /tmp/jenkins8016627940744077795.sh + export 'TEST_ARGS=-tags xmlroundtrip' + go test -tags xmlroundtrip --- FAIL: TestRoundTrip (7.70s) xml_test.go:400: testdata/libvirt/tests/qemuxml2argvdata/memory-hotplug-nvdimm-align.xml: /domain[0]/devices[0]/memory[0]/source[0]/alignsize[0]: element in expected XML missing in actual XML FAIL exit status 1 FAIL _/usr<https://ci.centos.org/job/libvirt-go-xml-check/systems=libvirt-freebsd-12/ws/> 7.788s Build step 'Execute shell' marked build as failure

See <https://ci.centos.org/job/libvirt-go-xml-check/systems=libvirt-freebsd-12/177/display/redirect> ------------------------------------------ Started by upstream project "libvirt-go-xml-check" build number 177 originally caused by: Started by upstream project "libvirt-go-xml-build" build number 177 originally caused by: Started by upstream project "libvirt-build" build number 211 originally caused by: Started by an SCM change [EnvInject] - Loading node environment variables. Building remotely on libvirt-freebsd-12 (libvirt) in workspace <https://ci.centos.org/job/libvirt-go-xml-check/systems=libvirt-freebsd-12/ws/> [libvirt-go-xml] $ /bin/sh -xe /tmp/jenkins3135005907070514989.sh + export 'TEST_ARGS=-tags xmlroundtrip' + go test -tags xmlroundtrip --- FAIL: TestRoundTrip (10.22s) xml_test.go:400: testdata/libvirt/tests/qemuxml2argvdata/memory-hotplug-nvdimm-align.xml: /domain[0]/devices[0]/memory[0]/source[0]/alignsize[0]: element in expected XML missing in actual XML FAIL exit status 1 FAIL _/usr<https://ci.centos.org/job/libvirt-go-xml-check/systems=libvirt-freebsd-12/ws/> 10.374s Build step 'Execute shell' marked build as failure

See <https://ci.centos.org/job/libvirt-go-xml-check/systems=libvirt-freebsd-12/178/display/redirect> ------------------------------------------ Started by upstream project "libvirt-go-xml-check" build number 178 originally caused by: Started by upstream project "libvirt-go-xml-build" build number 178 originally caused by: Started by upstream project "libvirt-build" build number 212 originally caused by: Started by an SCM change Started by an SCM change Started by an SCM change Started by an SCM change Started by an SCM change Started by an SCM change Started by an SCM change [EnvInject] - Loading node environment variables. Building remotely on libvirt-freebsd-12 (libvirt) in workspace <https://ci.centos.org/job/libvirt-go-xml-check/systems=libvirt-freebsd-12/ws/> [libvirt-go-xml] $ /bin/sh -xe /tmp/jenkins4889710246265516469.sh + export 'TEST_ARGS=-tags xmlroundtrip' + go test -tags xmlroundtrip --- FAIL: TestRoundTrip (4.61s) xml_test.go:400: testdata/libvirt/tests/qemuxml2argvdata/memory-hotplug-nvdimm-align.xml: /domain[0]/devices[0]/memory[0]/source[0]/alignsize[0]: element in expected XML missing in actual XML FAIL exit status 1 FAIL _/usr<https://ci.centos.org/job/libvirt-go-xml-check/systems=libvirt-freebsd-12/ws/> 4.707s Build step 'Execute shell' marked build as failure

See <https://ci.centos.org/job/libvirt-go-xml-check/systems=libvirt-freebsd-12/179/display/redirect> ------------------------------------------ Started by upstream project "libvirt-go-xml-check" build number 179 originally caused by: Started by upstream project "libvirt-go-xml-build" build number 179 originally caused by: Started by upstream project "libvirt-build" build number 213 originally caused by: Started by an SCM change [EnvInject] - Loading node environment variables. Building remotely on libvirt-freebsd-12 (libvirt) in workspace <https://ci.centos.org/job/libvirt-go-xml-check/systems=libvirt-freebsd-12/ws/> [libvirt-go-xml] $ /bin/sh -xe /tmp/jenkins7072083459716593790.sh + export 'TEST_ARGS=-tags xmlroundtrip' + go test -tags xmlroundtrip --- FAIL: TestRoundTrip (9.70s) xml_test.go:400: testdata/libvirt/tests/qemuxml2argvdata/memory-hotplug-nvdimm-align.xml: /domain[0]/devices[0]/memory[0]/source[0]/alignsize[0]: element in expected XML missing in actual XML FAIL exit status 1 FAIL _/usr<https://ci.centos.org/job/libvirt-go-xml-check/systems=libvirt-freebsd-12/ws/> 9.794s Build step 'Execute shell' marked build as failure

See <https://ci.centos.org/job/libvirt-go-xml-check/systems=libvirt-freebsd-12/180/display/redirect> ------------------------------------------ Started by upstream project "libvirt-go-xml-check" build number 180 originally caused by: Started by upstream project "libvirt-go-xml-build" build number 180 originally caused by: Started by upstream project "libvirt-build" build number 214 originally caused by: Started by an SCM change [EnvInject] - Loading node environment variables. Building remotely on libvirt-freebsd-12 (libvirt) in workspace <https://ci.centos.org/job/libvirt-go-xml-check/systems=libvirt-freebsd-12/ws/> [libvirt-go-xml] $ /bin/sh -xe /tmp/jenkins5235095774501401256.sh + export 'TEST_ARGS=-tags xmlroundtrip' + go test -tags xmlroundtrip --- FAIL: TestRoundTrip (37.46s) xml_test.go:400: testdata/libvirt/tests/qemuxml2argvdata/memory-hotplug-nvdimm-align.xml: /domain[0]/devices[0]/memory[0]/source[0]/alignsize[0]: element in expected XML missing in actual XML FAIL exit status 1 FAIL _/usr<https://ci.centos.org/job/libvirt-go-xml-check/systems=libvirt-freebsd-12/ws/> 37.597s Build step 'Execute shell' marked build as failure

See <https://ci.centos.org/job/libvirt-go-xml-check/systems=libvirt-freebsd-12/181/display/redirect> ------------------------------------------ Started by upstream project "libvirt-go-xml-check" build number 181 originally caused by: Started by upstream project "libvirt-go-xml-build" build number 181 originally caused by: Started by upstream project "libvirt-build" build number 215 originally caused by: Started by an SCM change [EnvInject] - Loading node environment variables. Building remotely on libvirt-freebsd-12 (libvirt) in workspace <https://ci.centos.org/job/libvirt-go-xml-check/systems=libvirt-freebsd-12/ws/> [libvirt-go-xml] $ /bin/sh -xe /tmp/jenkins8318972860984497557.sh + export 'TEST_ARGS=-tags xmlroundtrip' + go test -tags xmlroundtrip --- FAIL: TestRoundTrip (14.36s) xml_test.go:400: testdata/libvirt/tests/qemuxml2argvdata/memory-hotplug-nvdimm-align.xml: /domain[0]/devices[0]/memory[0]/source[0]/alignsize[0]: element in expected XML missing in actual XML FAIL exit status 1 FAIL _/usr<https://ci.centos.org/job/libvirt-go-xml-check/systems=libvirt-freebsd-12/ws/> 14.564s Build step 'Execute shell' marked build as failure

See <https://ci.centos.org/job/libvirt-go-xml-check/systems=libvirt-freebsd-12/182/display/redirect> ------------------------------------------ Started by upstream project "libvirt-go-xml-check" build number 182 originally caused by: Started by upstream project "libvirt-go-xml-build" build number 182 originally caused by: Started by upstream project "libvirt-build" build number 216 originally caused by: Started by an SCM change Started by an SCM change Started by an SCM change [EnvInject] - Loading node environment variables. Building remotely on libvirt-freebsd-12 (libvirt) in workspace <https://ci.centos.org/job/libvirt-go-xml-check/systems=libvirt-freebsd-12/ws/> [libvirt-go-xml] $ /bin/sh -xe /tmp/jenkins2813604904384800361.sh + export 'TEST_ARGS=-tags xmlroundtrip' + go test -tags xmlroundtrip --- FAIL: TestRoundTrip (10.49s) xml_test.go:400: testdata/libvirt/tests/qemuxml2argvdata/memory-hotplug-nvdimm-align.xml: /domain[0]/devices[0]/memory[0]/source[0]/alignsize[0]: element in expected XML missing in actual XML FAIL exit status 1 FAIL _/usr<https://ci.centos.org/job/libvirt-go-xml-check/systems=libvirt-freebsd-12/ws/> 10.533s Build step 'Execute shell' marked build as failure

See <https://ci.centos.org/job/libvirt-go-xml-check/systems=libvirt-freebsd-12/183/display/redirect> ------------------------------------------ Started by upstream project "libvirt-go-xml-check" build number 183 originally caused by: Started by upstream project "libvirt-go-xml-build" build number 183 originally caused by: Started by upstream project "libvirt-build" build number 217 originally caused by: Started by an SCM change [EnvInject] - Loading node environment variables. Building remotely on libvirt-freebsd-12 (libvirt) in workspace <https://ci.centos.org/job/libvirt-go-xml-check/systems=libvirt-freebsd-12/ws/> [libvirt-go-xml] $ /bin/sh -xe /tmp/jenkins5291857696405681838.sh + export 'TEST_ARGS=-tags xmlroundtrip' + go test -tags xmlroundtrip --- FAIL: TestRoundTrip (10.16s) xml_test.go:400: testdata/libvirt/tests/qemuxml2argvdata/memory-hotplug-nvdimm-align.xml: /domain[0]/devices[0]/memory[0]/source[0]/alignsize[0]: element in expected XML missing in actual XML FAIL exit status 1 FAIL _/usr<https://ci.centos.org/job/libvirt-go-xml-check/systems=libvirt-freebsd-12/ws/> 10.278s Build step 'Execute shell' marked build as failure

See <https://ci.centos.org/job/libvirt-go-xml-check/systems=libvirt-freebsd-12/184/display/redirect> ------------------------------------------ Started by upstream project "libvirt-go-xml-check" build number 184 originally caused by: Started by upstream project "libvirt-go-xml-build" build number 184 originally caused by: Started by upstream project "libvirt-build" build number 218 originally caused by: Started by an SCM change [EnvInject] - Loading node environment variables. Building remotely on libvirt-freebsd-12 (libvirt) in workspace <https://ci.centos.org/job/libvirt-go-xml-check/systems=libvirt-freebsd-12/ws/> [libvirt-go-xml] $ /bin/sh -xe /tmp/jenkins6792932044998055525.sh + export 'TEST_ARGS=-tags xmlroundtrip' + go test -tags xmlroundtrip --- FAIL: TestRoundTrip (21.23s) xml_test.go:400: testdata/libvirt/tests/qemuxml2argvdata/memory-hotplug-nvdimm-align.xml: /domain[0]/devices[0]/memory[0]/source[0]/alignsize[0]: element in expected XML missing in actual XML FAIL exit status 1 FAIL _/usr<https://ci.centos.org/job/libvirt-go-xml-check/systems=libvirt-freebsd-12/ws/> 21.407s Build step 'Execute shell' marked build as failure

See <https://ci.centos.org/job/libvirt-go-xml-check/systems=libvirt-freebsd-12/185/display/redirect> ------------------------------------------ Started by upstream project "libvirt-go-xml-check" build number 185 originally caused by: Started by upstream project "libvirt-go-xml-build" build number 185 originally caused by: Started by upstream project "libvirt-build" build number 219 originally caused by: Started by an SCM change Started by an SCM change Started by an SCM change Started by an SCM change [EnvInject] - Loading node environment variables. Building remotely on libvirt-freebsd-12 (libvirt) in workspace <https://ci.centos.org/job/libvirt-go-xml-check/systems=libvirt-freebsd-12/ws/> [libvirt-go-xml] $ /bin/sh -xe /tmp/jenkins6845653340510299310.sh + export 'TEST_ARGS=-tags xmlroundtrip' + go test -tags xmlroundtrip --- FAIL: TestRoundTrip (7.02s) xml_test.go:400: testdata/libvirt/tests/qemuxml2argvdata/memory-hotplug-nvdimm-align.xml: /domain[0]/devices[0]/memory[0]/source[0]/alignsize[0]: element in expected XML missing in actual XML FAIL exit status 1 FAIL _/usr<https://ci.centos.org/job/libvirt-go-xml-check/systems=libvirt-freebsd-12/ws/> 7.156s Build step 'Execute shell' marked build as failure

See <https://ci.centos.org/job/libvirt-go-xml-check/systems=libvirt-freebsd-12/186/display/redirect> ------------------------------------------ Started by upstream project "libvirt-go-xml-check" build number 186 originally caused by: Started by upstream project "libvirt-go-xml-build" build number 186 originally caused by: Started by upstream project "libvirt-build" build number 220 originally caused by: Started by an SCM change Started by an SCM change [EnvInject] - Loading node environment variables. Building remotely on libvirt-freebsd-12 (libvirt) in workspace <https://ci.centos.org/job/libvirt-go-xml-check/systems=libvirt-freebsd-12/ws/> [libvirt-go-xml] $ /bin/sh -xe /tmp/jenkins2484618317357551341.sh + export 'TEST_ARGS=-tags xmlroundtrip' + go test -tags xmlroundtrip --- FAIL: TestRoundTrip (4.89s) xml_test.go:400: testdata/libvirt/tests/qemuxml2argvdata/memory-hotplug-nvdimm-align.xml: /domain[0]/devices[0]/memory[0]/source[0]/alignsize[0]: element in expected XML missing in actual XML FAIL exit status 1 FAIL _/usr<https://ci.centos.org/job/libvirt-go-xml-check/systems=libvirt-freebsd-12/ws/> 5.013s Build step 'Execute shell' marked build as failure

See <https://ci.centos.org/job/libvirt-go-xml-check/systems=libvirt-freebsd-12/187/display/redirect> ------------------------------------------ Started by upstream project "libvirt-go-xml-check" build number 187 originally caused by: Started by upstream project "libvirt-go-xml-build" build number 187 originally caused by: Started by upstream project "libvirt-build" build number 221 originally caused by: Started by an SCM change Started by an SCM change Started by an SCM change Started by an SCM change [EnvInject] - Loading node environment variables. Building remotely on libvirt-freebsd-12 (libvirt) in workspace <https://ci.centos.org/job/libvirt-go-xml-check/systems=libvirt-freebsd-12/ws/> [libvirt-go-xml] $ /bin/sh -xe /tmp/jenkins2091571606044341859.sh + export 'TEST_ARGS=-tags xmlroundtrip' + go test -tags xmlroundtrip --- FAIL: TestRoundTrip (5.35s) xml_test.go:400: testdata/libvirt/tests/qemuxml2argvdata/memory-hotplug-nvdimm-align.xml: /domain[0]/devices[0]/memory[0]/source[0]/alignsize[0]: element in expected XML missing in actual XML FAIL exit status 1 FAIL _/usr<https://ci.centos.org/job/libvirt-go-xml-check/systems=libvirt-freebsd-12/ws/> 5.509s Build step 'Execute shell' marked build as failure

See <https://ci.centos.org/job/libvirt-go-xml-check/systems=libvirt-freebsd-12/188/display/redirect> ------------------------------------------ Started by upstream project "libvirt-go-xml-check" build number 188 originally caused by: Started by upstream project "libvirt-go-xml-build" build number 188 originally caused by: Started by upstream project "libvirt-build" build number 222 originally caused by: Started by an SCM change [EnvInject] - Loading node environment variables. Building remotely on libvirt-freebsd-12 (libvirt) in workspace <https://ci.centos.org/job/libvirt-go-xml-check/systems=libvirt-freebsd-12/ws/> [libvirt-go-xml] $ /bin/sh -xe /tmp/jenkins2008823704077022166.sh + export 'TEST_ARGS=-tags xmlroundtrip' + go test -tags xmlroundtrip --- FAIL: TestRoundTrip (30.13s) xml_test.go:400: testdata/libvirt/tests/qemuxml2argvdata/memory-hotplug-nvdimm-align.xml: /domain[0]/devices[0]/memory[0]/source[0]/alignsize[0]: element in expected XML missing in actual XML FAIL exit status 1 FAIL _/usr<https://ci.centos.org/job/libvirt-go-xml-check/systems=libvirt-freebsd-12/ws/> 30.250s Build step 'Execute shell' marked build as failure

See <https://ci.centos.org/job/libvirt-go-xml-check/systems=libvirt-freebsd-12/189/display/redirect> ------------------------------------------ Started by upstream project "libvirt-go-xml-check" build number 189 originally caused by: Started by upstream project "libvirt-go-xml-build" build number 189 originally caused by: Started by upstream project "libvirt-build" build number 223 originally caused by: Started by an SCM change [EnvInject] - Loading node environment variables. Building remotely on libvirt-freebsd-12 (libvirt) in workspace <https://ci.centos.org/job/libvirt-go-xml-check/systems=libvirt-freebsd-12/ws/> [libvirt-go-xml] $ /bin/sh -xe /tmp/jenkins5124915946105583824.sh + export 'TEST_ARGS=-tags xmlroundtrip' + go test -tags xmlroundtrip --- FAIL: TestRoundTrip (7.85s) xml_test.go:400: testdata/libvirt/tests/qemuxml2argvdata/memory-hotplug-nvdimm-align.xml: /domain[0]/devices[0]/memory[0]/source[0]/alignsize[0]: element in expected XML missing in actual XML FAIL exit status 1 FAIL _/usr<https://ci.centos.org/job/libvirt-go-xml-check/systems=libvirt-freebsd-12/ws/> 8.036s Build step 'Execute shell' marked build as failure

See <https://ci.centos.org/job/libvirt-go-xml-check/systems=libvirt-freebsd-12/190/display/redirect> ------------------------------------------ Started by upstream project "libvirt-go-xml-check" build number 190 originally caused by: Started by upstream project "libvirt-go-xml-build" build number 190 originally caused by: Started by upstream project "libvirt-build" build number 224 originally caused by: Started by an SCM change [EnvInject] - Loading node environment variables. Building remotely on libvirt-freebsd-12 (libvirt) in workspace <https://ci.centos.org/job/libvirt-go-xml-check/systems=libvirt-freebsd-12/ws/> [libvirt-go-xml] $ /bin/sh -xe /tmp/jenkins7685328874500832416.sh + export 'TEST_ARGS=-tags xmlroundtrip' + go test -tags xmlroundtrip --- FAIL: TestRoundTrip (20.61s) xml_test.go:400: testdata/libvirt/tests/qemuxml2argvdata/memory-hotplug-nvdimm-align.xml: /domain[0]/devices[0]/memory[0]/source[0]/alignsize[0]: element in expected XML missing in actual XML FAIL exit status 1 FAIL _/usr<https://ci.centos.org/job/libvirt-go-xml-check/systems=libvirt-freebsd-12/ws/> 20.780s Build step 'Execute shell' marked build as failure

See <https://ci.centos.org/job/libvirt-go-xml-check/systems=libvirt-freebsd-12/191/display/redirect> ------------------------------------------ Started by upstream project "libvirt-go-xml-check" build number 191 originally caused by: Started by upstream project "libvirt-go-xml-build" build number 191 originally caused by: Started by upstream project "libvirt-build" build number 225 originally caused by: Started by an SCM change Started by an SCM change Started by an SCM change Started by an SCM change Started by an SCM change [EnvInject] - Loading node environment variables. Building remotely on libvirt-freebsd-12 (libvirt) in workspace <https://ci.centos.org/job/libvirt-go-xml-check/systems=libvirt-freebsd-12/ws/> [libvirt-go-xml] $ /bin/sh -xe /tmp/jenkins2069534898816479032.sh + export 'TEST_ARGS=-tags xmlroundtrip' + go test -tags xmlroundtrip --- FAIL: TestRoundTrip (5.90s) xml_test.go:400: testdata/libvirt/tests/qemuxml2argvdata/memory-hotplug-nvdimm-align.xml: /domain[0]/devices[0]/memory[0]/source[0]/alignsize[0]: element in expected XML missing in actual XML FAIL exit status 1 FAIL _/usr<https://ci.centos.org/job/libvirt-go-xml-check/systems=libvirt-freebsd-12/ws/> 6.005s Build step 'Execute shell' marked build as failure

See <https://ci.centos.org/job/libvirt-go-xml-check/systems=libvirt-freebsd-12/192/display/redirect> ------------------------------------------ Started by upstream project "libvirt-go-xml-check" build number 192 originally caused by: Started by upstream project "libvirt-go-xml-build" build number 192 originally caused by: Started by upstream project "libvirt-build" build number 226 originally caused by: Started by an SCM change [EnvInject] - Loading node environment variables. Building remotely on libvirt-freebsd-12 (libvirt) in workspace <https://ci.centos.org/job/libvirt-go-xml-check/systems=libvirt-freebsd-12/ws/> [libvirt-go-xml] $ /bin/sh -xe /tmp/jenkins8949989140663241893.sh + export 'TEST_ARGS=-tags xmlroundtrip' + go test -tags xmlroundtrip --- FAIL: TestRoundTrip (23.56s) xml_test.go:400: testdata/libvirt/tests/qemuxml2argvdata/memory-hotplug-nvdimm-align.xml: /domain[0]/devices[0]/memory[0]/source[0]/alignsize[0]: element in expected XML missing in actual XML FAIL exit status 1 FAIL _/usr<https://ci.centos.org/job/libvirt-go-xml-check/systems=libvirt-freebsd-12/ws/> 23.681s Build step 'Execute shell' marked build as failure

See <https://ci.centos.org/job/libvirt-go-xml-check/systems=libvirt-freebsd-12/193/display/redirect> ------------------------------------------ Started by upstream project "libvirt-go-xml-check" build number 193 originally caused by: Started by upstream project "libvirt-go-xml-build" build number 193 originally caused by: Started by upstream project "libvirt-build" build number 227 originally caused by: Started by an SCM change [EnvInject] - Loading node environment variables. Building remotely on libvirt-freebsd-12 (libvirt) in workspace <https://ci.centos.org/job/libvirt-go-xml-check/systems=libvirt-freebsd-12/ws/> [libvirt-go-xml] $ /bin/sh -xe /tmp/jenkins6170855355734256854.sh + export 'TEST_ARGS=-tags xmlroundtrip' + go test -tags xmlroundtrip --- FAIL: TestRoundTrip (21.68s) xml_test.go:400: testdata/libvirt/tests/qemuxml2argvdata/memory-hotplug-nvdimm-align.xml: /domain[0]/devices[0]/memory[0]/source[0]/alignsize[0]: element in expected XML missing in actual XML FAIL exit status 1 FAIL _/usr<https://ci.centos.org/job/libvirt-go-xml-check/systems=libvirt-freebsd-12/ws/> 21.769s Build step 'Execute shell' marked build as failure

See <https://ci.centos.org/job/libvirt-go-xml-check/systems=libvirt-freebsd-12/194/display/redirect> ------------------------------------------ Started by upstream project "libvirt-go-xml-check" build number 194 originally caused by: Started by upstream project "libvirt-go-xml-build" build number 194 originally caused by: Started by upstream project "libvirt-build" build number 228 originally caused by: Started by an SCM change Started by an SCM change Started by an SCM change Started by an SCM change Started by an SCM change Started by an SCM change Started by an SCM change [EnvInject] - Loading node environment variables. Building remotely on libvirt-freebsd-12 (libvirt) in workspace <https://ci.centos.org/job/libvirt-go-xml-check/systems=libvirt-freebsd-12/ws/> [libvirt-go-xml] $ /bin/sh -xe /tmp/jenkins296323737259887155.sh + export 'TEST_ARGS=-tags xmlroundtrip' + go test -tags xmlroundtrip --- FAIL: TestRoundTrip (5.04s) xml_test.go:400: testdata/libvirt/tests/qemuxml2argvdata/memory-hotplug-nvdimm-align.xml: /domain[0]/devices[0]/memory[0]/source[0]/alignsize[0]: element in expected XML missing in actual XML FAIL exit status 1 FAIL _/usr<https://ci.centos.org/job/libvirt-go-xml-check/systems=libvirt-freebsd-12/ws/> 5.098s Build step 'Execute shell' marked build as failure

See <https://ci.centos.org/job/libvirt-go-xml-check/systems=libvirt-freebsd-12/195/display/redirect> ------------------------------------------ Started by upstream project "libvirt-go-xml-check" build number 195 originally caused by: Started by upstream project "libvirt-go-xml-build" build number 195 originally caused by: Started by upstream project "libvirt-build" build number 229 originally caused by: Started by an SCM change Started by an SCM change Started by an SCM change Started by an SCM change [EnvInject] - Loading node environment variables. Building remotely on libvirt-freebsd-12 (libvirt) in workspace <https://ci.centos.org/job/libvirt-go-xml-check/systems=libvirt-freebsd-12/ws/> [libvirt-go-xml] $ /bin/sh -xe /tmp/jenkins7189866384357770625.sh + export 'TEST_ARGS=-tags xmlroundtrip' + go test -tags xmlroundtrip --- FAIL: TestRoundTrip (8.39s) xml_test.go:400: testdata/libvirt/tests/qemuxml2argvdata/memory-hotplug-nvdimm-align.xml: /domain[0]/devices[0]/memory[0]/source[0]/alignsize[0]: element in expected XML missing in actual XML FAIL exit status 1 FAIL _/usr<https://ci.centos.org/job/libvirt-go-xml-check/systems=libvirt-freebsd-12/ws/> 8.543s Build step 'Execute shell' marked build as failure

participants (1)
-
ci@centos.org