[Libvirt-ci] Build failed in Jenkins: libvirt-go-check » libvirt-freebsd-12 #905

See <https://ci.centos.org/job/libvirt-go-check/systems=libvirt-freebsd-12/905/display/redirect> ------------------------------------------ Started by upstream project "libvirt-go-check" build number 905 originally caused by: Started by upstream project "libvirt-go-build" build number 919 originally caused by: Started by upstream project "libvirt-build" build number 1088 originally caused by: Started by an SCM change Running as SYSTEM [EnvInject] - Loading node environment variables. Building remotely on libvirt-freebsd-12 (libvirt) in workspace <https://ci.centos.org/job/libvirt-go-check/systems=libvirt-freebsd-12/ws/> [libvirt-go] $ /bin/sh -xe /tmp/jenkins12467442443025804963.sh + export 'TEST_ARGS=-tags api' + go test -tags api Missing enum 'VIR_DOMAIN_STATS_MEMORY' --- FAIL: TestAPICoverage (0.74s) panic: Missing symbols found [recovered] panic: Missing symbols found goroutine 21 [running]: testing.tRunner.func1(0xc0000c2100) /usr/local/go/src/testing/testing.go:874 +0x3a3 panic(0x224740, 0x2a0d20) /usr/local/go/src/runtime/panic.go:679 +0x1b2 _/usr<https://ci.centos.org/job/libvirt-go-check/systems=libvirt-freebsd-12/ws/.TestAPICoverage(0xc0000c2100)> /usr<https://ci.centos.org/job/libvirt-go-check/systems=libvirt-freebsd-12/ws/api_test.go>:503 +0x551 testing.tRunner(0xc0000c2100, 0x279f50) /usr/local/go/src/testing/testing.go:909 +0xc9 created by testing.(*T).Run /usr/local/go/src/testing/testing.go:960 +0x350 exit status 2 FAIL _/usr<https://ci.centos.org/job/libvirt-go-check/systems=libvirt-freebsd-12/ws/> 1.165s Build step 'Execute shell' marked build as failure

See <https://ci.centos.org/job/libvirt-go-check/systems=libvirt-freebsd-12/906/display/redirect> ------------------------------------------ Started by upstream project "libvirt-go-check" build number 906 originally caused by: Started by upstream project "libvirt-go-build" build number 920 originally caused by: Started by upstream project "libvirt-build" build number 1093 originally caused by: Started by an SCM change Running as SYSTEM [EnvInject] - Loading node environment variables. Building remotely on libvirt-freebsd-12 (libvirt) in workspace <https://ci.centos.org/job/libvirt-go-check/systems=libvirt-freebsd-12/ws/> [libvirt-go] $ /bin/sh -xe /tmp/jenkins4723317623422936730.sh + export 'TEST_ARGS=-tags api' + go test -tags api Missing enum 'VIR_DOMAIN_STATS_MEMORY' --- FAIL: TestAPICoverage (0.51s) panic: Missing symbols found [recovered] panic: Missing symbols found goroutine 5 [running]: testing.tRunner.func1(0xc0000b0100) /usr/local/go/src/testing/testing.go:874 +0x3a3 panic(0x224740, 0x2a0d20) /usr/local/go/src/runtime/panic.go:679 +0x1b2 _/usr<https://ci.centos.org/job/libvirt-go-check/systems=libvirt-freebsd-12/ws/.TestAPICoverage(0xc0000b0100)> /usr<https://ci.centos.org/job/libvirt-go-check/systems=libvirt-freebsd-12/ws/api_test.go>:503 +0x551 testing.tRunner(0xc0000b0100, 0x279f50) /usr/local/go/src/testing/testing.go:909 +0xc9 created by testing.(*T).Run /usr/local/go/src/testing/testing.go:960 +0x350 exit status 2 FAIL _/usr<https://ci.centos.org/job/libvirt-go-check/systems=libvirt-freebsd-12/ws/> 0.744s Build step 'Execute shell' marked build as failure

See <https://ci.centos.org/job/libvirt-go-check/systems=libvirt-freebsd-12/907/display/redirect> ------------------------------------------ Started by upstream project "libvirt-go-check" build number 907 originally caused by: Started by upstream project "libvirt-go-build" build number 921 originally caused by: Started by upstream project "libvirt-build" build number 1094 originally caused by: Started by an SCM change Running as SYSTEM [EnvInject] - Loading node environment variables. Building remotely on libvirt-freebsd-12 (libvirt) in workspace <https://ci.centos.org/job/libvirt-go-check/systems=libvirt-freebsd-12/ws/> [libvirt-go] $ /bin/sh -xe /tmp/jenkins17403555452229459682.sh + export 'TEST_ARGS=-tags api' + go test -tags api Missing enum 'VIR_DOMAIN_STATS_MEMORY' --- FAIL: TestAPICoverage (1.33s) panic: Missing symbols found [recovered] panic: Missing symbols found goroutine 7 [running]: testing.tRunner.func1(0xc0000a8100) /usr/local/go/src/testing/testing.go:874 +0x3a3 panic(0x224740, 0x2a0d20) /usr/local/go/src/runtime/panic.go:679 +0x1b2 _/usr<https://ci.centos.org/job/libvirt-go-check/systems=libvirt-freebsd-12/ws/.TestAPICoverage(0xc0000a8100)> /usr<https://ci.centos.org/job/libvirt-go-check/systems=libvirt-freebsd-12/ws/api_test.go>:503 +0x551 testing.tRunner(0xc0000a8100, 0x279f50) /usr/local/go/src/testing/testing.go:909 +0xc9 created by testing.(*T).Run /usr/local/go/src/testing/testing.go:960 +0x350 exit status 2 FAIL _/usr<https://ci.centos.org/job/libvirt-go-check/systems=libvirt-freebsd-12/ws/> 1.898s Build step 'Execute shell' marked build as failure

See <https://ci.centos.org/job/libvirt-go-check/systems=libvirt-freebsd-12/908/display/redirect> ------------------------------------------ Started by upstream project "libvirt-go-check" build number 908 originally caused by: Started by upstream project "libvirt-go-build" build number 922 originally caused by: Started by upstream project "libvirt-build" build number 1095 originally caused by: Started by an SCM change Running as SYSTEM [EnvInject] - Loading node environment variables. Building remotely on libvirt-freebsd-12 (libvirt) in workspace <https://ci.centos.org/job/libvirt-go-check/systems=libvirt-freebsd-12/ws/> [libvirt-go] $ /bin/sh -xe /tmp/jenkins12887532415831107304.sh + export 'TEST_ARGS=-tags api' + go test -tags api Missing enum 'VIR_DOMAIN_STATS_MEMORY' --- FAIL: TestAPICoverage (1.22s) panic: Missing symbols found [recovered] panic: Missing symbols found goroutine 7 [running]: testing.tRunner.func1(0xc0000a8100) /usr/local/go/src/testing/testing.go:874 +0x3a3 panic(0x224740, 0x2a0d20) /usr/local/go/src/runtime/panic.go:679 +0x1b2 _/usr<https://ci.centos.org/job/libvirt-go-check/systems=libvirt-freebsd-12/ws/.TestAPICoverage(0xc0000a8100)> /usr<https://ci.centos.org/job/libvirt-go-check/systems=libvirt-freebsd-12/ws/api_test.go>:503 +0x551 testing.tRunner(0xc0000a8100, 0x279f50) /usr/local/go/src/testing/testing.go:909 +0xc9 created by testing.(*T).Run /usr/local/go/src/testing/testing.go:960 +0x350 exit status 2 FAIL _/usr<https://ci.centos.org/job/libvirt-go-check/systems=libvirt-freebsd-12/ws/> 1.616s Build step 'Execute shell' marked build as failure

See <https://ci.centos.org/job/libvirt-go-check/systems=libvirt-freebsd-12/909/display/redirect> ------------------------------------------ Started by upstream project "libvirt-go-check" build number 909 originally caused by: Started by upstream project "libvirt-go-build" build number 923 originally caused by: Started by upstream project "libvirt-build" build number 1096 originally caused by: Started by an SCM change Running as SYSTEM [EnvInject] - Loading node environment variables. Building remotely on libvirt-freebsd-12 (libvirt) in workspace <https://ci.centos.org/job/libvirt-go-check/systems=libvirt-freebsd-12/ws/> [libvirt-go] $ /bin/sh -xe /tmp/jenkins5826062870139081540.sh + export 'TEST_ARGS=-tags api' + go test -tags api Missing enum 'VIR_DOMAIN_STATS_MEMORY' --- FAIL: TestAPICoverage (0.76s) panic: Missing symbols found [recovered] panic: Missing symbols found goroutine 5 [running]: testing.tRunner.func1(0xc0000b0100) /usr/local/go/src/testing/testing.go:874 +0x3a3 panic(0x224740, 0x2a0d20) /usr/local/go/src/runtime/panic.go:679 +0x1b2 _/usr<https://ci.centos.org/job/libvirt-go-check/systems=libvirt-freebsd-12/ws/.TestAPICoverage(0xc0000b0100)> /usr<https://ci.centos.org/job/libvirt-go-check/systems=libvirt-freebsd-12/ws/api_test.go>:503 +0x551 testing.tRunner(0xc0000b0100, 0x279f50) /usr/local/go/src/testing/testing.go:909 +0xc9 created by testing.(*T).Run /usr/local/go/src/testing/testing.go:960 +0x350 exit status 2 FAIL _/usr<https://ci.centos.org/job/libvirt-go-check/systems=libvirt-freebsd-12/ws/> 1.240s Build step 'Execute shell' marked build as failure

See <https://ci.centos.org/job/libvirt-go-check/systems=libvirt-freebsd-12/910/display/redirect> ------------------------------------------ Started by upstream project "libvirt-go-check" build number 910 originally caused by: Started by upstream project "libvirt-go-build" build number 924 originally caused by: Started by upstream project "libvirt-build" build number 1097 originally caused by: Started by an SCM change Started by an SCM change Started by an SCM change Running as SYSTEM [EnvInject] - Loading node environment variables. Building remotely on libvirt-freebsd-12 (libvirt) in workspace <https://ci.centos.org/job/libvirt-go-check/systems=libvirt-freebsd-12/ws/> [libvirt-go] $ /bin/sh -xe /tmp/jenkins12426350714652531655.sh + export 'TEST_ARGS=-tags api' + go test -tags api Missing enum 'VIR_DOMAIN_STATS_MEMORY' --- FAIL: TestAPICoverage (0.87s) panic: Missing symbols found [recovered] panic: Missing symbols found goroutine 20 [running]: testing.tRunner.func1(0xc0000c0100) /usr/local/go/src/testing/testing.go:874 +0x3a3 panic(0x224740, 0x2a0d20) /usr/local/go/src/runtime/panic.go:679 +0x1b2 _/usr<https://ci.centos.org/job/libvirt-go-check/systems=libvirt-freebsd-12/ws/.TestAPICoverage(0xc0000c0100)> /usr<https://ci.centos.org/job/libvirt-go-check/systems=libvirt-freebsd-12/ws/api_test.go>:503 +0x551 testing.tRunner(0xc0000c0100, 0x279f50) /usr/local/go/src/testing/testing.go:909 +0xc9 created by testing.(*T).Run /usr/local/go/src/testing/testing.go:960 +0x350 exit status 2 FAIL _/usr<https://ci.centos.org/job/libvirt-go-check/systems=libvirt-freebsd-12/ws/> 1.032s Build step 'Execute shell' marked build as failure

See <https://ci.centos.org/job/libvirt-go-check/systems=libvirt-freebsd-12/911/display/redirect> ------------------------------------------ Started by upstream project "libvirt-go-check" build number 911 originally caused by: Started by upstream project "libvirt-go-build" build number 925 originally caused by: Started by upstream project "libvirt-build" build number 1098 originally caused by: Started by an SCM change Started by an SCM change Started by an SCM change Running as SYSTEM [EnvInject] - Loading node environment variables. Building remotely on libvirt-freebsd-12 (libvirt) in workspace <https://ci.centos.org/job/libvirt-go-check/systems=libvirt-freebsd-12/ws/> [libvirt-go] $ /bin/sh -xe /tmp/jenkins11999958241081287243.sh + export 'TEST_ARGS=-tags api' + go test -tags api Missing enum 'VIR_DOMAIN_STATS_MEMORY' --- FAIL: TestAPICoverage (0.90s) panic: Missing symbols found [recovered] panic: Missing symbols found goroutine 22 [running]: testing.tRunner.func1(0xc0000bc100) /usr/local/go/src/testing/testing.go:874 +0x3a3 panic(0x224740, 0x2a0d20) /usr/local/go/src/runtime/panic.go:679 +0x1b2 _/usr<https://ci.centos.org/job/libvirt-go-check/systems=libvirt-freebsd-12/ws/.TestAPICoverage(0xc0000bc100)> /usr<https://ci.centos.org/job/libvirt-go-check/systems=libvirt-freebsd-12/ws/api_test.go>:503 +0x551 testing.tRunner(0xc0000bc100, 0x279f50) /usr/local/go/src/testing/testing.go:909 +0xc9 created by testing.(*T).Run /usr/local/go/src/testing/testing.go:960 +0x350 exit status 2 FAIL _/usr<https://ci.centos.org/job/libvirt-go-check/systems=libvirt-freebsd-12/ws/> 2.093s Build step 'Execute shell' marked build as failure

See <https://ci.centos.org/job/libvirt-go-check/systems=libvirt-freebsd-12/912/display/redirect> ------------------------------------------ Started by upstream project "libvirt-go-check" build number 912 originally caused by: Started by upstream project "libvirt-go-build" build number 926 originally caused by: Started by upstream project "libvirt-build" build number 1099 originally caused by: Started by user Libvirt Running as SYSTEM [EnvInject] - Loading node environment variables. Building remotely on libvirt-freebsd-12 (libvirt) in workspace <https://ci.centos.org/job/libvirt-go-check/systems=libvirt-freebsd-12/ws/> [libvirt-go] $ /bin/sh -xe /tmp/jenkins15120515796743171978.sh + export 'TEST_ARGS=-tags api' + go test -tags api Missing enum 'VIR_DOMAIN_STATS_MEMORY' --- FAIL: TestAPICoverage (1.11s) panic: Missing symbols found [recovered] panic: Missing symbols found goroutine 6 [running]: testing.tRunner.func1(0xc0000c6100) /usr/local/go/src/testing/testing.go:874 +0x3a3 panic(0x245da0, 0x2c2380) /usr/local/go/src/runtime/panic.go:679 +0x1b2 _/usr<https://ci.centos.org/job/libvirt-go-check/systems=libvirt-freebsd-12/ws/.TestAPICoverage(0xc0000c6100)> /usr<https://ci.centos.org/job/libvirt-go-check/systems=libvirt-freebsd-12/ws/api_test.go>:503 +0x551 testing.tRunner(0xc0000c6100, 0x29b5b0) /usr/local/go/src/testing/testing.go:909 +0xc9 created by testing.(*T).Run /usr/local/go/src/testing/testing.go:960 +0x350 exit status 2 FAIL _/usr<https://ci.centos.org/job/libvirt-go-check/systems=libvirt-freebsd-12/ws/> 1.293s Build step 'Execute shell' marked build as failure

participants (1)
-
ci@centos.org