[Libvirt-ci] Build failed in Jenkins: libvirt-go-xml-check » libvirt-freebsd-11 #287

See <https://ci.centos.org/job/libvirt-go-xml-check/systems=libvirt-freebsd-11/287/display/redirect> ------------------------------------------ Started by upstream project "libvirt-go-xml-check" build number 287 originally caused by: Started by upstream project "libvirt-go-xml-build" build number 287 originally caused by: Started by upstream project "libvirt-build" build number 352 originally caused by: Started by an SCM change [EnvInject] - Loading node environment variables. Building remotely on libvirt-freebsd-11 (libvirt) in workspace <https://ci.centos.org/job/libvirt-go-xml-check/systems=libvirt-freebsd-11/ws/> [libvirt-go-xml] $ /bin/sh -xe /tmp/jenkins3328271700565749015.sh + export 'TEST_ARGS=-tags xmlroundtrip' + go test -tags xmlroundtrip --- FAIL: TestRoundTrip (14.74s) xml_test.go:400: testdata/libvirt/tests/qemuxml2argvdata/virtio-non-transitional.xml: /domain[0]/devices[0]/disk[0]/@model: attribute 'virtio-non-transitional' in expected XML missing in actual XML FAIL exit status 1 FAIL _/usr<https://ci.centos.org/job/libvirt-go-xml-check/systems=libvirt-freebsd-11/ws/> 14.882s Build step 'Execute shell' marked build as failure

See <https://ci.centos.org/job/libvirt-go-xml-check/systems=libvirt-freebsd-11/288/display/redirect> ------------------------------------------ Started by upstream project "libvirt-go-xml-check" build number 288 originally caused by: Started by upstream project "libvirt-go-xml-build" build number 288 originally caused by: Started by upstream project "libvirt-build" build number 353 originally caused by: Started by an SCM change Started by an SCM change Started by an SCM change Started by an SCM change Started by an SCM change Started by an SCM change Started by an SCM change Started by an SCM change [EnvInject] - Loading node environment variables. Building remotely on libvirt-freebsd-11 (libvirt) in workspace <https://ci.centos.org/job/libvirt-go-xml-check/systems=libvirt-freebsd-11/ws/> [libvirt-go-xml] $ /bin/sh -xe /tmp/jenkins675933010367408263.sh + export 'TEST_ARGS=-tags xmlroundtrip' + go test -tags xmlroundtrip --- FAIL: TestRoundTrip (6.19s) xml_test.go:400: testdata/libvirt/tests/qemuxml2argvdata/virtio-non-transitional.xml: /domain[0]/devices[0]/disk[0]/@model: attribute 'virtio-non-transitional' in expected XML missing in actual XML FAIL exit status 1 FAIL _/usr<https://ci.centos.org/job/libvirt-go-xml-check/systems=libvirt-freebsd-11/ws/> 6.283s Build step 'Execute shell' marked build as failure

See <https://ci.centos.org/job/libvirt-go-xml-check/systems=libvirt-freebsd-11/289/display/redirect> ------------------------------------------ Started by upstream project "libvirt-go-xml-check" build number 289 originally caused by: Started by upstream project "libvirt-go-xml-build" build number 289 originally caused by: Started by upstream project "libvirt-build" build number 354 originally caused by: Started by an SCM change [EnvInject] - Loading node environment variables. Building remotely on libvirt-freebsd-11 (libvirt) in workspace <https://ci.centos.org/job/libvirt-go-xml-check/systems=libvirt-freebsd-11/ws/> [libvirt-go-xml] $ /bin/sh -xe /tmp/jenkins7121094328165283432.sh + export 'TEST_ARGS=-tags xmlroundtrip' + go test -tags xmlroundtrip --- FAIL: TestRoundTrip (12.34s) xml_test.go:400: testdata/libvirt/tests/qemuxml2argvdata/virtio-non-transitional.xml: /domain[0]/devices[0]/disk[0]/@model: attribute 'virtio-non-transitional' in expected XML missing in actual XML FAIL exit status 1 FAIL _/usr<https://ci.centos.org/job/libvirt-go-xml-check/systems=libvirt-freebsd-11/ws/> 12.464s Build step 'Execute shell' marked build as failure

See <https://ci.centos.org/job/libvirt-go-xml-check/systems=libvirt-freebsd-11/290/display/redirect> ------------------------------------------ Started by upstream project "libvirt-go-xml-check" build number 290 originally caused by: Started by upstream project "libvirt-go-xml-build" build number 290 originally caused by: Started by upstream project "libvirt-build" build number 355 originally caused by: Started by an SCM change Started by an SCM change Started by an SCM change Started by an SCM change Started by an SCM change Started by an SCM change Started by an SCM change Started by an SCM change Started by an SCM change Started by an SCM change [EnvInject] - Loading node environment variables. Building remotely on libvirt-freebsd-11 (libvirt) in workspace <https://ci.centos.org/job/libvirt-go-xml-check/systems=libvirt-freebsd-11/ws/> [libvirt-go-xml] $ /bin/sh -xe /tmp/jenkins8966761561946006998.sh + export 'TEST_ARGS=-tags xmlroundtrip' + go test -tags xmlroundtrip --- FAIL: TestRoundTrip (8.93s) xml_test.go:400: testdata/libvirt/tests/qemuxml2argvdata/virtio-non-transitional.xml: /domain[0]/devices[0]/disk[0]/@model: attribute 'virtio-non-transitional' in expected XML missing in actual XML FAIL exit status 1 FAIL _/usr<https://ci.centos.org/job/libvirt-go-xml-check/systems=libvirt-freebsd-11/ws/> 9.052s Build step 'Execute shell' marked build as failure

See <https://ci.centos.org/job/libvirt-go-xml-check/systems=libvirt-freebsd-11/291/display/redirect> ------------------------------------------ Started by upstream project "libvirt-go-xml-check" build number 291 originally caused by: Started by upstream project "libvirt-go-xml-build" build number 291 originally caused by: Started by upstream project "libvirt-build" build number 356 originally caused by: Started by an SCM change [EnvInject] - Loading node environment variables. Building remotely on libvirt-freebsd-11 (libvirt) in workspace <https://ci.centos.org/job/libvirt-go-xml-check/systems=libvirt-freebsd-11/ws/> [libvirt-go-xml] $ /bin/sh -xe /tmp/jenkins951877014915709440.sh + export 'TEST_ARGS=-tags xmlroundtrip' + go test -tags xmlroundtrip --- FAIL: TestRoundTrip (36.60s) xml_test.go:400: testdata/libvirt/tests/qemuxml2argvdata/virtio-non-transitional.xml: /domain[0]/devices[0]/disk[0]/@model: attribute 'virtio-non-transitional' in expected XML missing in actual XML FAIL exit status 1 FAIL _/usr<https://ci.centos.org/job/libvirt-go-xml-check/systems=libvirt-freebsd-11/ws/> 36.637s Build step 'Execute shell' marked build as failure

participants (1)
-
ci@centos.org