[Libvirt-ci] Build failed in Jenkins: libvirt-go-check » libvirt-fedora-rawhide #231

See <https://ci.centos.org/job/libvirt-go-check/systems=libvirt-fedora-rawhide/231/display/redirect> ------------------------------------------ Started by upstream project "libvirt-go-check" build number 231 originally caused by: Started by upstream project "libvirt-go-build" build number 235 originally caused by: Started by upstream project "libvirt-build" build number 295 originally caused by: Started by an SCM change Started by an SCM change Started by an SCM change Started by an SCM change [EnvInject] - Loading node environment variables. Building remotely on libvirt-fedora-rawhide (libvirt) in workspace <https://ci.centos.org/job/libvirt-go-check/systems=libvirt-fedora-rawhide/ws/> [libvirt-go] $ /bin/sh -xe /tmp/jenkins1711518160422558723.sh + export 'TEST_ARGS=-tags api' + TEST_ARGS='-tags api' + go test -tags api Missing macro 'VIR_MIGRATE_PARAM_BANDWIDTH_POSTCOPY' Missing enum 'VIR_DOMAIN_MIGRATE_MAX_SPEED_POSTCOPY' --- FAIL: TestAPICoverage (1.54s) panic: Missing symbols found [recovered] panic: Missing symbols found goroutine 5 [running]: testing.tRunner.func1(0xc0000aa100) /usr/lib/golang/src/testing/testing.go:827 +0x388 panic(0x5cd4e0, 0x642bb0) /usr/lib/golang/src/runtime/panic.go:522 +0x1b5 _<https://ci.centos.org/job/libvirt-go-check/systems=libvirt-fedora-rawhide/ws/.TestAPICoverage(0xc0000aa100)> <https://ci.centos.org/job/libvirt-go-check/systems=libvirt-fedora-rawhide/ws/api_test.go>:501 +0x551 testing.tRunner(0xc0000aa100, 0x61d0d8) /usr/lib/golang/src/testing/testing.go:862 +0xc0 created by testing.(*T).Run /usr/lib/golang/src/testing/testing.go:913 +0x357 exit status 2 FAIL _<https://ci.centos.org/job/libvirt-go-check/systems=libvirt-fedora-rawhide/ws/> 2.426s Build step 'Execute shell' marked build as failure

See <https://ci.centos.org/job/libvirt-go-check/systems=libvirt-fedora-rawhide/232/display/redirect> ------------------------------------------ Started by upstream project "libvirt-go-check" build number 232 originally caused by: Started by upstream project "libvirt-go-build" build number 236 originally caused by: Started by upstream project "libvirt-build" build number 296 originally caused by: Started by an SCM change [EnvInject] - Loading node environment variables. Building remotely on libvirt-fedora-rawhide (libvirt) in workspace <https://ci.centos.org/job/libvirt-go-check/systems=libvirt-fedora-rawhide/ws/> [libvirt-go] $ /bin/sh -xe /tmp/jenkins4042439512116489047.sh + export 'TEST_ARGS=-tags api' + TEST_ARGS='-tags api' + go test -tags api Missing macro 'VIR_MIGRATE_PARAM_BANDWIDTH_POSTCOPY' Missing enum 'VIR_DOMAIN_MIGRATE_MAX_SPEED_POSTCOPY' --- FAIL: TestAPICoverage (1.50s) panic: Missing symbols found [recovered] panic: Missing symbols found goroutine 19 [running]: testing.tRunner.func1(0xc0000c2100) /usr/lib/golang/src/testing/testing.go:827 +0x388 panic(0x5cd4e0, 0x642bb0) /usr/lib/golang/src/runtime/panic.go:522 +0x1b5 _<https://ci.centos.org/job/libvirt-go-check/systems=libvirt-fedora-rawhide/ws/.TestAPICoverage(0xc0000c2100)> <https://ci.centos.org/job/libvirt-go-check/systems=libvirt-fedora-rawhide/ws/api_test.go>:501 +0x551 testing.tRunner(0xc0000c2100, 0x61d0d8) /usr/lib/golang/src/testing/testing.go:862 +0xc0 created by testing.(*T).Run /usr/lib/golang/src/testing/testing.go:913 +0x357 exit status 2 FAIL _<https://ci.centos.org/job/libvirt-go-check/systems=libvirt-fedora-rawhide/ws/> 2.066s Build step 'Execute shell' marked build as failure

See <https://ci.centos.org/job/libvirt-go-check/systems=libvirt-fedora-rawhide/233/display/redirect> ------------------------------------------ Started by upstream project "libvirt-go-check" build number 233 originally caused by: Started by upstream project "libvirt-go-build" build number 237 originally caused by: Started by upstream project "libvirt-build" build number 297 originally caused by: Started by an SCM change [EnvInject] - Loading node environment variables. Building remotely on libvirt-fedora-rawhide (libvirt) in workspace <https://ci.centos.org/job/libvirt-go-check/systems=libvirt-fedora-rawhide/ws/> [libvirt-go] $ /bin/sh -xe /tmp/jenkins7374782870383983953.sh + export 'TEST_ARGS=-tags api' + TEST_ARGS='-tags api' + go test -tags api Missing macro 'VIR_MIGRATE_PARAM_BANDWIDTH_POSTCOPY' Missing enum 'VIR_DOMAIN_MIGRATE_MAX_SPEED_POSTCOPY' --- FAIL: TestAPICoverage (0.87s) panic: Missing symbols found [recovered] panic: Missing symbols found goroutine 5 [running]: testing.tRunner.func1(0xc0000aa100) /usr/lib/golang/src/testing/testing.go:827 +0x388 panic(0x5cd4e0, 0x642bb0) /usr/lib/golang/src/runtime/panic.go:522 +0x1b5 _<https://ci.centos.org/job/libvirt-go-check/systems=libvirt-fedora-rawhide/ws/.TestAPICoverage(0xc0000aa100)> <https://ci.centos.org/job/libvirt-go-check/systems=libvirt-fedora-rawhide/ws/api_test.go>:501 +0x551 testing.tRunner(0xc0000aa100, 0x61d0d8) /usr/lib/golang/src/testing/testing.go:862 +0xc0 created by testing.(*T).Run /usr/lib/golang/src/testing/testing.go:913 +0x357 exit status 2 FAIL _<https://ci.centos.org/job/libvirt-go-check/systems=libvirt-fedora-rawhide/ws/> 1.158s Build step 'Execute shell' marked build as failure

See <https://ci.centos.org/job/libvirt-go-check/systems=libvirt-fedora-rawhide/234/display/redirect> ------------------------------------------ Started by upstream project "libvirt-go-check" build number 234 originally caused by: Started by upstream project "libvirt-go-build" build number 238 originally caused by: Started by upstream project "libvirt-build" build number 298 originally caused by: Started by an SCM change Started by an SCM change Started by an SCM change Started by an SCM change Started by an SCM change Started by an SCM change [EnvInject] - Loading node environment variables. Building remotely on libvirt-fedora-rawhide (libvirt) in workspace <https://ci.centos.org/job/libvirt-go-check/systems=libvirt-fedora-rawhide/ws/> [libvirt-go] $ /bin/sh -xe /tmp/jenkins8459400833920225145.sh + export 'TEST_ARGS=-tags api' + TEST_ARGS='-tags api' + go test -tags api Missing macro 'VIR_MIGRATE_PARAM_BANDWIDTH_POSTCOPY' Missing enum 'VIR_DOMAIN_MIGRATE_MAX_SPEED_POSTCOPY' --- FAIL: TestAPICoverage (1.65s) panic: Missing symbols found [recovered] panic: Missing symbols found goroutine 5 [running]: testing.tRunner.func1(0xc0000aa100) /usr/lib/golang/src/testing/testing.go:827 +0x388 panic(0x5cd4e0, 0x642bb0) /usr/lib/golang/src/runtime/panic.go:522 +0x1b5 _<https://ci.centos.org/job/libvirt-go-check/systems=libvirt-fedora-rawhide/ws/.TestAPICoverage(0xc0000aa100)> <https://ci.centos.org/job/libvirt-go-check/systems=libvirt-fedora-rawhide/ws/api_test.go>:501 +0x551 testing.tRunner(0xc0000aa100, 0x61d0d8) /usr/lib/golang/src/testing/testing.go:862 +0xc0 created by testing.(*T).Run /usr/lib/golang/src/testing/testing.go:913 +0x357 exit status 2 FAIL _<https://ci.centos.org/job/libvirt-go-check/systems=libvirt-fedora-rawhide/ws/> 2.569s Build step 'Execute shell' marked build as failure

See <https://ci.centos.org/job/libvirt-go-check/systems=libvirt-fedora-rawhide/235/display/redirect> ------------------------------------------ Started by upstream project "libvirt-go-check" build number 235 originally caused by: Started by upstream project "libvirt-go-build" build number 239 originally caused by: Started by upstream project "libvirt-build" build number 299 originally caused by: Started by an SCM change Started by an SCM change Started by an SCM change Started by an SCM change Started by an SCM change [EnvInject] - Loading node environment variables. Building remotely on libvirt-fedora-rawhide (libvirt) in workspace <https://ci.centos.org/job/libvirt-go-check/systems=libvirt-fedora-rawhide/ws/> [libvirt-go] $ /bin/sh -xe /tmp/jenkins5869430041888193898.sh + export 'TEST_ARGS=-tags api' + TEST_ARGS='-tags api' + go test -tags api Missing macro 'VIR_MIGRATE_PARAM_BANDWIDTH_POSTCOPY' Missing enum 'VIR_DOMAIN_MIGRATE_MAX_SPEED_POSTCOPY' --- FAIL: TestAPICoverage (1.28s) panic: Missing symbols found [recovered] panic: Missing symbols found goroutine 5 [running]: testing.tRunner.func1(0xc0000aa100) /usr/lib/golang/src/testing/testing.go:827 +0x388 panic(0x5cd4e0, 0x642bb0) /usr/lib/golang/src/runtime/panic.go:522 +0x1b5 _<https://ci.centos.org/job/libvirt-go-check/systems=libvirt-fedora-rawhide/ws/.TestAPICoverage(0xc0000aa100)> <https://ci.centos.org/job/libvirt-go-check/systems=libvirt-fedora-rawhide/ws/api_test.go>:501 +0x551 testing.tRunner(0xc0000aa100, 0x61d0d8) /usr/lib/golang/src/testing/testing.go:862 +0xc0 created by testing.(*T).Run /usr/lib/golang/src/testing/testing.go:913 +0x357 exit status 2 FAIL _<https://ci.centos.org/job/libvirt-go-check/systems=libvirt-fedora-rawhide/ws/> 1.753s Build step 'Execute shell' marked build as failure

See <https://ci.centos.org/job/libvirt-go-check/systems=libvirt-fedora-rawhide/236/display/redirect> ------------------------------------------ Started by upstream project "libvirt-go-check" build number 236 originally caused by: Started by upstream project "libvirt-go-build" build number 240 originally caused by: Started by upstream project "libvirt-build" build number 300 originally caused by: Started by an SCM change Started by an SCM change Started by an SCM change Started by an SCM change Started by an SCM change Started by an SCM change Started by an SCM change [EnvInject] - Loading node environment variables. Building remotely on libvirt-fedora-rawhide (libvirt) in workspace <https://ci.centos.org/job/libvirt-go-check/systems=libvirt-fedora-rawhide/ws/> [libvirt-go] $ /bin/sh -xe /tmp/jenkins1850504579319441194.sh + export 'TEST_ARGS=-tags api' + TEST_ARGS='-tags api' + go test -tags api Missing macro 'VIR_MIGRATE_PARAM_BANDWIDTH_POSTCOPY' Missing enum 'VIR_DOMAIN_MIGRATE_MAX_SPEED_POSTCOPY' --- FAIL: TestAPICoverage (1.25s) panic: Missing symbols found [recovered] panic: Missing symbols found goroutine 4 [running]: testing.tRunner.func1(0xc0000c4100) /usr/lib/golang/src/testing/testing.go:827 +0x388 panic(0x5cd4e0, 0x642bb0) /usr/lib/golang/src/runtime/panic.go:522 +0x1b5 _<https://ci.centos.org/job/libvirt-go-check/systems=libvirt-fedora-rawhide/ws/.TestAPICoverage(0xc0000c4100)> <https://ci.centos.org/job/libvirt-go-check/systems=libvirt-fedora-rawhide/ws/api_test.go>:501 +0x551 testing.tRunner(0xc0000c4100, 0x61d0d8) /usr/lib/golang/src/testing/testing.go:862 +0xc0 created by testing.(*T).Run /usr/lib/golang/src/testing/testing.go:913 +0x357 exit status 2 FAIL _<https://ci.centos.org/job/libvirt-go-check/systems=libvirt-fedora-rawhide/ws/> 1.740s Build step 'Execute shell' marked build as failure

participants (1)
-
ci@centos.org