[Libvirt-ci] Build failed in Jenkins: libvirt-go-xml-master-check » libvirt-fedora-28 #481

See <https://ci.centos.org/job/libvirt-go-xml-master-check/systems=libvirt-fedora-28/481/display/redirect> ------------------------------------------ Started by upstream project "libvirt-go-xml-master-check" build number 481 originally caused by: Started by upstream project "libvirt-go-xml-master-build" build number 490 originally caused by: Started by upstream project "libvirt-master-build" build number 1541 originally caused by: Started by an SCM change [EnvInject] - Loading node environment variables. Building remotely on libvirt-fedora-28 (libvirt) in workspace <https://ci.centos.org/job/libvirt-go-xml-master-check/systems=libvirt-fedora-28/ws/> [libvirt-go-xml-master] $ /bin/sh -xe /tmp/jenkins7462683230365891476.sh + export 'TEST_ARGS=-tags xmlroundtrip' + TEST_ARGS='-tags xmlroundtrip' + go test -tags xmlroundtrip --- FAIL: TestRoundTrip (30.53s) xml_test.go:383: testdata/libvirt/tests/storagevolxml2xmlin/vol-luks-convert.xml: /volume[0]/source[0]: element in expected XML missing in actual XML FAIL exit status 1 FAIL _<https://ci.centos.org/job/libvirt-go-xml-master-check/systems=libvirt-fedora-28/ws/> 30.692s Build step 'Execute shell' marked build as failure

See <https://ci.centos.org/job/libvirt-go-xml-master-check/systems=libvirt-fedora-28/482/display/redirect> ------------------------------------------ Started by upstream project "libvirt-go-xml-master-check" build number 482 originally caused by: Started by upstream project "libvirt-go-xml-master-build" build number 491 originally caused by: Started by upstream project "libvirt-master-build" build number 1542 originally caused by: Started by an SCM change Started by an SCM change Started by an SCM change Started by an SCM change Started by an SCM change [EnvInject] - Loading node environment variables. Building remotely on libvirt-fedora-28 (libvirt) in workspace <https://ci.centos.org/job/libvirt-go-xml-master-check/systems=libvirt-fedora-28/ws/> [libvirt-go-xml-master] $ /bin/sh -xe /tmp/jenkins6612246061392273014.sh + export 'TEST_ARGS=-tags xmlroundtrip' + TEST_ARGS='-tags xmlroundtrip' + go test -tags xmlroundtrip --- FAIL: TestRoundTrip (28.61s) xml_test.go:383: testdata/libvirt/tests/storagevolxml2xmlin/vol-luks-convert.xml: /volume[0]/source[0]: element in expected XML missing in actual XML FAIL exit status 1 FAIL _<https://ci.centos.org/job/libvirt-go-xml-master-check/systems=libvirt-fedora-28/ws/> 28.832s Build step 'Execute shell' marked build as failure

See <https://ci.centos.org/job/libvirt-go-xml-master-check/systems=libvirt-fedora-28/483/display/redirect> ------------------------------------------ Started by upstream project "libvirt-go-xml-master-check" build number 483 originally caused by: Started by upstream project "libvirt-go-xml-master-build" build number 492 originally caused by: Started by upstream project "libvirt-master-build" build number 1543 originally caused by: Started by an SCM change Started by an SCM change Started by an SCM change [EnvInject] - Loading node environment variables. Building remotely on libvirt-fedora-28 (libvirt) in workspace <https://ci.centos.org/job/libvirt-go-xml-master-check/systems=libvirt-fedora-28/ws/> [libvirt-go-xml-master] $ /bin/sh -xe /tmp/jenkins5265945635199263528.sh + export 'TEST_ARGS=-tags xmlroundtrip' + TEST_ARGS='-tags xmlroundtrip' + go test -tags xmlroundtrip --- FAIL: TestRoundTrip (31.49s) xml_test.go:383: testdata/libvirt/tests/storagevolxml2xmlin/vol-luks-convert.xml: /volume[0]/source[0]: element in expected XML missing in actual XML FAIL exit status 1 FAIL _<https://ci.centos.org/job/libvirt-go-xml-master-check/systems=libvirt-fedora-28/ws/> 31.637s Build step 'Execute shell' marked build as failure

See <https://ci.centos.org/job/libvirt-go-xml-master-check/systems=libvirt-fedora-28/484/display/redirect> ------------------------------------------ Started by upstream project "libvirt-go-xml-master-check" build number 484 originally caused by: Started by upstream project "libvirt-go-xml-master-build" build number 493 originally caused by: Started by upstream project "libvirt-master-build" build number 1544 originally caused by: Started by an SCM change [EnvInject] - Loading node environment variables. Building remotely on libvirt-fedora-28 (libvirt) in workspace <https://ci.centos.org/job/libvirt-go-xml-master-check/systems=libvirt-fedora-28/ws/> [libvirt-go-xml-master] $ /bin/sh -xe /tmp/jenkins1399598095156088952.sh + export 'TEST_ARGS=-tags xmlroundtrip' + TEST_ARGS='-tags xmlroundtrip' + go test -tags xmlroundtrip --- FAIL: TestRoundTrip (7.94s) xml_test.go:383: testdata/libvirt/tests/storagevolxml2xmlin/vol-luks-convert.xml: /volume[0]/source[0]: element in expected XML missing in actual XML FAIL exit status 1 FAIL _<https://ci.centos.org/job/libvirt-go-xml-master-check/systems=libvirt-fedora-28/ws/> 8.029s Build step 'Execute shell' marked build as failure

See <https://ci.centos.org/job/libvirt-go-xml-master-check/systems=libvirt-fedora-28/485/display/redirect> ------------------------------------------ Started by upstream project "libvirt-go-xml-master-check" build number 485 originally caused by: Started by upstream project "libvirt-go-xml-master-build" build number 494 originally caused by: Started by upstream project "libvirt-master-build" build number 1545 originally caused by: Started by an SCM change [EnvInject] - Loading node environment variables. Building remotely on libvirt-fedora-28 (libvirt) in workspace <https://ci.centos.org/job/libvirt-go-xml-master-check/systems=libvirt-fedora-28/ws/> [libvirt-go-xml-master] $ /bin/sh -xe /tmp/jenkins933173280443393375.sh + export 'TEST_ARGS=-tags xmlroundtrip' + TEST_ARGS='-tags xmlroundtrip' + go test -tags xmlroundtrip --- FAIL: TestRoundTrip (32.48s) xml_test.go:383: testdata/libvirt/tests/storagevolxml2xmlin/vol-luks-convert.xml: /volume[0]/source[0]: element in expected XML missing in actual XML FAIL exit status 1 FAIL _<https://ci.centos.org/job/libvirt-go-xml-master-check/systems=libvirt-fedora-28/ws/> 32.737s Build step 'Execute shell' marked build as failure

See <https://ci.centos.org/job/libvirt-go-xml-master-check/systems=libvirt-fedora-28/486/display/redirect> ------------------------------------------ Started by upstream project "libvirt-go-xml-master-check" build number 486 originally caused by: Started by upstream project "libvirt-go-xml-master-build" build number 495 originally caused by: Started by upstream project "libvirt-master-build" build number 1546 originally caused by: Started by an SCM change [EnvInject] - Loading node environment variables. Building remotely on libvirt-fedora-28 (libvirt) in workspace <https://ci.centos.org/job/libvirt-go-xml-master-check/systems=libvirt-fedora-28/ws/> [libvirt-go-xml-master] $ /bin/sh -xe /tmp/jenkins6561827989383540582.sh + export 'TEST_ARGS=-tags xmlroundtrip' + TEST_ARGS='-tags xmlroundtrip' + go test -tags xmlroundtrip --- FAIL: TestRoundTrip (8.12s) xml_test.go:383: testdata/libvirt/tests/storagevolxml2xmlin/vol-luks-convert.xml: /volume[0]/source[0]: element in expected XML missing in actual XML FAIL exit status 1 FAIL _<https://ci.centos.org/job/libvirt-go-xml-master-check/systems=libvirt-fedora-28/ws/> 8.175s Build step 'Execute shell' marked build as failure

See <https://ci.centos.org/job/libvirt-go-xml-master-check/systems=libvirt-fedora-28/487/display/redirect> ------------------------------------------ Started by upstream project "libvirt-go-xml-master-check" build number 487 originally caused by: Started by upstream project "libvirt-go-xml-master-build" build number 496 originally caused by: Started by upstream project "libvirt-master-build" build number 1547 originally caused by: Started by an SCM change [EnvInject] - Loading node environment variables. Building remotely on libvirt-fedora-28 (libvirt) in workspace <https://ci.centos.org/job/libvirt-go-xml-master-check/systems=libvirt-fedora-28/ws/> [libvirt-go-xml-master] $ /bin/sh -xe /tmp/jenkins6424473207656806058.sh + export 'TEST_ARGS=-tags xmlroundtrip' + TEST_ARGS='-tags xmlroundtrip' + go test -tags xmlroundtrip --- FAIL: TestRoundTrip (8.13s) xml_test.go:383: testdata/libvirt/tests/storagevolxml2xmlin/vol-luks-convert.xml: /volume[0]/source[0]: element in expected XML missing in actual XML FAIL exit status 1 FAIL _<https://ci.centos.org/job/libvirt-go-xml-master-check/systems=libvirt-fedora-28/ws/> 8.211s Build step 'Execute shell' marked build as failure

See <https://ci.centos.org/job/libvirt-go-xml-master-check/systems=libvirt-fedora-28/488/display/redirect> ------------------------------------------ Started by upstream project "libvirt-go-xml-master-check" build number 488 originally caused by: Started by upstream project "libvirt-go-xml-master-build" build number 497 originally caused by: Started by upstream project "libvirt-master-build" build number 1548 originally caused by: Started by an SCM change [EnvInject] - Loading node environment variables. Building remotely on libvirt-fedora-28 (libvirt) in workspace <https://ci.centos.org/job/libvirt-go-xml-master-check/systems=libvirt-fedora-28/ws/> [libvirt-go-xml-master] $ /bin/sh -xe /tmp/jenkins6299640911634063315.sh + export 'TEST_ARGS=-tags xmlroundtrip' + TEST_ARGS='-tags xmlroundtrip' + go test -tags xmlroundtrip --- FAIL: TestRoundTrip (7.52s) xml_test.go:383: testdata/libvirt/tests/storagevolxml2xmlin/vol-luks-convert.xml: /volume[0]/source[0]: element in expected XML missing in actual XML FAIL exit status 1 FAIL _<https://ci.centos.org/job/libvirt-go-xml-master-check/systems=libvirt-fedora-28/ws/> 7.587s Build step 'Execute shell' marked build as failure

See <https://ci.centos.org/job/libvirt-go-xml-master-check/systems=libvirt-fedora-28/489/display/redirect> ------------------------------------------ Started by upstream project "libvirt-go-xml-master-check" build number 489 originally caused by: Started by upstream project "libvirt-go-xml-master-build" build number 498 originally caused by: Started by upstream project "libvirt-master-build" build number 1549 originally caused by: Started by an SCM change Started by an SCM change Started by an SCM change [EnvInject] - Loading node environment variables. Building remotely on libvirt-fedora-28 (libvirt) in workspace <https://ci.centos.org/job/libvirt-go-xml-master-check/systems=libvirt-fedora-28/ws/> [libvirt-go-xml-master] $ /bin/sh -xe /tmp/jenkins291701293807288247.sh + export 'TEST_ARGS=-tags xmlroundtrip' + TEST_ARGS='-tags xmlroundtrip' + go test -tags xmlroundtrip --- FAIL: TestRoundTrip (20.04s) xml_test.go:383: testdata/libvirt/tests/storagevolxml2xmlin/vol-luks-convert.xml: /volume[0]/source[0]: element in expected XML missing in actual XML FAIL exit status 1 FAIL _<https://ci.centos.org/job/libvirt-go-xml-master-check/systems=libvirt-fedora-28/ws/> 20.149s Build step 'Execute shell' marked build as failure

participants (1)
-
ci@centos.org