[Libvirt-ci] Build failed in Jenkins: libvirt-go-check » libvirt-freebsd-12 #159

See <https://ci.centos.org/job/libvirt-go-check/systems=libvirt-freebsd-12/159/display/redirect> ------------------------------------------ Started by upstream project "libvirt-go-check" build number 159 originally caused by: Started by upstream project "libvirt-go-build" build number 163 originally caused by: Started by upstream project "libvirt-build" build number 190 originally caused by: Started by an SCM change Started by an SCM change Started by an SCM change Started by an SCM change Started by an SCM change [EnvInject] - Loading node environment variables. Building remotely on libvirt-freebsd-12 (libvirt) in workspace <https://ci.centos.org/job/libvirt-go-check/systems=libvirt-freebsd-12/ws/> [libvirt-go] $ /bin/sh -xe /tmp/jenkins102587360734454346.sh + export 'TEST_ARGS=-tags api' + go test -tags api Missing macro 'VIR_DOMAIN_JOB_MEMORY_POSTCOPY_REQS' --- FAIL: TestAPICoverage (0.29s) panic: Missing symbols found [recovered] panic: Missing symbols found goroutine 19 [running]: testing.tRunner.func1(0xc0000c6100) /usr/local/go/src/testing/testing.go:792 +0x387 panic(0x222980, 0x28f590) /usr/local/go/src/runtime/panic.go:513 +0x1b9 _/usr<https://ci.centos.org/job/libvirt-go-check/systems=libvirt-freebsd-12/ws/.TestAPICoverage(0xc0000c6100)> /usr<https://ci.centos.org/job/libvirt-go-check/systems=libvirt-freebsd-12/ws/api_test.go>:507 +0x554 testing.tRunner(0xc0000c6100, 0x270c50) /usr/local/go/src/testing/testing.go:827 +0xbf created by testing.(*T).Run /usr/local/go/src/testing/testing.go:878 +0x353 exit status 2 FAIL _/usr<https://ci.centos.org/job/libvirt-go-check/systems=libvirt-freebsd-12/ws/> 0.410s Build step 'Execute shell' marked build as failure

See <https://ci.centos.org/job/libvirt-go-check/systems=libvirt-freebsd-12/160/display/redirect> ------------------------------------------ Started by upstream project "libvirt-go-check" build number 160 originally caused by: Started by upstream project "libvirt-go-build" build number 164 originally caused by: Started by upstream project "libvirt-build" build number 191 originally caused by: Started by an SCM change [EnvInject] - Loading node environment variables. Building remotely on libvirt-freebsd-12 (libvirt) in workspace <https://ci.centos.org/job/libvirt-go-check/systems=libvirt-freebsd-12/ws/> [libvirt-go] $ /bin/sh -xe /tmp/jenkins5483807183051003521.sh + export 'TEST_ARGS=-tags api' + go test -tags api Missing macro 'VIR_DOMAIN_JOB_MEMORY_POSTCOPY_REQS' --- FAIL: TestAPICoverage (0.37s) panic: Missing symbols found [recovered] panic: Missing symbols found goroutine 4 [running]: testing.tRunner.func1(0xc0000b0100) /usr/local/go/src/testing/testing.go:792 +0x387 panic(0x222980, 0x28f590) /usr/local/go/src/runtime/panic.go:513 +0x1b9 _/usr<https://ci.centos.org/job/libvirt-go-check/systems=libvirt-freebsd-12/ws/.TestAPICoverage(0xc0000b0100)> /usr<https://ci.centos.org/job/libvirt-go-check/systems=libvirt-freebsd-12/ws/api_test.go>:507 +0x554 testing.tRunner(0xc0000b0100, 0x270c50) /usr/local/go/src/testing/testing.go:827 +0xbf created by testing.(*T).Run /usr/local/go/src/testing/testing.go:878 +0x353 exit status 2 FAIL _/usr<https://ci.centos.org/job/libvirt-go-check/systems=libvirt-freebsd-12/ws/> 0.532s Build step 'Execute shell' marked build as failure

See <https://ci.centos.org/job/libvirt-go-check/systems=libvirt-freebsd-12/161/display/redirect> ------------------------------------------ Started by upstream project "libvirt-go-check" build number 161 originally caused by: Started by upstream project "libvirt-go-build" build number 165 originally caused by: Started by upstream project "libvirt-build" build number 192 originally caused by: Started by an SCM change [EnvInject] - Loading node environment variables. Building remotely on libvirt-freebsd-12 (libvirt) in workspace <https://ci.centos.org/job/libvirt-go-check/systems=libvirt-freebsd-12/ws/> [libvirt-go] $ /bin/sh -xe /tmp/jenkins1661194655267435719.sh + export 'TEST_ARGS=-tags api' + go test -tags api Missing macro 'VIR_DOMAIN_JOB_MEMORY_POSTCOPY_REQS' --- FAIL: TestAPICoverage (0.98s) panic: Missing symbols found [recovered] panic: Missing symbols found goroutine 19 [running]: testing.tRunner.func1(0xc0000c6100) /usr/local/go/src/testing/testing.go:792 +0x387 panic(0x222980, 0x28f590) /usr/local/go/src/runtime/panic.go:513 +0x1b9 _/usr<https://ci.centos.org/job/libvirt-go-check/systems=libvirt-freebsd-12/ws/.TestAPICoverage(0xc0000c6100)> /usr<https://ci.centos.org/job/libvirt-go-check/systems=libvirt-freebsd-12/ws/api_test.go>:507 +0x554 testing.tRunner(0xc0000c6100, 0x270c50) /usr/local/go/src/testing/testing.go:827 +0xbf created by testing.(*T).Run /usr/local/go/src/testing/testing.go:878 +0x353 exit status 2 FAIL _/usr<https://ci.centos.org/job/libvirt-go-check/systems=libvirt-freebsd-12/ws/> 1.391s Build step 'Execute shell' marked build as failure

See <https://ci.centos.org/job/libvirt-go-check/systems=libvirt-freebsd-12/162/display/redirect> ------------------------------------------ Started by upstream project "libvirt-go-check" build number 162 originally caused by: Started by upstream project "libvirt-go-build" build number 166 originally caused by: Started by upstream project "libvirt-build" build number 193 originally caused by: Started by an SCM change Started by an SCM change Started by an SCM change Started by an SCM change [EnvInject] - Loading node environment variables. Building remotely on libvirt-freebsd-12 (libvirt) in workspace <https://ci.centos.org/job/libvirt-go-check/systems=libvirt-freebsd-12/ws/> [libvirt-go] $ /bin/sh -xe /tmp/jenkins7111764801213368061.sh + export 'TEST_ARGS=-tags api' + go test -tags api Missing macro 'VIR_DOMAIN_JOB_MEMORY_POSTCOPY_REQS' --- FAIL: TestAPICoverage (0.56s) panic: Missing symbols found [recovered] panic: Missing symbols found goroutine 5 [running]: testing.tRunner.func1(0xc0000aa100) /usr/local/go/src/testing/testing.go:792 +0x387 panic(0x222980, 0x28f590) /usr/local/go/src/runtime/panic.go:513 +0x1b9 _/usr<https://ci.centos.org/job/libvirt-go-check/systems=libvirt-freebsd-12/ws/.TestAPICoverage(0xc0000aa100)> /usr<https://ci.centos.org/job/libvirt-go-check/systems=libvirt-freebsd-12/ws/api_test.go>:507 +0x554 testing.tRunner(0xc0000aa100, 0x270c50) /usr/local/go/src/testing/testing.go:827 +0xbf created by testing.(*T).Run /usr/local/go/src/testing/testing.go:878 +0x353 exit status 2 FAIL _/usr<https://ci.centos.org/job/libvirt-go-check/systems=libvirt-freebsd-12/ws/> 1.030s Build step 'Execute shell' marked build as failure

See <https://ci.centos.org/job/libvirt-go-check/systems=libvirt-freebsd-12/163/display/redirect> ------------------------------------------ Started by upstream project "libvirt-go-check" build number 163 originally caused by: Started by upstream project "libvirt-go-build" build number 167 originally caused by: Started by upstream project "libvirt-build" build number 194 originally caused by: Started by an SCM change [EnvInject] - Loading node environment variables. Building remotely on libvirt-freebsd-12 (libvirt) in workspace <https://ci.centos.org/job/libvirt-go-check/systems=libvirt-freebsd-12/ws/> [libvirt-go] $ /bin/sh -xe /tmp/jenkins2247445474952102301.sh + export 'TEST_ARGS=-tags api' + go test -tags api Missing macro 'VIR_DOMAIN_JOB_MEMORY_POSTCOPY_REQS' --- FAIL: TestAPICoverage (0.32s) panic: Missing symbols found [recovered] panic: Missing symbols found goroutine 5 [running]: testing.tRunner.func1(0xc0000aa100) /usr/local/go/src/testing/testing.go:792 +0x387 panic(0x222980, 0x28f590) /usr/local/go/src/runtime/panic.go:513 +0x1b9 _/usr<https://ci.centos.org/job/libvirt-go-check/systems=libvirt-freebsd-12/ws/.TestAPICoverage(0xc0000aa100)> /usr<https://ci.centos.org/job/libvirt-go-check/systems=libvirt-freebsd-12/ws/api_test.go>:507 +0x554 testing.tRunner(0xc0000aa100, 0x270c50) /usr/local/go/src/testing/testing.go:827 +0xbf created by testing.(*T).Run /usr/local/go/src/testing/testing.go:878 +0x353 exit status 2 FAIL _/usr<https://ci.centos.org/job/libvirt-go-check/systems=libvirt-freebsd-12/ws/> 0.450s Build step 'Execute shell' marked build as failure

See <https://ci.centos.org/job/libvirt-go-check/systems=libvirt-freebsd-12/164/display/redirect> ------------------------------------------ Started by upstream project "libvirt-go-check" build number 164 originally caused by: Started by upstream project "libvirt-go-build" build number 168 originally caused by: Started by upstream project "libvirt-build" build number 195 originally caused by: Started by an SCM change [EnvInject] - Loading node environment variables. Building remotely on libvirt-freebsd-12 (libvirt) in workspace <https://ci.centos.org/job/libvirt-go-check/systems=libvirt-freebsd-12/ws/> [libvirt-go] $ /bin/sh -xe /tmp/jenkins6782975263784862752.sh + export 'TEST_ARGS=-tags api' + go test -tags api Missing macro 'VIR_DOMAIN_JOB_MEMORY_POSTCOPY_REQS' --- FAIL: TestAPICoverage (0.42s) panic: Missing symbols found [recovered] panic: Missing symbols found goroutine 19 [running]: testing.tRunner.func1(0xc0000c6100) /usr/local/go/src/testing/testing.go:792 +0x387 panic(0x222980, 0x28f590) /usr/local/go/src/runtime/panic.go:513 +0x1b9 _/usr<https://ci.centos.org/job/libvirt-go-check/systems=libvirt-freebsd-12/ws/.TestAPICoverage(0xc0000c6100)> /usr<https://ci.centos.org/job/libvirt-go-check/systems=libvirt-freebsd-12/ws/api_test.go>:507 +0x554 testing.tRunner(0xc0000c6100, 0x270c50) /usr/local/go/src/testing/testing.go:827 +0xbf created by testing.(*T).Run /usr/local/go/src/testing/testing.go:878 +0x353 exit status 2 FAIL _/usr<https://ci.centos.org/job/libvirt-go-check/systems=libvirt-freebsd-12/ws/> 0.555s Build step 'Execute shell' marked build as failure

participants (1)
-
ci@centos.org