libvirt-go-xml | Pipeline #183225103 has failed for master | d3a664b6

Your pipeline has failed. Project: libvirt-go-xml ( https://gitlab.com/libvirt/libvirt-go-xml ) Branch: master ( https://gitlab.com/libvirt/libvirt-go-xml/-/commits/master ) Commit: d3a664b6 ( https://gitlab.com/libvirt/libvirt-go-xml/-/commit/d3a664b6aa161169844880601... ) Commit Message: Add support for ISCSI initiator configuration ... Commit Author: Daniel Berrange ( https://gitlab.com/berrange ) Pipeline #183225103 ( https://gitlab.com/libvirt/libvirt-go-xml/-/pipelines/183225103 ) triggered by Jiri Denemark ( https://gitlab.com/jirkade ) had 5 failed builds. Job #709191903 ( https://gitlab.com/libvirt/libvirt-go-xml/-/jobs/709191903/raw ) Stage: build Name: go_1_12 Trace: [32;1mFetching changes...[0;m Initialized empty Git repository in /builds/libvirt/libvirt-go-xml/.git/ [32;1mCreated fresh repository.[0;m [32;1mChecking out d3a664b6 as master...[0;m [32;1mSkipping Git submodules setup[0;m section_end:1598633614:get_sources [0Ksection_start:1598633614:step_script [0K[0K[36;1mExecuting "step_script" stage of the job script[0;m [0;m[32;1m$ go test -timeout 10m -tags xmlroundtrip -v[0;m === RUN TestDomainSnapshot --- PASS: TestDomainSnapshot (0.00s) === RUN TestDomain --- PASS: TestDomain (0.01s) === RUN TestNetwork --- PASS: TestNetwork (0.00s) === RUN TestNodeDevice --- PASS: TestNodeDevice (0.00s) === RUN TestSecret --- PASS: TestSecret (0.00s) === RUN TestStoragePool --- PASS: TestStoragePool (0.00s) === RUN TestStorageVolume --- PASS: TestStorageVolume (0.00s) === RUN TestRoundTrip --- FAIL: TestRoundTrip (9.14s) xml_test.go:374: testdata/libvirt/tests/bhyvexml2argvdata/bhyvexml2argv-sound.xml: /domain[0]/devices[0]/sound[0]/audio[0]: element in expected XML missing in actual XML FAIL exit status 1 FAIL _/builds/libvirt/libvirt-go-xml 9.153s section_end:1598633630:step_script [0K[31;1mERROR: Job failed: exit code 1 [0;m Job #709191906 ( https://gitlab.com/libvirt/libvirt-go-xml/-/jobs/709191906/raw ) Stage: build Name: go_1_14 Trace: [32;1mFetching changes...[0;m Initialized empty Git repository in /builds/libvirt/libvirt-go-xml/.git/ [32;1mCreated fresh repository.[0;m [32;1mChecking out d3a664b6 as master...[0;m [32;1mSkipping Git submodules setup[0;m section_end:1598633613:get_sources [0Ksection_start:1598633613:step_script [0K[0K[36;1mExecuting "step_script" stage of the job script[0;m [0;m[32;1m$ go test -timeout 10m -tags xmlroundtrip -v[0;m === RUN TestDomainSnapshot --- PASS: TestDomainSnapshot (0.00s) === RUN TestDomain --- PASS: TestDomain (0.01s) === RUN TestNetwork --- PASS: TestNetwork (0.00s) === RUN TestNodeDevice --- PASS: TestNodeDevice (0.00s) === RUN TestSecret --- PASS: TestSecret (0.00s) === RUN TestStoragePool --- PASS: TestStoragePool (0.00s) === RUN TestStorageVolume --- PASS: TestStorageVolume (0.00s) === RUN TestRoundTrip xml_test.go:374: testdata/libvirt/tests/bhyvexml2argvdata/bhyvexml2argv-sound.xml: /domain[0]/devices[0]/sound[0]/audio[0]: element in expected XML missing in actual XML --- FAIL: TestRoundTrip (9.12s) FAIL exit status 1 FAIL _/builds/libvirt/libvirt-go-xml 9.136s section_end:1598633629:step_script [0K[31;1mERROR: Job failed: exit code 1 [0;m Job #709191905 ( https://gitlab.com/libvirt/libvirt-go-xml/-/jobs/709191905/raw ) Stage: build Name: go_1_13 Trace: [32;1mFetching changes...[0;m Initialized empty Git repository in /builds/libvirt/libvirt-go-xml/.git/ [32;1mCreated fresh repository.[0;m [32;1mChecking out d3a664b6 as master...[0;m [32;1mSkipping Git submodules setup[0;m section_end:1598633612:get_sources [0Ksection_start:1598633612:step_script [0K[0K[36;1mExecuting "step_script" stage of the job script[0;m [0;m[32;1m$ go test -timeout 10m -tags xmlroundtrip -v[0;m === RUN TestDomainSnapshot --- PASS: TestDomainSnapshot (0.00s) === RUN TestDomain --- PASS: TestDomain (0.01s) === RUN TestNetwork --- PASS: TestNetwork (0.00s) === RUN TestNodeDevice --- PASS: TestNodeDevice (0.00s) === RUN TestSecret --- PASS: TestSecret (0.00s) === RUN TestStoragePool --- PASS: TestStoragePool (0.00s) === RUN TestStorageVolume --- PASS: TestStorageVolume (0.00s) === RUN TestRoundTrip --- FAIL: TestRoundTrip (9.22s) xml_test.go:374: testdata/libvirt/tests/bhyvexml2argvdata/bhyvexml2argv-sound.xml: /domain[0]/devices[0]/sound[0]/audio[0]: element in expected XML missing in actual XML FAIL exit status 1 FAIL _/builds/libvirt/libvirt-go-xml 9.238s section_end:1598633628:step_script [0K[31;1mERROR: Job failed: exit code 1 [0;m Job #709191900 ( https://gitlab.com/libvirt/libvirt-go-xml/-/jobs/709191900/raw ) Stage: build Name: go_1_10 Trace: [32;1mFetching changes...[0;m Initialized empty Git repository in /builds/libvirt/libvirt-go-xml/.git/ [32;1mCreated fresh repository.[0;m [32;1mChecking out d3a664b6 as master...[0;m [32;1mSkipping Git submodules setup[0;m section_end:1598633613:get_sources [0Ksection_start:1598633613:step_script [0K[0K[36;1mExecuting "step_script" stage of the job script[0;m [0;m[32;1m$ go test -timeout 10m -tags xmlroundtrip -v[0;m === RUN TestDomainSnapshot --- PASS: TestDomainSnapshot (0.00s) === RUN TestDomain --- PASS: TestDomain (0.01s) === RUN TestNetwork --- PASS: TestNetwork (0.00s) === RUN TestNodeDevice --- PASS: TestNodeDevice (0.00s) === RUN TestSecret --- PASS: TestSecret (0.00s) === RUN TestStoragePool --- PASS: TestStoragePool (0.00s) === RUN TestStorageVolume --- PASS: TestStorageVolume (0.00s) === RUN TestRoundTrip --- FAIL: TestRoundTrip (9.07s) xml_test.go:374: testdata/libvirt/tests/bhyvexml2argvdata/bhyvexml2argv-sound.xml: /domain[0]/devices[0]/sound[0]/audio[0]: element in expected XML missing in actual XML FAIL exit status 1 FAIL _/builds/libvirt/libvirt-go-xml 9.083s section_end:1598633626:step_script [0K[31;1mERROR: Job failed: exit code 1 [0;m Job #709191902 ( https://gitlab.com/libvirt/libvirt-go-xml/-/jobs/709191902/raw ) Stage: build Name: go_1_11 Trace: [32;1mFetching changes...[0;m Initialized empty Git repository in /builds/libvirt/libvirt-go-xml/.git/ [32;1mCreated fresh repository.[0;m [32;1mChecking out d3a664b6 as master...[0;m [32;1mSkipping Git submodules setup[0;m section_end:1598633609:get_sources [0Ksection_start:1598633609:step_script [0K[0K[36;1mExecuting "step_script" stage of the job script[0;m [0;m[32;1m$ go test -timeout 10m -tags xmlroundtrip -v[0;m === RUN TestDomainSnapshot --- PASS: TestDomainSnapshot (0.00s) === RUN TestDomain --- PASS: TestDomain (0.01s) === RUN TestNetwork --- PASS: TestNetwork (0.00s) === RUN TestNodeDevice --- PASS: TestNodeDevice (0.00s) === RUN TestSecret --- PASS: TestSecret (0.00s) === RUN TestStoragePool --- PASS: TestStoragePool (0.00s) === RUN TestStorageVolume --- PASS: TestStorageVolume (0.00s) === RUN TestRoundTrip --- FAIL: TestRoundTrip (8.97s) xml_test.go:374: testdata/libvirt/tests/bhyvexml2argvdata/bhyvexml2argv-sound.xml: /domain[0]/devices[0]/sound[0]/audio[0]: element in expected XML missing in actual XML FAIL exit status 1 FAIL _/builds/libvirt/libvirt-go-xml 8.986s section_end:1598633624:step_script [0K[31;1mERROR: Job failed: exit code 1 [0;m -- You're receiving this email because of your account on gitlab.com.
participants (1)
-
GitLab