[Libvirt-ci] Build failed in Jenkins: libvirt-go-check » libvirt-freebsd-11 #257

See <https://ci.centos.org/job/libvirt-go-check/systems=libvirt-freebsd-11/257/display/redirect> ------------------------------------------ Started by upstream project "libvirt-go-check" build number 257 originally caused by: Started by upstream project "libvirt-go-build" build number 261 originally caused by: Started by upstream project "libvirt-build" build number 323 originally caused by: Started by an SCM change [EnvInject] - Loading node environment variables. Building remotely on libvirt-freebsd-11 (libvirt) in workspace <https://ci.centos.org/job/libvirt-go-check/systems=libvirt-freebsd-11/ws/> [libvirt-go] $ /bin/sh -xe /tmp/jenkins2802611758413248050.sh + export 'TEST_ARGS=-tags api' + go test -tags api Missing enum 'VIR_DOMAIN_SAVE_IMAGE_XML_SECURE' Missing enum 'VIR_DOMAIN_SNAPSHOT_XML_SECURE' --- FAIL: TestAPICoverage (0.95s) panic: Missing symbols found [recovered] panic: Missing symbols found goroutine 18 [running]: testing.tRunner.func1(0xc0000c8100) /usr/local/go/src/testing/testing.go:792 +0x387 panic(0x5cc620, 0x638e40) /usr/local/go/src/runtime/panic.go:513 +0x1b9 _/usr<https://ci.centos.org/job/libvirt-go-check/systems=libvirt-freebsd-11/ws/.TestAPICoverage(0xc0000c8100)> /usr<https://ci.centos.org/job/libvirt-go-check/systems=libvirt-freebsd-11/ws/api_test.go>:501 +0x554 testing.tRunner(0xc0000c8100, 0x61a460) /usr/local/go/src/testing/testing.go:827 +0xbf created by testing.(*T).Run /usr/local/go/src/testing/testing.go:878 +0x35c exit status 2 FAIL _/usr<https://ci.centos.org/job/libvirt-go-check/systems=libvirt-freebsd-11/ws/> 1.065s Build step 'Execute shell' marked build as failure

See <https://ci.centos.org/job/libvirt-go-check/systems=libvirt-freebsd-11/258/display/redirect> ------------------------------------------ Started by upstream project "libvirt-go-check" build number 258 originally caused by: Started by upstream project "libvirt-go-build" build number 262 originally caused by: Started by upstream project "libvirt-build" build number 324 originally caused by: Started by an SCM change [EnvInject] - Loading node environment variables. Building remotely on libvirt-freebsd-11 (libvirt) in workspace <https://ci.centos.org/job/libvirt-go-check/systems=libvirt-freebsd-11/ws/> [libvirt-go] $ /bin/sh -xe /tmp/jenkins3630946015782980356.sh + export 'TEST_ARGS=-tags api' + go test -tags api Missing enum 'VIR_DOMAIN_SAVE_IMAGE_XML_SECURE' Missing enum 'VIR_DOMAIN_SNAPSHOT_XML_SECURE' --- FAIL: TestAPICoverage (0.78s) panic: Missing symbols found [recovered] panic: Missing symbols found goroutine 20 [running]: testing.tRunner.func1(0xc0000c4100) /usr/local/go/src/testing/testing.go:792 +0x387 panic(0x5cc620, 0x638e40) /usr/local/go/src/runtime/panic.go:513 +0x1b9 _/usr<https://ci.centos.org/job/libvirt-go-check/systems=libvirt-freebsd-11/ws/.TestAPICoverage(0xc0000c4100)> /usr<https://ci.centos.org/job/libvirt-go-check/systems=libvirt-freebsd-11/ws/api_test.go>:501 +0x554 testing.tRunner(0xc0000c4100, 0x61a460) /usr/local/go/src/testing/testing.go:827 +0xbf created by testing.(*T).Run /usr/local/go/src/testing/testing.go:878 +0x35c exit status 2 FAIL _/usr<https://ci.centos.org/job/libvirt-go-check/systems=libvirt-freebsd-11/ws/> 1.393s Build step 'Execute shell' marked build as failure

See <https://ci.centos.org/job/libvirt-go-check/systems=libvirt-freebsd-11/259/display/redirect> ------------------------------------------ Started by upstream project "libvirt-go-check" build number 259 originally caused by: Started by upstream project "libvirt-go-build" build number 263 originally caused by: Started by upstream project "libvirt-build" build number 325 originally caused by: Started by an SCM change [EnvInject] - Loading node environment variables. Building remotely on libvirt-freebsd-11 (libvirt) in workspace <https://ci.centos.org/job/libvirt-go-check/systems=libvirt-freebsd-11/ws/> [libvirt-go] $ /bin/sh -xe /tmp/jenkins2685747035895224588.sh + export 'TEST_ARGS=-tags api' + go test -tags api Missing enum 'VIR_DOMAIN_SAVE_IMAGE_XML_SECURE' Missing enum 'VIR_DOMAIN_SNAPSHOT_XML_SECURE' --- FAIL: TestAPICoverage (1.05s) panic: Missing symbols found [recovered] panic: Missing symbols found goroutine 19 [running]: testing.tRunner.func1(0xc0000c4100) /usr/local/go/src/testing/testing.go:792 +0x387 panic(0x5cc620, 0x638e40) /usr/local/go/src/runtime/panic.go:513 +0x1b9 _/usr<https://ci.centos.org/job/libvirt-go-check/systems=libvirt-freebsd-11/ws/.TestAPICoverage(0xc0000c4100)> /usr<https://ci.centos.org/job/libvirt-go-check/systems=libvirt-freebsd-11/ws/api_test.go>:501 +0x554 testing.tRunner(0xc0000c4100, 0x61a460) /usr/local/go/src/testing/testing.go:827 +0xbf created by testing.(*T).Run /usr/local/go/src/testing/testing.go:878 +0x35c exit status 2 FAIL _/usr<https://ci.centos.org/job/libvirt-go-check/systems=libvirt-freebsd-11/ws/> 1.836s Build step 'Execute shell' marked build as failure

See <https://ci.centos.org/job/libvirt-go-check/systems=libvirt-freebsd-11/260/display/redirect> ------------------------------------------ Started by upstream project "libvirt-go-check" build number 260 originally caused by: Started by upstream project "libvirt-go-build" build number 264 originally caused by: Started by upstream project "libvirt-build" build number 326 originally caused by: Started by an SCM change Started by an SCM change Started by an SCM change Started by an SCM change Started by an SCM change [EnvInject] - Loading node environment variables. Building remotely on libvirt-freebsd-11 (libvirt) in workspace <https://ci.centos.org/job/libvirt-go-check/systems=libvirt-freebsd-11/ws/> [libvirt-go] $ /bin/sh -xe /tmp/jenkins6272438268926508157.sh + export 'TEST_ARGS=-tags api' + go test -tags api Missing enum 'VIR_DOMAIN_SAVE_IMAGE_XML_SECURE' Missing enum 'VIR_DOMAIN_SNAPSHOT_XML_SECURE' --- FAIL: TestAPICoverage (0.92s) panic: Missing symbols found [recovered] panic: Missing symbols found goroutine 19 [running]: testing.tRunner.func1(0xc0000c6100) /usr/local/go/src/testing/testing.go:792 +0x387 panic(0x5cc620, 0x638e40) /usr/local/go/src/runtime/panic.go:513 +0x1b9 _/usr<https://ci.centos.org/job/libvirt-go-check/systems=libvirt-freebsd-11/ws/.TestAPICoverage(0xc0000c6100)> /usr<https://ci.centos.org/job/libvirt-go-check/systems=libvirt-freebsd-11/ws/api_test.go>:501 +0x554 testing.tRunner(0xc0000c6100, 0x61a460) /usr/local/go/src/testing/testing.go:827 +0xbf created by testing.(*T).Run /usr/local/go/src/testing/testing.go:878 +0x35c exit status 2 FAIL _/usr<https://ci.centos.org/job/libvirt-go-check/systems=libvirt-freebsd-11/ws/> 1.669s Build step 'Execute shell' marked build as failure

See <https://ci.centos.org/job/libvirt-go-check/systems=libvirt-freebsd-11/261/display/redirect> ------------------------------------------ Started by upstream project "libvirt-go-check" build number 261 originally caused by: Started by upstream project "libvirt-go-build" build number 265 originally caused by: Started by upstream project "libvirt-build" build number 327 originally caused by: Started by an SCM change [EnvInject] - Loading node environment variables. Building remotely on libvirt-freebsd-11 (libvirt) in workspace <https://ci.centos.org/job/libvirt-go-check/systems=libvirt-freebsd-11/ws/> [libvirt-go] $ /bin/sh -xe /tmp/jenkins7699829350091838219.sh + export 'TEST_ARGS=-tags api' + go test -tags api Missing enum 'VIR_DOMAIN_SAVE_IMAGE_XML_SECURE' Missing enum 'VIR_DOMAIN_SNAPSHOT_XML_SECURE' --- FAIL: TestAPICoverage (0.46s) panic: Missing symbols found [recovered] panic: Missing symbols found goroutine 5 [running]: testing.tRunner.func1(0xc0000aa100) /usr/local/go/src/testing/testing.go:792 +0x387 panic(0x5cc620, 0x638e40) /usr/local/go/src/runtime/panic.go:513 +0x1b9 _/usr<https://ci.centos.org/job/libvirt-go-check/systems=libvirt-freebsd-11/ws/.TestAPICoverage(0xc0000aa100)> /usr<https://ci.centos.org/job/libvirt-go-check/systems=libvirt-freebsd-11/ws/api_test.go>:501 +0x554 testing.tRunner(0xc0000aa100, 0x61a460) /usr/local/go/src/testing/testing.go:827 +0xbf created by testing.(*T).Run /usr/local/go/src/testing/testing.go:878 +0x35c exit status 2 FAIL _/usr<https://ci.centos.org/job/libvirt-go-check/systems=libvirt-freebsd-11/ws/> 0.558s Build step 'Execute shell' marked build as failure

See <https://ci.centos.org/job/libvirt-go-check/systems=libvirt-freebsd-11/262/display/redirect> ------------------------------------------ Started by upstream project "libvirt-go-check" build number 262 originally caused by: Started by upstream project "libvirt-go-build" build number 266 originally caused by: Started by upstream project "libvirt-build" build number 328 originally caused by: Started by an SCM change Started by an SCM change Started by an SCM change Started by an SCM change [EnvInject] - Loading node environment variables. Building remotely on libvirt-freebsd-11 (libvirt) in workspace <https://ci.centos.org/job/libvirt-go-check/systems=libvirt-freebsd-11/ws/> [libvirt-go] $ /bin/sh -xe /tmp/jenkins7748292163472528036.sh + export 'TEST_ARGS=-tags api' + go test -tags api Missing enum 'VIR_DOMAIN_SAVE_IMAGE_XML_SECURE' Missing enum 'VIR_DOMAIN_SNAPSHOT_XML_SECURE' --- FAIL: TestAPICoverage (0.68s) panic: Missing symbols found [recovered] panic: Missing symbols found goroutine 19 [running]: testing.tRunner.func1(0xc0000c6100) /usr/local/go/src/testing/testing.go:792 +0x387 panic(0x5cc620, 0x638e40) /usr/local/go/src/runtime/panic.go:513 +0x1b9 _/usr<https://ci.centos.org/job/libvirt-go-check/systems=libvirt-freebsd-11/ws/.TestAPICoverage(0xc0000c6100)> /usr<https://ci.centos.org/job/libvirt-go-check/systems=libvirt-freebsd-11/ws/api_test.go>:501 +0x554 testing.tRunner(0xc0000c6100, 0x61a460) /usr/local/go/src/testing/testing.go:827 +0xbf created by testing.(*T).Run /usr/local/go/src/testing/testing.go:878 +0x35c exit status 2 FAIL _/usr<https://ci.centos.org/job/libvirt-go-check/systems=libvirt-freebsd-11/ws/> 1.090s Build step 'Execute shell' marked build as failure

See <https://ci.centos.org/job/libvirt-go-check/systems=libvirt-freebsd-11/263/display/redirect> ------------------------------------------ Started by upstream project "libvirt-go-check" build number 263 originally caused by: Started by upstream project "libvirt-go-build" build number 267 originally caused by: Started by upstream project "libvirt-build" build number 330 originally caused by: Started by an SCM change [EnvInject] - Loading node environment variables. Building remotely on libvirt-freebsd-11 (libvirt) in workspace <https://ci.centos.org/job/libvirt-go-check/systems=libvirt-freebsd-11/ws/> [libvirt-go] $ /bin/sh -xe /tmp/jenkins7979642921819335323.sh + export 'TEST_ARGS=-tags api' + go test -tags api Missing enum 'VIR_DOMAIN_SAVE_IMAGE_XML_SECURE' Missing enum 'VIR_DOMAIN_SNAPSHOT_XML_SECURE' --- FAIL: TestAPICoverage (0.74s) panic: Missing symbols found [recovered] panic: Missing symbols found goroutine 18 [running]: testing.tRunner.func1(0xc0000b6100) /usr/local/go/src/testing/testing.go:792 +0x387 panic(0x5cc620, 0x638e40) /usr/local/go/src/runtime/panic.go:513 +0x1b9 _/usr<https://ci.centos.org/job/libvirt-go-check/systems=libvirt-freebsd-11/ws/.TestAPICoverage(0xc0000b6100)> /usr<https://ci.centos.org/job/libvirt-go-check/systems=libvirt-freebsd-11/ws/api_test.go>:501 +0x554 testing.tRunner(0xc0000b6100, 0x61a460) /usr/local/go/src/testing/testing.go:827 +0xbf created by testing.(*T).Run /usr/local/go/src/testing/testing.go:878 +0x35c exit status 2 FAIL _/usr<https://ci.centos.org/job/libvirt-go-check/systems=libvirt-freebsd-11/ws/> 1.322s Build step 'Execute shell' marked build as failure

See <https://ci.centos.org/job/libvirt-go-check/systems=libvirt-freebsd-11/264/display/redirect> ------------------------------------------ Started by upstream project "libvirt-go-check" build number 264 originally caused by: Started by upstream project "libvirt-go-build" build number 268 originally caused by: Started by upstream project "libvirt-build" build number 331 originally caused by: Started by an SCM change Started by an SCM change Started by an SCM change [EnvInject] - Loading node environment variables. Building remotely on libvirt-freebsd-11 (libvirt) in workspace <https://ci.centos.org/job/libvirt-go-check/systems=libvirt-freebsd-11/ws/> [libvirt-go] $ /bin/sh -xe /tmp/jenkins8922980513561968503.sh + export 'TEST_ARGS=-tags api' + go test -tags api Missing enum 'VIR_DOMAIN_SAVE_IMAGE_XML_SECURE' Missing enum 'VIR_DOMAIN_SNAPSHOT_XML_SECURE' --- FAIL: TestAPICoverage (0.53s) panic: Missing symbols found [recovered] panic: Missing symbols found goroutine 5 [running]: testing.tRunner.func1(0xc0000aa100) /usr/local/go/src/testing/testing.go:792 +0x387 panic(0x5cc620, 0x638e40) /usr/local/go/src/runtime/panic.go:513 +0x1b9 _/usr<https://ci.centos.org/job/libvirt-go-check/systems=libvirt-freebsd-11/ws/.TestAPICoverage(0xc0000aa100)> /usr<https://ci.centos.org/job/libvirt-go-check/systems=libvirt-freebsd-11/ws/api_test.go>:501 +0x554 testing.tRunner(0xc0000aa100, 0x61a460) /usr/local/go/src/testing/testing.go:827 +0xbf created by testing.(*T).Run /usr/local/go/src/testing/testing.go:878 +0x35c exit status 2 FAIL _/usr<https://ci.centos.org/job/libvirt-go-check/systems=libvirt-freebsd-11/ws/> 0.970s Build step 'Execute shell' marked build as failure

See <https://ci.centos.org/job/libvirt-go-check/systems=libvirt-freebsd-11/265/display/redirect> ------------------------------------------ Started by upstream project "libvirt-go-check" build number 265 originally caused by: Started by upstream project "libvirt-go-build" build number 269 originally caused by: Started by upstream project "libvirt-build" build number 332 originally caused by: Started by an SCM change [EnvInject] - Loading node environment variables. Building remotely on libvirt-freebsd-11 (libvirt) in workspace <https://ci.centos.org/job/libvirt-go-check/systems=libvirt-freebsd-11/ws/> [libvirt-go] $ /bin/sh -xe /tmp/jenkins2972125341686857304.sh + export 'TEST_ARGS=-tags api' + go test -tags api Missing enum 'VIR_DOMAIN_SAVE_IMAGE_XML_SECURE' Missing enum 'VIR_DOMAIN_SNAPSHOT_XML_SECURE' --- FAIL: TestAPICoverage (0.49s) panic: Missing symbols found [recovered] panic: Missing symbols found goroutine 19 [running]: testing.tRunner.func1(0xc0000c6100) /usr/local/go/src/testing/testing.go:792 +0x387 panic(0x5cc620, 0x638e40) /usr/local/go/src/runtime/panic.go:513 +0x1b9 _/usr<https://ci.centos.org/job/libvirt-go-check/systems=libvirt-freebsd-11/ws/.TestAPICoverage(0xc0000c6100)> /usr<https://ci.centos.org/job/libvirt-go-check/systems=libvirt-freebsd-11/ws/api_test.go>:501 +0x554 testing.tRunner(0xc0000c6100, 0x61a460) /usr/local/go/src/testing/testing.go:827 +0xbf created by testing.(*T).Run /usr/local/go/src/testing/testing.go:878 +0x35c exit status 2 FAIL _/usr<https://ci.centos.org/job/libvirt-go-check/systems=libvirt-freebsd-11/ws/> 0.693s Build step 'Execute shell' marked build as failure

See <https://ci.centos.org/job/libvirt-go-check/systems=libvirt-freebsd-11/266/display/redirect> ------------------------------------------ Started by upstream project "libvirt-go-check" build number 266 originally caused by: Started by upstream project "libvirt-go-build" build number 270 originally caused by: Started by upstream project "libvirt-build" build number 333 originally caused by: Started by an SCM change [EnvInject] - Loading node environment variables. Building remotely on libvirt-freebsd-11 (libvirt) in workspace <https://ci.centos.org/job/libvirt-go-check/systems=libvirt-freebsd-11/ws/> [libvirt-go] $ /bin/sh -xe /tmp/jenkins4609547211077402917.sh + export 'TEST_ARGS=-tags api' + go test -tags api Missing enum 'VIR_DOMAIN_SAVE_IMAGE_XML_SECURE' Missing enum 'VIR_DOMAIN_SNAPSHOT_XML_SECURE' --- FAIL: TestAPICoverage (0.55s) panic: Missing symbols found [recovered] panic: Missing symbols found goroutine 19 [running]: testing.tRunner.func1(0xc0000c6100) /usr/local/go/src/testing/testing.go:792 +0x387 panic(0x5cc620, 0x638e40) /usr/local/go/src/runtime/panic.go:513 +0x1b9 _/usr<https://ci.centos.org/job/libvirt-go-check/systems=libvirt-freebsd-11/ws/.TestAPICoverage(0xc0000c6100)> /usr<https://ci.centos.org/job/libvirt-go-check/systems=libvirt-freebsd-11/ws/api_test.go>:501 +0x554 testing.tRunner(0xc0000c6100, 0x61a460) /usr/local/go/src/testing/testing.go:827 +0xbf created by testing.(*T).Run /usr/local/go/src/testing/testing.go:878 +0x35c exit status 2 FAIL _/usr<https://ci.centos.org/job/libvirt-go-check/systems=libvirt-freebsd-11/ws/> 0.880s Build step 'Execute shell' marked build as failure

See <https://ci.centos.org/job/libvirt-go-check/systems=libvirt-freebsd-11/267/display/redirect> ------------------------------------------ Started by upstream project "libvirt-go-check" build number 267 originally caused by: Started by upstream project "libvirt-go-build" build number 271 originally caused by: Started by upstream project "libvirt-build" build number 334 originally caused by: Started by an SCM change [EnvInject] - Loading node environment variables. Building remotely on libvirt-freebsd-11 (libvirt) in workspace <https://ci.centos.org/job/libvirt-go-check/systems=libvirt-freebsd-11/ws/> [libvirt-go] $ /bin/sh -xe /tmp/jenkins1382512191571754793.sh + export 'TEST_ARGS=-tags api' + go test -tags api Missing enum 'VIR_DOMAIN_SAVE_IMAGE_XML_SECURE' Missing enum 'VIR_DOMAIN_SNAPSHOT_XML_SECURE' --- FAIL: TestAPICoverage (0.63s) panic: Missing symbols found [recovered] panic: Missing symbols found goroutine 19 [running]: testing.tRunner.func1(0xc0000c6100) /usr/local/go/src/testing/testing.go:792 +0x387 panic(0x5cc620, 0x638e40) /usr/local/go/src/runtime/panic.go:513 +0x1b9 _/usr<https://ci.centos.org/job/libvirt-go-check/systems=libvirt-freebsd-11/ws/.TestAPICoverage(0xc0000c6100)> /usr<https://ci.centos.org/job/libvirt-go-check/systems=libvirt-freebsd-11/ws/api_test.go>:501 +0x554 testing.tRunner(0xc0000c6100, 0x61a460) /usr/local/go/src/testing/testing.go:827 +0xbf created by testing.(*T).Run /usr/local/go/src/testing/testing.go:878 +0x35c exit status 2 FAIL _/usr<https://ci.centos.org/job/libvirt-go-check/systems=libvirt-freebsd-11/ws/> 1.321s Build step 'Execute shell' marked build as failure

participants (1)
-
ci@centos.org