[Libvirt-ci] Build failed in Jenkins: libvirt-go-xml-check » libvirt-freebsd-12 #304

See <https://ci.centos.org/job/libvirt-go-xml-check/systems=libvirt-freebsd-12/304/display/redirect> ------------------------------------------ Started by upstream project "libvirt-go-xml-check" build number 304 originally caused by: Started by upstream project "libvirt-go-xml-build" build number 304 originally caused by: Started by upstream project "libvirt-build" build number 370 originally caused by: Started by an SCM change Started by an SCM change Started by an SCM change Started by an SCM change [EnvInject] - Loading node environment variables. Building remotely on libvirt-freebsd-12 (libvirt) in workspace <https://ci.centos.org/job/libvirt-go-xml-check/systems=libvirt-freebsd-12/ws/> [libvirt-go-xml] $ /bin/sh -xe /tmp/jenkins5416881705990434856.sh + export 'TEST_ARGS=-tags xmlroundtrip' + go test -tags xmlroundtrip --- FAIL: TestRoundTrip (7.01s) xml_test.go:400: testdata/libvirt/tests/qemuxml2argvdata/aarch64-virt-graphics.xml: /domain[0]/devices[0]/channel[0]/source[0]: element in expected XML missing in actual XML FAIL exit status 1 FAIL _/usr<https://ci.centos.org/job/libvirt-go-xml-check/systems=libvirt-freebsd-12/ws/> 7.121s Build step 'Execute shell' marked build as failure

See <https://ci.centos.org/job/libvirt-go-xml-check/systems=libvirt-freebsd-12/305/display/redirect> ------------------------------------------ Started by upstream project "libvirt-go-xml-check" build number 305 originally caused by: Started by upstream project "libvirt-go-xml-build" build number 305 originally caused by: Started by upstream project "libvirt-build" build number 371 originally caused by: Started by an SCM change [EnvInject] - Loading node environment variables. Building remotely on libvirt-freebsd-12 (libvirt) in workspace <https://ci.centos.org/job/libvirt-go-xml-check/systems=libvirt-freebsd-12/ws/> [libvirt-go-xml] $ /bin/sh -xe /tmp/jenkins2924187510108925671.sh + export 'TEST_ARGS=-tags xmlroundtrip' + go test -tags xmlroundtrip --- FAIL: TestRoundTrip (6.05s) xml_test.go:400: testdata/libvirt/tests/qemuxml2argvdata/aarch64-virt-graphics.xml: /domain[0]/devices[0]/channel[0]/source[0]: element in expected XML missing in actual XML FAIL exit status 1 FAIL _/usr<https://ci.centos.org/job/libvirt-go-xml-check/systems=libvirt-freebsd-12/ws/> 6.143s Build step 'Execute shell' marked build as failure

See <https://ci.centos.org/job/libvirt-go-xml-check/systems=libvirt-freebsd-12/306/display/redirect> ------------------------------------------ Started by upstream project "libvirt-go-xml-check" build number 306 originally caused by: Started by upstream project "libvirt-go-xml-build" build number 306 originally caused by: Started by upstream project "libvirt-build" build number 372 originally caused by: Started by an SCM change [EnvInject] - Loading node environment variables. Building remotely on libvirt-freebsd-12 (libvirt) in workspace <https://ci.centos.org/job/libvirt-go-xml-check/systems=libvirt-freebsd-12/ws/> [libvirt-go-xml] $ /bin/sh -xe /tmp/jenkins8184945970658123997.sh + export 'TEST_ARGS=-tags xmlroundtrip' + go test -tags xmlroundtrip --- FAIL: TestRoundTrip (23.20s) xml_test.go:400: testdata/libvirt/tests/qemuxml2argvdata/aarch64-virt-graphics.xml: /domain[0]/devices[0]/channel[0]/source[0]: element in expected XML missing in actual XML FAIL exit status 1 FAIL _/usr<https://ci.centos.org/job/libvirt-go-xml-check/systems=libvirt-freebsd-12/ws/> 23.297s Build step 'Execute shell' marked build as failure

See <https://ci.centos.org/job/libvirt-go-xml-check/systems=libvirt-freebsd-12/307/display/redirect> ------------------------------------------ Started by upstream project "libvirt-go-xml-check" build number 307 originally caused by: Started by upstream project "libvirt-go-xml-build" build number 307 originally caused by: Started by upstream project "libvirt-build" build number 373 originally caused by: Started by an SCM change [EnvInject] - Loading node environment variables. Building remotely on libvirt-freebsd-12 (libvirt) in workspace <https://ci.centos.org/job/libvirt-go-xml-check/systems=libvirt-freebsd-12/ws/> [libvirt-go-xml] $ /bin/sh -xe /tmp/jenkins2626804006181628222.sh + export 'TEST_ARGS=-tags xmlroundtrip' + go test -tags xmlroundtrip --- FAIL: TestRoundTrip (4.70s) xml_test.go:400: testdata/libvirt/tests/qemuxml2argvdata/aarch64-virt-graphics.xml: /domain[0]/devices[0]/channel[0]/source[0]: element in expected XML missing in actual XML FAIL exit status 1 FAIL _/usr<https://ci.centos.org/job/libvirt-go-xml-check/systems=libvirt-freebsd-12/ws/> 4.776s Build step 'Execute shell' marked build as failure

See <https://ci.centos.org/job/libvirt-go-xml-check/systems=libvirt-freebsd-12/308/display/redirect> ------------------------------------------ Started by upstream project "libvirt-go-xml-check" build number 308 originally caused by: Started by upstream project "libvirt-go-xml-build" build number 308 originally caused by: Started by upstream project "libvirt-build" build number 374 originally caused by: Started by an SCM change Started by an SCM change Started by an SCM change Started by an SCM change [EnvInject] - Loading node environment variables. Building remotely on libvirt-freebsd-12 (libvirt) in workspace <https://ci.centos.org/job/libvirt-go-xml-check/systems=libvirt-freebsd-12/ws/> [libvirt-go-xml] $ /bin/sh -xe /tmp/jenkins1749360393107949166.sh + export 'TEST_ARGS=-tags xmlroundtrip' + go test -tags xmlroundtrip --- FAIL: TestRoundTrip (10.33s) xml_test.go:400: testdata/libvirt/tests/qemuxml2argvdata/aarch64-os-firmware-efi.xml: /domain[0]/os[0]/@firmware: attribute 'efi' in expected XML missing in actual XML FAIL exit status 1 FAIL _/usr<https://ci.centos.org/job/libvirt-go-xml-check/systems=libvirt-freebsd-12/ws/> 10.432s Build step 'Execute shell' marked build as failure

See <https://ci.centos.org/job/libvirt-go-xml-check/systems=libvirt-freebsd-12/309/display/redirect> ------------------------------------------ Started by upstream project "libvirt-go-xml-check" build number 309 originally caused by: Started by upstream project "libvirt-go-xml-build" build number 309 originally caused by: Started by upstream project "libvirt-build" build number 375 originally caused by: Started by an SCM change Started by an SCM change Started by an SCM change Started by an SCM change Started by an SCM change Started by an SCM change [EnvInject] - Loading node environment variables. Building remotely on libvirt-freebsd-12 (libvirt) in workspace <https://ci.centos.org/job/libvirt-go-xml-check/systems=libvirt-freebsd-12/ws/> [libvirt-go-xml] $ /bin/sh -xe /tmp/jenkins5485201278376810856.sh + export 'TEST_ARGS=-tags xmlroundtrip' + go test -tags xmlroundtrip --- FAIL: TestRoundTrip (3.41s) xml_test.go:400: testdata/libvirt/tests/qemuxml2argvdata/aarch64-os-firmware-efi.xml: /domain[0]/os[0]/@firmware: attribute 'efi' in expected XML missing in actual XML FAIL exit status 1 FAIL _/usr<https://ci.centos.org/job/libvirt-go-xml-check/systems=libvirt-freebsd-12/ws/> 3.499s Build step 'Execute shell' marked build as failure

See <https://ci.centos.org/job/libvirt-go-xml-check/systems=libvirt-freebsd-12/310/display/redirect> ------------------------------------------ Started by upstream project "libvirt-go-xml-check" build number 310 originally caused by: Started by upstream project "libvirt-go-xml-build" build number 310 originally caused by: Started by an SCM change [EnvInject] - Loading node environment variables. Building remotely on libvirt-freebsd-12 (libvirt) in workspace <https://ci.centos.org/job/libvirt-go-xml-check/systems=libvirt-freebsd-12/ws/> [libvirt-go-xml] $ /bin/sh -xe /tmp/jenkins6060334998688275864.sh + export 'TEST_ARGS=-tags xmlroundtrip' + go test -tags xmlroundtrip --- FAIL: TestRoundTrip (6.64s) xml_test.go:400: testdata/libvirt/tests/qemuxml2argvdata/aarch64-virt-graphics.xml: /domain[0]/devices[0]/channel[0]/source[0]: element in expected XML missing in actual XML FAIL exit status 1 FAIL _/usr<https://ci.centos.org/job/libvirt-go-xml-check/systems=libvirt-freebsd-12/ws/> 6.693s Build step 'Execute shell' marked build as failure

See <https://ci.centos.org/job/libvirt-go-xml-check/systems=libvirt-freebsd-12/311/display/redirect> ------------------------------------------ Started by upstream project "libvirt-go-xml-check" build number 311 originally caused by: Started by upstream project "libvirt-go-xml-build" build number 311 originally caused by: Started by an SCM change [EnvInject] - Loading node environment variables. Building remotely on libvirt-freebsd-12 (libvirt) in workspace <https://ci.centos.org/job/libvirt-go-xml-check/systems=libvirt-freebsd-12/ws/> [libvirt-go-xml] $ /bin/sh -xe /tmp/jenkins6627320514568501930.sh + export 'TEST_ARGS=-tags xmlroundtrip' + go test -tags xmlroundtrip --- FAIL: TestRoundTrip (5.43s) xml_test.go:400: testdata/libvirt/tests/qemuxml2argvdata/aarch64-virt-graphics.xml: /domain[0]/devices[0]/channel[0]/source[0]: element in expected XML missing in actual XML FAIL exit status 1 FAIL _/usr<https://ci.centos.org/job/libvirt-go-xml-check/systems=libvirt-freebsd-12/ws/> 5.543s Build step 'Execute shell' marked build as failure

See <https://ci.centos.org/job/libvirt-go-xml-check/systems=libvirt-freebsd-12/312/display/redirect> ------------------------------------------ Started by upstream project "libvirt-go-xml-check" build number 312 originally caused by: Started by upstream project "libvirt-go-xml-build" build number 312 originally caused by: Started by upstream project "libvirt-build" build number 377 originally caused by: Started by an SCM change [EnvInject] - Loading node environment variables. Building remotely on libvirt-freebsd-12 (libvirt) in workspace <https://ci.centos.org/job/libvirt-go-xml-check/systems=libvirt-freebsd-12/ws/> [libvirt-go-xml] $ /bin/sh -xe /tmp/jenkins5696505471746285305.sh + export 'TEST_ARGS=-tags xmlroundtrip' + go test -tags xmlroundtrip --- FAIL: TestRoundTrip (3.28s) xml_test.go:400: testdata/libvirt/tests/qemuxml2argvdata/aarch64-virt-graphics.xml: /domain[0]/devices[0]/channel[0]/source[0]: element in expected XML missing in actual XML FAIL exit status 1 FAIL _/usr<https://ci.centos.org/job/libvirt-go-xml-check/systems=libvirt-freebsd-12/ws/> 3.333s Build step 'Execute shell' marked build as failure

participants (1)
-
ci@centos.org