[Libvirt-ci] Build failed in Jenkins: libvirt-go-master-check » libvirt-fedora-28 #1057

See <https://ci.centos.org/job/libvirt-go-master-check/systems=libvirt-fedora-28/1057/display/redirect> ------------------------------------------ Started by upstream project "libvirt-go-master-check" build number 1057 originally caused by: Started by upstream project "libvirt-go-master-build" build number 1068 originally caused by: Started by upstream project "libvirt-master-build" build number 1465 originally caused by: Started by an SCM change [EnvInject] - Loading node environment variables. Building remotely on libvirt-fedora-28 (libvirt) in workspace <https://ci.centos.org/job/libvirt-go-master-check/systems=libvirt-fedora-28/ws/> [libvirt-go-master] $ /bin/sh -xe /tmp/jenkins3513744002283803472.sh + export 'TEST_ARGS=-tags api' + TEST_ARGS='-tags api' + go test -tags api 2018-05-28 12:27:09.802+0000: 1445: info : libvirt version: 4.4.0 2018-05-28 12:27:09.802+0000: 1445: info : hostname: libvirt-fedora-28 2018-05-28 12:27:09.802+0000: 1445: warning : virEventRegisterImpl:245 : Ignoring attempt to replace registered event loop 2018-05-28 12:27:09.802+0000: 1445: warning : virEventRegisterImpl:245 : Ignoring attempt to replace registered event loop 2018-05-28 12:27:09.802+0000: 1445: warning : virEventRegisterImpl:245 : Ignoring attempt to replace registered event loop Missing function 'virDomainDetachDeviceAlias' --- FAIL: TestAPICoverage (1.21s) panic: Missing symbols found [recovered] panic: Missing symbols found goroutine 19 [running]: testing.tRunner.func1(0xc4200c80f0) /usr/lib/golang/src/testing/testing.go:742 +0x29d panic(0x5ad500, 0x611830) /usr/lib/golang/src/runtime/panic.go:502 +0x229 _<https://ci.centos.org/job/libvirt-go-master-check/systems=libvirt-fedora-28/ws/.TestAPICoverage(0xc4200c80f0)> <https://ci.centos.org/job/libvirt-go-master-check/systems=libvirt-fedora-28/ws/api_test.go>:504 +0x548 testing.tRunner(0xc4200c80f0, 0x5fc918) /usr/lib/golang/src/testing/testing.go:777 +0xd0 created by testing.(*T).Run /usr/lib/golang/src/testing/testing.go:824 +0x2e0 exit status 2 FAIL _<https://ci.centos.org/job/libvirt-go-master-check/systems=libvirt-fedora-28/ws/> 1.698s Build step 'Execute shell' marked build as failure

See <https://ci.centos.org/job/libvirt-go-master-check/systems=libvirt-fedora-28/1058/display/redirect> ------------------------------------------ Started by upstream project "libvirt-go-master-check" build number 1058 originally caused by: Started by upstream project "libvirt-go-master-build" build number 1069 originally caused by: Started by upstream project "libvirt-master-build" build number 1466 originally caused by: Started by an SCM change [EnvInject] - Loading node environment variables. Building remotely on libvirt-fedora-28 (libvirt) in workspace <https://ci.centos.org/job/libvirt-go-master-check/systems=libvirt-fedora-28/ws/> [libvirt-go-master] $ /bin/sh -xe /tmp/jenkins3453375422368681578.sh + export 'TEST_ARGS=-tags api' + TEST_ARGS='-tags api' + go test -tags api 2018-05-28 15:27:45.350+0000: 30057: info : libvirt version: 4.4.0 2018-05-28 15:27:45.350+0000: 30057: info : hostname: libvirt-fedora-28 2018-05-28 15:27:45.350+0000: 30057: warning : virEventRegisterImpl:245 : Ignoring attempt to replace registered event loop 2018-05-28 15:27:45.350+0000: 30057: warning : virEventRegisterImpl:245 : Ignoring attempt to replace registered event loop 2018-05-28 15:27:45.350+0000: 30057: warning : virEventRegisterImpl:245 : Ignoring attempt to replace registered event loop Missing function 'virConnectBaselineHypervisorCPU' Missing function 'virConnectCompareHypervisorCPU' Missing function 'virDomainDetachDeviceAlias' --- FAIL: TestAPICoverage (1.21s) panic: Missing symbols found [recovered] panic: Missing symbols found goroutine 5 [running]: testing.tRunner.func1(0xc4200aa0f0) /usr/lib/golang/src/testing/testing.go:742 +0x29d panic(0x5ad500, 0x611830) /usr/lib/golang/src/runtime/panic.go:502 +0x229 _<https://ci.centos.org/job/libvirt-go-master-check/systems=libvirt-fedora-28/ws/.TestAPICoverage(0xc4200aa0f0)> <https://ci.centos.org/job/libvirt-go-master-check/systems=libvirt-fedora-28/ws/api_test.go>:504 +0x548 testing.tRunner(0xc4200aa0f0, 0x5fc918) /usr/lib/golang/src/testing/testing.go:777 +0xd0 created by testing.(*T).Run /usr/lib/golang/src/testing/testing.go:824 +0x2e0 exit status 2 FAIL _<https://ci.centos.org/job/libvirt-go-master-check/systems=libvirt-fedora-28/ws/> 1.568s Build step 'Execute shell' marked build as failure

See <https://ci.centos.org/job/libvirt-go-master-check/systems=libvirt-fedora-28/1059/display/redirect> ------------------------------------------ Started by upstream project "libvirt-go-master-check" build number 1059 originally caused by: Started by upstream project "libvirt-go-master-build" build number 1070 originally caused by: Started by upstream project "libvirt-master-build" build number 1467 originally caused by: Started by an SCM change Started by an SCM change [EnvInject] - Loading node environment variables. Building remotely on libvirt-fedora-28 (libvirt) in workspace <https://ci.centos.org/job/libvirt-go-master-check/systems=libvirt-fedora-28/ws/> [libvirt-go-master] $ /bin/sh -xe /tmp/jenkins7590646689684264925.sh + export 'TEST_ARGS=-tags api' + TEST_ARGS='-tags api' + go test -tags api 2018-05-28 16:51:17.903+0000: 13671: info : libvirt version: 4.4.0 2018-05-28 16:51:17.903+0000: 13671: info : hostname: libvirt-fedora-28 2018-05-28 16:51:17.903+0000: 13671: warning : virEventRegisterImpl:245 : Ignoring attempt to replace registered event loop 2018-05-28 16:51:17.903+0000: 13671: warning : virEventRegisterImpl:245 : Ignoring attempt to replace registered event loop 2018-05-28 16:51:17.903+0000: 13671: warning : virEventRegisterImpl:245 : Ignoring attempt to replace registered event loop Missing function 'virConnectBaselineHypervisorCPU' Missing function 'virConnectCompareHypervisorCPU' Missing function 'virDomainDetachDeviceAlias' --- FAIL: TestAPICoverage (1.28s) panic: Missing symbols found [recovered] panic: Missing symbols found goroutine 19 [running]: testing.tRunner.func1(0xc4200c80f0) /usr/lib/golang/src/testing/testing.go:742 +0x29d panic(0x5ad500, 0x611830) /usr/lib/golang/src/runtime/panic.go:502 +0x229 _<https://ci.centos.org/job/libvirt-go-master-check/systems=libvirt-fedora-28/ws/.TestAPICoverage(0xc4200c80f0)> <https://ci.centos.org/job/libvirt-go-master-check/systems=libvirt-fedora-28/ws/api_test.go>:504 +0x548 testing.tRunner(0xc4200c80f0, 0x5fc918) /usr/lib/golang/src/testing/testing.go:777 +0xd0 created by testing.(*T).Run /usr/lib/golang/src/testing/testing.go:824 +0x2e0 exit status 2 FAIL _<https://ci.centos.org/job/libvirt-go-master-check/systems=libvirt-fedora-28/ws/> 1.593s Build step 'Execute shell' marked build as failure

See <https://ci.centos.org/job/libvirt-go-master-check/systems=libvirt-fedora-28/1060/display/redirect> ------------------------------------------ Started by upstream project "libvirt-go-master-check" build number 1060 originally caused by: Started by upstream project "libvirt-go-master-build" build number 1071 originally caused by: Started by upstream project "libvirt-master-build" build number 1468 originally caused by: Started by an SCM change [EnvInject] - Loading node environment variables. Building remotely on libvirt-fedora-28 (libvirt) in workspace <https://ci.centos.org/job/libvirt-go-master-check/systems=libvirt-fedora-28/ws/> [libvirt-go-master] $ /bin/sh -xe /tmp/jenkins6036263346022804464.sh + export 'TEST_ARGS=-tags api' + TEST_ARGS='-tags api' + go test -tags api 2018-05-29 09:48:39.927+0000: 16080: info : libvirt version: 4.4.0 2018-05-29 09:48:39.927+0000: 16080: info : hostname: libvirt-fedora-28 2018-05-29 09:48:39.927+0000: 16080: warning : virEventRegisterImpl:245 : Ignoring attempt to replace registered event loop 2018-05-29 09:48:39.927+0000: 16080: warning : virEventRegisterImpl:245 : Ignoring attempt to replace registered event loop 2018-05-29 09:48:39.927+0000: 16080: warning : virEventRegisterImpl:245 : Ignoring attempt to replace registered event loop Missing function 'virConnectBaselineHypervisorCPU' Missing function 'virConnectCompareHypervisorCPU' Missing function 'virDomainDetachDeviceAlias' --- FAIL: TestAPICoverage (0.87s) panic: Missing symbols found [recovered] panic: Missing symbols found goroutine 19 [running]: testing.tRunner.func1(0xc4200c80f0) /usr/lib/golang/src/testing/testing.go:742 +0x29d panic(0x5ad500, 0x611830) /usr/lib/golang/src/runtime/panic.go:502 +0x229 _<https://ci.centos.org/job/libvirt-go-master-check/systems=libvirt-fedora-28/ws/.TestAPICoverage(0xc4200c80f0)> <https://ci.centos.org/job/libvirt-go-master-check/systems=libvirt-fedora-28/ws/api_test.go>:504 +0x548 testing.tRunner(0xc4200c80f0, 0x5fc918) /usr/lib/golang/src/testing/testing.go:777 +0xd0 created by testing.(*T).Run /usr/lib/golang/src/testing/testing.go:824 +0x2e0 exit status 2 FAIL _<https://ci.centos.org/job/libvirt-go-master-check/systems=libvirt-fedora-28/ws/> 1.036s Build step 'Execute shell' marked build as failure

See <https://ci.centos.org/job/libvirt-go-master-check/systems=libvirt-fedora-28/1061/display/redirect> ------------------------------------------ Started by upstream project "libvirt-go-master-check" build number 1061 originally caused by: Started by upstream project "libvirt-go-master-build" build number 1072 originally caused by: Started by upstream project "libvirt-master-build" build number 1469 originally caused by: Started by an SCM change [EnvInject] - Loading node environment variables. Building remotely on libvirt-fedora-28 (libvirt) in workspace <https://ci.centos.org/job/libvirt-go-master-check/systems=libvirt-fedora-28/ws/> [libvirt-go-master] $ /bin/sh -xe /tmp/jenkins8261936645323186280.sh + export 'TEST_ARGS=-tags api' + TEST_ARGS='-tags api' + go test -tags api 2018-05-29 13:29:51.337+0000: 1167: info : libvirt version: 4.4.0 2018-05-29 13:29:51.337+0000: 1167: info : hostname: libvirt-fedora-28 2018-05-29 13:29:51.337+0000: 1167: warning : virEventRegisterImpl:245 : Ignoring attempt to replace registered event loop 2018-05-29 13:29:51.338+0000: 1167: warning : virEventRegisterImpl:245 : Ignoring attempt to replace registered event loop 2018-05-29 13:29:51.338+0000: 1167: warning : virEventRegisterImpl:245 : Ignoring attempt to replace registered event loop Missing function 'virConnectBaselineHypervisorCPU' Missing function 'virConnectCompareHypervisorCPU' Missing function 'virDomainDetachDeviceAlias' --- FAIL: TestAPICoverage (0.67s) panic: Missing symbols found [recovered] panic: Missing symbols found goroutine 4 [running]: testing.tRunner.func1(0xc4200ca0f0) /usr/lib/golang/src/testing/testing.go:742 +0x29d panic(0x5ad500, 0x611830) /usr/lib/golang/src/runtime/panic.go:502 +0x229 _<https://ci.centos.org/job/libvirt-go-master-check/systems=libvirt-fedora-28/ws/.TestAPICoverage(0xc4200ca0f0)> <https://ci.centos.org/job/libvirt-go-master-check/systems=libvirt-fedora-28/ws/api_test.go>:504 +0x548 testing.tRunner(0xc4200ca0f0, 0x5fc918) /usr/lib/golang/src/testing/testing.go:777 +0xd0 created by testing.(*T).Run /usr/lib/golang/src/testing/testing.go:824 +0x2e0 exit status 2 FAIL _<https://ci.centos.org/job/libvirt-go-master-check/systems=libvirt-fedora-28/ws/> 0.897s Build step 'Execute shell' marked build as failure

See <https://ci.centos.org/job/libvirt-go-master-check/systems=libvirt-fedora-28/1062/display/redirect> ------------------------------------------ Started by upstream project "libvirt-go-master-check" build number 1062 originally caused by: Started by upstream project "libvirt-go-master-build" build number 1073 originally caused by: Started by upstream project "libvirt-master-build" build number 1470 originally caused by: Started by an SCM change [EnvInject] - Loading node environment variables. Building remotely on libvirt-fedora-28 (libvirt) in workspace <https://ci.centos.org/job/libvirt-go-master-check/systems=libvirt-fedora-28/ws/> [libvirt-go-master] $ /bin/sh -xe /tmp/jenkins7612281424866390278.sh + export 'TEST_ARGS=-tags api' + TEST_ARGS='-tags api' + go test -tags api 2018-05-29 15:13:22.618+0000: 28146: info : libvirt version: 4.4.0 2018-05-29 15:13:22.618+0000: 28146: info : hostname: libvirt-fedora-28 2018-05-29 15:13:22.618+0000: 28146: warning : virEventRegisterImpl:245 : Ignoring attempt to replace registered event loop 2018-05-29 15:13:22.618+0000: 28146: warning : virEventRegisterImpl:245 : Ignoring attempt to replace registered event loop 2018-05-29 15:13:22.618+0000: 28146: warning : virEventRegisterImpl:245 : Ignoring attempt to replace registered event loop Missing function 'virConnectBaselineHypervisorCPU' Missing function 'virConnectCompareHypervisorCPU' Missing function 'virDomainDetachDeviceAlias' --- FAIL: TestAPICoverage (0.18s) panic: Missing symbols found [recovered] panic: Missing symbols found goroutine 19 [running]: testing.tRunner.func1(0xc4200c80f0) /usr/lib/golang/src/testing/testing.go:742 +0x29d panic(0x5ad500, 0x611830) /usr/lib/golang/src/runtime/panic.go:502 +0x229 _<https://ci.centos.org/job/libvirt-go-master-check/systems=libvirt-fedora-28/ws/.TestAPICoverage(0xc4200c80f0)> <https://ci.centos.org/job/libvirt-go-master-check/systems=libvirt-fedora-28/ws/api_test.go>:504 +0x548 testing.tRunner(0xc4200c80f0, 0x5fc918) /usr/lib/golang/src/testing/testing.go:777 +0xd0 created by testing.(*T).Run /usr/lib/golang/src/testing/testing.go:824 +0x2e0 exit status 2 FAIL _<https://ci.centos.org/job/libvirt-go-master-check/systems=libvirt-fedora-28/ws/> 0.277s Build step 'Execute shell' marked build as failure

See <https://ci.centos.org/job/libvirt-go-master-check/systems=libvirt-fedora-28/1063/display/redirect> ------------------------------------------ Started by upstream project "libvirt-go-master-check" build number 1063 originally caused by: Started by upstream project "libvirt-go-master-build" build number 1074 originally caused by: Started by upstream project "libvirt-master-build" build number 1471 originally caused by: Started by an SCM change Started by an SCM change [EnvInject] - Loading node environment variables. Building remotely on libvirt-fedora-28 (libvirt) in workspace <https://ci.centos.org/job/libvirt-go-master-check/systems=libvirt-fedora-28/ws/> [libvirt-go-master] $ /bin/sh -xe /tmp/jenkins5161367012404903373.sh + export 'TEST_ARGS=-tags api' + TEST_ARGS='-tags api' + go test -tags api 2018-05-29 16:10:27.380+0000: 26915: info : libvirt version: 4.4.0 2018-05-29 16:10:27.380+0000: 26915: info : hostname: libvirt-fedora-28 2018-05-29 16:10:27.380+0000: 26915: warning : virEventRegisterImpl:245 : Ignoring attempt to replace registered event loop 2018-05-29 16:10:27.381+0000: 26915: warning : virEventRegisterImpl:245 : Ignoring attempt to replace registered event loop 2018-05-29 16:10:27.381+0000: 26915: warning : virEventRegisterImpl:245 : Ignoring attempt to replace registered event loop Missing function 'virConnectBaselineHypervisorCPU' Missing function 'virConnectCompareHypervisorCPU' Missing function 'virDomainDetachDeviceAlias' --- FAIL: TestAPICoverage (1.08s) panic: Missing symbols found [recovered] panic: Missing symbols found goroutine 19 [running]: testing.tRunner.func1(0xc4200c80f0) /usr/lib/golang/src/testing/testing.go:742 +0x29d panic(0x5ad500, 0x611830) /usr/lib/golang/src/runtime/panic.go:502 +0x229 _<https://ci.centos.org/job/libvirt-go-master-check/systems=libvirt-fedora-28/ws/.TestAPICoverage(0xc4200c80f0)> <https://ci.centos.org/job/libvirt-go-master-check/systems=libvirt-fedora-28/ws/api_test.go>:504 +0x548 testing.tRunner(0xc4200c80f0, 0x5fc918) /usr/lib/golang/src/testing/testing.go:777 +0xd0 created by testing.(*T).Run /usr/lib/golang/src/testing/testing.go:824 +0x2e0 exit status 2 FAIL _<https://ci.centos.org/job/libvirt-go-master-check/systems=libvirt-fedora-28/ws/> 1.366s Build step 'Execute shell' marked build as failure

See <https://ci.centos.org/job/libvirt-go-master-check/systems=libvirt-fedora-28/1064/display/redirect> ------------------------------------------ Started by upstream project "libvirt-go-master-check" build number 1064 originally caused by: Started by upstream project "libvirt-go-master-build" build number 1075 originally caused by: Started by upstream project "libvirt-master-build" build number 1472 originally caused by: Started by an SCM change [EnvInject] - Loading node environment variables. Building remotely on libvirt-fedora-28 (libvirt) in workspace <https://ci.centos.org/job/libvirt-go-master-check/systems=libvirt-fedora-28/ws/> [libvirt-go-master] $ /bin/sh -xe /tmp/jenkins718593757756977876.sh + export 'TEST_ARGS=-tags api' + TEST_ARGS='-tags api' + go test -tags api 2018-05-30 10:19:59.069+0000: 21815: info : libvirt version: 4.4.0 2018-05-30 10:19:59.069+0000: 21815: info : hostname: libvirt-fedora-28 2018-05-30 10:19:59.069+0000: 21815: warning : virEventRegisterImpl:245 : Ignoring attempt to replace registered event loop 2018-05-30 10:19:59.072+0000: 21815: warning : virEventRegisterImpl:245 : Ignoring attempt to replace registered event loop 2018-05-30 10:19:59.073+0000: 21815: warning : virEventRegisterImpl:245 : Ignoring attempt to replace registered event loop Missing function 'virConnectBaselineHypervisorCPU' Missing function 'virConnectCompareHypervisorCPU' Missing function 'virDomainDetachDeviceAlias' --- FAIL: TestAPICoverage (0.47s) panic: Missing symbols found [recovered] panic: Missing symbols found goroutine 5 [running]: testing.tRunner.func1(0xc4200aa0f0) /usr/lib/golang/src/testing/testing.go:742 +0x29d panic(0x5ad500, 0x611830) /usr/lib/golang/src/runtime/panic.go:502 +0x229 _<https://ci.centos.org/job/libvirt-go-master-check/systems=libvirt-fedora-28/ws/.TestAPICoverage(0xc4200aa0f0)> <https://ci.centos.org/job/libvirt-go-master-check/systems=libvirt-fedora-28/ws/api_test.go>:504 +0x548 testing.tRunner(0xc4200aa0f0, 0x5fc918) /usr/lib/golang/src/testing/testing.go:777 +0xd0 created by testing.(*T).Run /usr/lib/golang/src/testing/testing.go:824 +0x2e0 exit status 2 FAIL _<https://ci.centos.org/job/libvirt-go-master-check/systems=libvirt-fedora-28/ws/> 0.608s Build step 'Execute shell' marked build as failure

See <https://ci.centos.org/job/libvirt-go-master-check/systems=libvirt-fedora-28/1065/display/redirect> ------------------------------------------ Started by upstream project "libvirt-go-master-check" build number 1065 originally caused by: Started by upstream project "libvirt-go-master-build" build number 1076 originally caused by: Started by upstream project "libvirt-master-build" build number 1473 originally caused by: Started by an SCM change [EnvInject] - Loading node environment variables. Building remotely on libvirt-fedora-28 (libvirt) in workspace <https://ci.centos.org/job/libvirt-go-master-check/systems=libvirt-fedora-28/ws/> [libvirt-go-master] $ /bin/sh -xe /tmp/jenkins598606902565604175.sh + export 'TEST_ARGS=-tags api' + TEST_ARGS='-tags api' + go test -tags api 2018-05-30 14:50:58.472+0000: 29476: info : libvirt version: 4.4.0 2018-05-30 14:50:58.472+0000: 29476: info : hostname: libvirt-fedora-28 2018-05-30 14:50:58.472+0000: 29476: warning : virEventRegisterImpl:245 : Ignoring attempt to replace registered event loop 2018-05-30 14:50:58.472+0000: 29476: warning : virEventRegisterImpl:245 : Ignoring attempt to replace registered event loop 2018-05-30 14:50:58.472+0000: 29476: warning : virEventRegisterImpl:245 : Ignoring attempt to replace registered event loop Missing function 'virConnectBaselineHypervisorCPU' Missing function 'virConnectCompareHypervisorCPU' Missing function 'virDomainDetachDeviceAlias' --- FAIL: TestAPICoverage (0.57s) panic: Missing symbols found [recovered] panic: Missing symbols found goroutine 19 [running]: testing.tRunner.func1(0xc4200c80f0) /usr/lib/golang/src/testing/testing.go:742 +0x29d panic(0x5ad500, 0x611830) /usr/lib/golang/src/runtime/panic.go:502 +0x229 _<https://ci.centos.org/job/libvirt-go-master-check/systems=libvirt-fedora-28/ws/.TestAPICoverage(0xc4200c80f0)> <https://ci.centos.org/job/libvirt-go-master-check/systems=libvirt-fedora-28/ws/api_test.go>:504 +0x548 testing.tRunner(0xc4200c80f0, 0x5fc918) /usr/lib/golang/src/testing/testing.go:777 +0xd0 created by testing.(*T).Run /usr/lib/golang/src/testing/testing.go:824 +0x2e0 exit status 2 FAIL _<https://ci.centos.org/job/libvirt-go-master-check/systems=libvirt-fedora-28/ws/> 0.672s Build step 'Execute shell' marked build as failure

See <https://ci.centos.org/job/libvirt-go-master-check/systems=libvirt-fedora-28/1066/display/redirect> ------------------------------------------ Started by upstream project "libvirt-go-master-check" build number 1066 originally caused by: Started by upstream project "libvirt-go-master-build" build number 1077 originally caused by: Started by upstream project "libvirt-master-build" build number 1474 originally caused by: Started by an SCM change Started by an SCM change Started by an SCM change [EnvInject] - Loading node environment variables. Building remotely on libvirt-fedora-28 (libvirt) in workspace <https://ci.centos.org/job/libvirt-go-master-check/systems=libvirt-fedora-28/ws/> [libvirt-go-master] $ /bin/sh -xe /tmp/jenkins2704784380485863080.sh + export 'TEST_ARGS=-tags api' + TEST_ARGS='-tags api' + go test -tags api 2018-05-30 15:57:48.046+0000: 8234: info : libvirt version: 4.4.0 2018-05-30 15:57:48.046+0000: 8234: info : hostname: libvirt-fedora-28 2018-05-30 15:57:48.046+0000: 8234: warning : virEventRegisterImpl:245 : Ignoring attempt to replace registered event loop 2018-05-30 15:57:48.047+0000: 8234: warning : virEventRegisterImpl:245 : Ignoring attempt to replace registered event loop 2018-05-30 15:57:48.047+0000: 8234: warning : virEventRegisterImpl:245 : Ignoring attempt to replace registered event loop Missing function 'virConnectBaselineHypervisorCPU' Missing function 'virConnectCompareHypervisorCPU' Missing function 'virDomainDetachDeviceAlias' --- FAIL: TestAPICoverage (0.48s) panic: Missing symbols found [recovered] panic: Missing symbols found goroutine 19 [running]: testing.tRunner.func1(0xc4200c80f0) /usr/lib/golang/src/testing/testing.go:742 +0x29d panic(0x5ad500, 0x611830) /usr/lib/golang/src/runtime/panic.go:502 +0x229 _<https://ci.centos.org/job/libvirt-go-master-check/systems=libvirt-fedora-28/ws/.TestAPICoverage(0xc4200c80f0)> <https://ci.centos.org/job/libvirt-go-master-check/systems=libvirt-fedora-28/ws/api_test.go>:504 +0x548 testing.tRunner(0xc4200c80f0, 0x5fc918) /usr/lib/golang/src/testing/testing.go:777 +0xd0 created by testing.(*T).Run /usr/lib/golang/src/testing/testing.go:824 +0x2e0 exit status 2 FAIL _<https://ci.centos.org/job/libvirt-go-master-check/systems=libvirt-fedora-28/ws/> 0.679s Build step 'Execute shell' marked build as failure

See <https://ci.centos.org/job/libvirt-go-master-check/systems=libvirt-fedora-28/1067/display/redirect> ------------------------------------------ Started by upstream project "libvirt-go-master-check" build number 1067 originally caused by: Started by upstream project "libvirt-go-master-build" build number 1078 originally caused by: Started by upstream project "libvirt-master-build" build number 1475 originally caused by: Started by an SCM change [EnvInject] - Loading node environment variables. Building remotely on libvirt-fedora-28 (libvirt) in workspace <https://ci.centos.org/job/libvirt-go-master-check/systems=libvirt-fedora-28/ws/> [libvirt-go-master] $ /bin/sh -xe /tmp/jenkins8776372929188070044.sh + export 'TEST_ARGS=-tags api' + TEST_ARGS='-tags api' + go test -tags api 2018-05-31 08:27:56.466+0000: 18294: info : libvirt version: 4.4.0 2018-05-31 08:27:56.466+0000: 18294: info : hostname: libvirt-fedora-28 2018-05-31 08:27:56.466+0000: 18294: warning : virEventRegisterImpl:245 : Ignoring attempt to replace registered event loop 2018-05-31 08:27:56.466+0000: 18294: warning : virEventRegisterImpl:245 : Ignoring attempt to replace registered event loop 2018-05-31 08:27:56.466+0000: 18294: warning : virEventRegisterImpl:245 : Ignoring attempt to replace registered event loop Missing function 'virConnectBaselineHypervisorCPU' Missing function 'virConnectCompareHypervisorCPU' Missing function 'virDomainDetachDeviceAlias' --- FAIL: TestAPICoverage (0.56s) panic: Missing symbols found [recovered] panic: Missing symbols found goroutine 5 [running]: testing.tRunner.func1(0xc4200aa0f0) /usr/lib/golang/src/testing/testing.go:742 +0x29d panic(0x5ad500, 0x611830) /usr/lib/golang/src/runtime/panic.go:502 +0x229 _<https://ci.centos.org/job/libvirt-go-master-check/systems=libvirt-fedora-28/ws/.TestAPICoverage(0xc4200aa0f0)> <https://ci.centos.org/job/libvirt-go-master-check/systems=libvirt-fedora-28/ws/api_test.go>:504 +0x548 testing.tRunner(0xc4200aa0f0, 0x5fc918) /usr/lib/golang/src/testing/testing.go:777 +0xd0 created by testing.(*T).Run /usr/lib/golang/src/testing/testing.go:824 +0x2e0 exit status 2 FAIL _<https://ci.centos.org/job/libvirt-go-master-check/systems=libvirt-fedora-28/ws/> 0.624s Build step 'Execute shell' marked build as failure

See <https://ci.centos.org/job/libvirt-go-master-check/systems=libvirt-fedora-28/1068/display/redirect> ------------------------------------------ Started by upstream project "libvirt-go-master-check" build number 1068 originally caused by: Started by upstream project "libvirt-go-master-build" build number 1079 originally caused by: Started by upstream project "libvirt-master-build" build number 1476 originally caused by: Started by an SCM change [EnvInject] - Loading node environment variables. Building remotely on libvirt-fedora-28 (libvirt) in workspace <https://ci.centos.org/job/libvirt-go-master-check/systems=libvirt-fedora-28/ws/> [libvirt-go-master] $ /bin/sh -xe /tmp/jenkins165344845465251725.sh + export 'TEST_ARGS=-tags api' + TEST_ARGS='-tags api' + go test -tags api 2018-05-31 10:29:38.495+0000: 29079: info : libvirt version: 4.4.0 2018-05-31 10:29:38.495+0000: 29079: info : hostname: libvirt-fedora-28 2018-05-31 10:29:38.495+0000: 29079: warning : virEventRegisterImpl:245 : Ignoring attempt to replace registered event loop 2018-05-31 10:29:38.496+0000: 29079: warning : virEventRegisterImpl:245 : Ignoring attempt to replace registered event loop 2018-05-31 10:29:38.496+0000: 29079: warning : virEventRegisterImpl:245 : Ignoring attempt to replace registered event loop Missing function 'virConnectBaselineHypervisorCPU' Missing function 'virConnectCompareHypervisorCPU' Missing function 'virDomainDetachDeviceAlias' --- FAIL: TestAPICoverage (0.37s) panic: Missing symbols found [recovered] panic: Missing symbols found goroutine 19 [running]: testing.tRunner.func1(0xc4200c80f0) /usr/lib/golang/src/testing/testing.go:742 +0x29d panic(0x5ad500, 0x611830) /usr/lib/golang/src/runtime/panic.go:502 +0x229 _<https://ci.centos.org/job/libvirt-go-master-check/systems=libvirt-fedora-28/ws/.TestAPICoverage(0xc4200c80f0)> <https://ci.centos.org/job/libvirt-go-master-check/systems=libvirt-fedora-28/ws/api_test.go>:504 +0x548 testing.tRunner(0xc4200c80f0, 0x5fc918) /usr/lib/golang/src/testing/testing.go:777 +0xd0 created by testing.(*T).Run /usr/lib/golang/src/testing/testing.go:824 +0x2e0 exit status 2 FAIL _<https://ci.centos.org/job/libvirt-go-master-check/systems=libvirt-fedora-28/ws/> 0.540s Build step 'Execute shell' marked build as failure

See <https://ci.centos.org/job/libvirt-go-master-check/systems=libvirt-fedora-28/1069/display/redirect> ------------------------------------------ Started by upstream project "libvirt-go-master-check" build number 1069 originally caused by: Started by upstream project "libvirt-go-master-build" build number 1080 originally caused by: Started by upstream project "libvirt-master-build" build number 1477 originally caused by: Started by an SCM change Started by an SCM change Started by an SCM change [EnvInject] - Loading node environment variables. Building remotely on libvirt-fedora-28 (libvirt) in workspace <https://ci.centos.org/job/libvirt-go-master-check/systems=libvirt-fedora-28/ws/> [libvirt-go-master] $ /bin/sh -xe /tmp/jenkins6256346966481782716.sh + export 'TEST_ARGS=-tags api' + TEST_ARGS='-tags api' + go test -tags api 2018-05-31 11:49:12.587+0000: 8103: info : libvirt version: 4.4.0 2018-05-31 11:49:12.587+0000: 8103: info : hostname: libvirt-fedora-28 2018-05-31 11:49:12.587+0000: 8103: warning : virEventRegisterImpl:245 : Ignoring attempt to replace registered event loop 2018-05-31 11:49:12.587+0000: 8103: warning : virEventRegisterImpl:245 : Ignoring attempt to replace registered event loop 2018-05-31 11:49:12.587+0000: 8103: warning : virEventRegisterImpl:245 : Ignoring attempt to replace registered event loop Missing function 'virConnectBaselineHypervisorCPU' Missing function 'virConnectCompareHypervisorCPU' Missing function 'virDomainDetachDeviceAlias' --- FAIL: TestAPICoverage (0.52s) panic: Missing symbols found [recovered] panic: Missing symbols found goroutine 5 [running]: testing.tRunner.func1(0xc4200b20f0) /usr/lib/golang/src/testing/testing.go:742 +0x29d panic(0x5ad500, 0x611830) /usr/lib/golang/src/runtime/panic.go:502 +0x229 _<https://ci.centos.org/job/libvirt-go-master-check/systems=libvirt-fedora-28/ws/.TestAPICoverage(0xc4200b20f0)> <https://ci.centos.org/job/libvirt-go-master-check/systems=libvirt-fedora-28/ws/api_test.go>:504 +0x548 testing.tRunner(0xc4200b20f0, 0x5fc918) /usr/lib/golang/src/testing/testing.go:777 +0xd0 created by testing.(*T).Run /usr/lib/golang/src/testing/testing.go:824 +0x2e0 exit status 2 FAIL _<https://ci.centos.org/job/libvirt-go-master-check/systems=libvirt-fedora-28/ws/> 0.684s Build step 'Execute shell' marked build as failure

See <https://ci.centos.org/job/libvirt-go-master-check/systems=libvirt-fedora-28/1070/display/redirect> ------------------------------------------ Started by upstream project "libvirt-go-master-check" build number 1070 originally caused by: Started by upstream project "libvirt-go-master-build" build number 1081 originally caused by: Started by upstream project "libvirt-master-build" build number 1478 originally caused by: Started by an SCM change [EnvInject] - Loading node environment variables. Building remotely on libvirt-fedora-28 (libvirt) in workspace <https://ci.centos.org/job/libvirt-go-master-check/systems=libvirt-fedora-28/ws/> [libvirt-go-master] $ /bin/sh -xe /tmp/jenkins5597170593487612971.sh + export 'TEST_ARGS=-tags api' + TEST_ARGS='-tags api' + go test -tags api 2018-05-31 14:19:42.209+0000: 17690: info : libvirt version: 4.4.0 2018-05-31 14:19:42.209+0000: 17690: info : hostname: libvirt-fedora-28 2018-05-31 14:19:42.209+0000: 17690: warning : virEventRegisterImpl:245 : Ignoring attempt to replace registered event loop 2018-05-31 14:19:42.209+0000: 17690: warning : virEventRegisterImpl:245 : Ignoring attempt to replace registered event loop 2018-05-31 14:19:42.209+0000: 17690: warning : virEventRegisterImpl:245 : Ignoring attempt to replace registered event loop Missing function 'virConnectBaselineHypervisorCPU' Missing function 'virConnectCompareHypervisorCPU' Missing function 'virDomainDetachDeviceAlias' --- FAIL: TestAPICoverage (0.65s) panic: Missing symbols found [recovered] panic: Missing symbols found goroutine 4 [running]: testing.tRunner.func1(0xc4200ca0f0) /usr/lib/golang/src/testing/testing.go:742 +0x29d panic(0x5ad500, 0x611830) /usr/lib/golang/src/runtime/panic.go:502 +0x229 _<https://ci.centos.org/job/libvirt-go-master-check/systems=libvirt-fedora-28/ws/.TestAPICoverage(0xc4200ca0f0)> <https://ci.centos.org/job/libvirt-go-master-check/systems=libvirt-fedora-28/ws/api_test.go>:504 +0x548 testing.tRunner(0xc4200ca0f0, 0x5fc918) /usr/lib/golang/src/testing/testing.go:777 +0xd0 created by testing.(*T).Run /usr/lib/golang/src/testing/testing.go:824 +0x2e0 exit status 2 FAIL _<https://ci.centos.org/job/libvirt-go-master-check/systems=libvirt-fedora-28/ws/> 0.835s Build step 'Execute shell' marked build as failure

See <https://ci.centos.org/job/libvirt-go-master-check/systems=libvirt-fedora-28/1071/display/redirect> ------------------------------------------ Started by upstream project "libvirt-go-master-check" build number 1071 originally caused by: Started by upstream project "libvirt-go-master-build" build number 1082 originally caused by: Started by upstream project "libvirt-master-build" build number 1479 originally caused by: Started by an SCM change [EnvInject] - Loading node environment variables. Building remotely on libvirt-fedora-28 (libvirt) in workspace <https://ci.centos.org/job/libvirt-go-master-check/systems=libvirt-fedora-28/ws/> [libvirt-go-master] $ /bin/sh -xe /tmp/jenkins4331691819150974931.sh + export 'TEST_ARGS=-tags api' + TEST_ARGS='-tags api' + go test -tags api 2018-05-31 15:46:26.270+0000: 29749: info : libvirt version: 4.4.0 2018-05-31 15:46:26.270+0000: 29749: info : hostname: libvirt-fedora-28 2018-05-31 15:46:26.270+0000: 29749: warning : virEventRegisterImpl:245 : Ignoring attempt to replace registered event loop 2018-05-31 15:46:26.271+0000: 29749: warning : virEventRegisterImpl:245 : Ignoring attempt to replace registered event loop 2018-05-31 15:46:26.271+0000: 29749: warning : virEventRegisterImpl:245 : Ignoring attempt to replace registered event loop Missing function 'virConnectBaselineHypervisorCPU' Missing function 'virConnectCompareHypervisorCPU' Missing function 'virDomainDetachDeviceAlias' --- FAIL: TestAPICoverage (0.98s) panic: Missing symbols found [recovered] panic: Missing symbols found goroutine 5 [running]: testing.tRunner.func1(0xc4200aa0f0) /usr/lib/golang/src/testing/testing.go:742 +0x29d panic(0x5ad500, 0x611830) /usr/lib/golang/src/runtime/panic.go:502 +0x229 _<https://ci.centos.org/job/libvirt-go-master-check/systems=libvirt-fedora-28/ws/.TestAPICoverage(0xc4200aa0f0)> <https://ci.centos.org/job/libvirt-go-master-check/systems=libvirt-fedora-28/ws/api_test.go>:504 +0x548 testing.tRunner(0xc4200aa0f0, 0x5fc918) /usr/lib/golang/src/testing/testing.go:777 +0xd0 created by testing.(*T).Run /usr/lib/golang/src/testing/testing.go:824 +0x2e0 exit status 2 FAIL _<https://ci.centos.org/job/libvirt-go-master-check/systems=libvirt-fedora-28/ws/> 1.063s Build step 'Execute shell' marked build as failure

See <https://ci.centos.org/job/libvirt-go-master-check/systems=libvirt-fedora-28/1072/display/redirect> ------------------------------------------ Started by upstream project "libvirt-go-master-check" build number 1072 originally caused by: Started by upstream project "libvirt-go-master-build" build number 1083 originally caused by: Started by upstream project "libvirt-master-build" build number 1480 originally caused by: Started by an SCM change [EnvInject] - Loading node environment variables. Building remotely on libvirt-fedora-28 (libvirt) in workspace <https://ci.centos.org/job/libvirt-go-master-check/systems=libvirt-fedora-28/ws/> [libvirt-go-master] $ /bin/sh -xe /tmp/jenkins3431753090570463981.sh + export 'TEST_ARGS=-tags api' + TEST_ARGS='-tags api' + go test -tags api 2018-06-01 12:39:46.262+0000: 29532: info : libvirt version: 4.4.0 2018-06-01 12:39:46.262+0000: 29532: info : hostname: libvirt-fedora-28 2018-06-01 12:39:46.262+0000: 29532: warning : virEventRegisterImpl:245 : Ignoring attempt to replace registered event loop 2018-06-01 12:39:46.262+0000: 29532: warning : virEventRegisterImpl:245 : Ignoring attempt to replace registered event loop 2018-06-01 12:39:46.262+0000: 29532: warning : virEventRegisterImpl:245 : Ignoring attempt to replace registered event loop Missing function 'virConnectBaselineHypervisorCPU' Missing function 'virConnectCompareHypervisorCPU' Missing function 'virDomainDetachDeviceAlias' --- FAIL: TestAPICoverage (0.35s) panic: Missing symbols found [recovered] panic: Missing symbols found goroutine 4 [running]: testing.tRunner.func1(0xc4200ca0f0) /usr/lib/golang/src/testing/testing.go:742 +0x29d panic(0x5ad500, 0x611830) /usr/lib/golang/src/runtime/panic.go:502 +0x229 _<https://ci.centos.org/job/libvirt-go-master-check/systems=libvirt-fedora-28/ws/.TestAPICoverage(0xc4200ca0f0)> <https://ci.centos.org/job/libvirt-go-master-check/systems=libvirt-fedora-28/ws/api_test.go>:504 +0x548 testing.tRunner(0xc4200ca0f0, 0x5fc918) /usr/lib/golang/src/testing/testing.go:777 +0xd0 created by testing.(*T).Run /usr/lib/golang/src/testing/testing.go:824 +0x2e0 exit status 2 FAIL _<https://ci.centos.org/job/libvirt-go-master-check/systems=libvirt-fedora-28/ws/> 0.542s Build step 'Execute shell' marked build as failure

See <https://ci.centos.org/job/libvirt-go-master-check/systems=libvirt-fedora-28/1073/display/redirect> ------------------------------------------ Started by upstream project "libvirt-go-master-check" build number 1073 originally caused by: Started by upstream project "libvirt-go-master-build" build number 1084 originally caused by: Started by upstream project "libvirt-master-build" build number 1481 originally caused by: Started by an SCM change Started by an SCM change [EnvInject] - Loading node environment variables. Building remotely on libvirt-fedora-28 (libvirt) in workspace <https://ci.centos.org/job/libvirt-go-master-check/systems=libvirt-fedora-28/ws/> [libvirt-go-master] $ /bin/sh -xe /tmp/jenkins2637731479323514517.sh + export 'TEST_ARGS=-tags api' + TEST_ARGS='-tags api' + go test -tags api 2018-06-01 13:59:19.475+0000: 31032: info : libvirt version: 4.4.0 2018-06-01 13:59:19.475+0000: 31032: info : hostname: libvirt-fedora-28 2018-06-01 13:59:19.475+0000: 31032: warning : virEventRegisterImpl:245 : Ignoring attempt to replace registered event loop 2018-06-01 13:59:19.490+0000: 31032: warning : virEventRegisterImpl:245 : Ignoring attempt to replace registered event loop 2018-06-01 13:59:19.490+0000: 31032: warning : virEventRegisterImpl:245 : Ignoring attempt to replace registered event loop Missing function 'virConnectBaselineHypervisorCPU' Missing function 'virConnectCompareHypervisorCPU' Missing function 'virDomainDetachDeviceAlias' --- FAIL: TestAPICoverage (0.79s) panic: Missing symbols found [recovered] panic: Missing symbols found goroutine 19 [running]: testing.tRunner.func1(0xc4200c80f0) /usr/lib/golang/src/testing/testing.go:742 +0x29d panic(0x5ad500, 0x611830) /usr/lib/golang/src/runtime/panic.go:502 +0x229 _<https://ci.centos.org/job/libvirt-go-master-check/systems=libvirt-fedora-28/ws/.TestAPICoverage(0xc4200c80f0)> <https://ci.centos.org/job/libvirt-go-master-check/systems=libvirt-fedora-28/ws/api_test.go>:504 +0x548 testing.tRunner(0xc4200c80f0, 0x5fc918) /usr/lib/golang/src/testing/testing.go:777 +0xd0 created by testing.(*T).Run /usr/lib/golang/src/testing/testing.go:824 +0x2e0 exit status 2 FAIL _<https://ci.centos.org/job/libvirt-go-master-check/systems=libvirt-fedora-28/ws/> 1.045s Build step 'Execute shell' marked build as failure

See <https://ci.centos.org/job/libvirt-go-master-check/systems=libvirt-fedora-28/1074/display/redirect> ------------------------------------------ Started by upstream project "libvirt-go-master-check" build number 1074 originally caused by: Started by upstream project "libvirt-go-master-build" build number 1085 originally caused by: Started by upstream project "libvirt-master-build" build number 1482 originally caused by: Started by an SCM change [EnvInject] - Loading node environment variables. Building remotely on libvirt-fedora-28 (libvirt) in workspace <https://ci.centos.org/job/libvirt-go-master-check/systems=libvirt-fedora-28/ws/> [libvirt-go-master] $ /bin/sh -xe /tmp/jenkins1882165997462230486.sh + export 'TEST_ARGS=-tags api' + TEST_ARGS='-tags api' + go test -tags api 2018-06-01 16:30:55.449+0000: 28157: info : libvirt version: 4.4.0 2018-06-01 16:30:55.449+0000: 28157: info : hostname: libvirt-fedora-28 2018-06-01 16:30:55.449+0000: 28157: warning : virEventRegisterImpl:245 : Ignoring attempt to replace registered event loop 2018-06-01 16:30:55.450+0000: 28157: warning : virEventRegisterImpl:245 : Ignoring attempt to replace registered event loop 2018-06-01 16:30:55.468+0000: 28157: warning : virEventRegisterImpl:245 : Ignoring attempt to replace registered event loop Missing function 'virConnectBaselineHypervisorCPU' Missing function 'virConnectCompareHypervisorCPU' Missing function 'virDomainDetachDeviceAlias' --- FAIL: TestAPICoverage (0.69s) panic: Missing symbols found [recovered] panic: Missing symbols found goroutine 19 [running]: testing.tRunner.func1(0xc4200c80f0) /usr/lib/golang/src/testing/testing.go:742 +0x29d panic(0x5ad500, 0x611830) /usr/lib/golang/src/runtime/panic.go:502 +0x229 _<https://ci.centos.org/job/libvirt-go-master-check/systems=libvirt-fedora-28/ws/.TestAPICoverage(0xc4200c80f0)> <https://ci.centos.org/job/libvirt-go-master-check/systems=libvirt-fedora-28/ws/api_test.go>:504 +0x548 testing.tRunner(0xc4200c80f0, 0x5fc918) /usr/lib/golang/src/testing/testing.go:777 +0xd0 created by testing.(*T).Run /usr/lib/golang/src/testing/testing.go:824 +0x2e0 exit status 2 FAIL _<https://ci.centos.org/job/libvirt-go-master-check/systems=libvirt-fedora-28/ws/> 0.832s Build step 'Execute shell' marked build as failure

participants (1)
-
ci@centos.org