[Libvirt-ci] Build failed in Jenkins: libvirt-go-check » libvirt-freebsd-10 #116

See <https://ci.centos.org/job/libvirt-go-check/systems=libvirt-freebsd-10/116/display/redirect> ------------------------------------------ Started by upstream project "libvirt-go-check" build number 116 originally caused by: Started by upstream project "libvirt-go-build" build number 120 originally caused by: Started by upstream project "libvirt-build" build number 143 originally caused by: Started by an SCM change [EnvInject] - Loading node environment variables. Building remotely on libvirt-freebsd-10 (libvirt) in workspace <https://ci.centos.org/job/libvirt-go-check/systems=libvirt-freebsd-10/ws/> [libvirt-go] $ /bin/sh -xe /tmp/jenkins5691669486333589428.sh + export 'TEST_ARGS=-tags api' + go test -tags api Missing function 'virDomainSetIOThreadParams' Missing macro 'VIR_DOMAIN_IOTHREAD_POLL_GROW' Missing macro 'VIR_DOMAIN_IOTHREAD_POLL_MAX_NS' Missing macro 'VIR_DOMAIN_IOTHREAD_POLL_SHRINK' Missing enum 'VIR_DOMAIN_STATS_IOTHREAD' --- FAIL: TestAPICoverage (0.30s) panic: Missing symbols found [recovered] panic: Missing symbols found goroutine 19 [running]: testing.tRunner.func1(0xc0000c6100) /usr/local/go/src/testing/testing.go:792 +0x387 panic(0x5c94c0, 0x636030) /usr/local/go/src/runtime/panic.go:513 +0x1b9 _/usr<https://ci.centos.org/job/libvirt-go-check/systems=libvirt-freebsd-10/ws/.TestAPICoverage(0xc0000c6100)> /usr<https://ci.centos.org/job/libvirt-go-check/systems=libvirt-freebsd-10/ws/api_test.go>:507 +0x554 testing.tRunner(0xc0000c6100, 0x617740) /usr/local/go/src/testing/testing.go:827 +0xbf created by testing.(*T).Run /usr/local/go/src/testing/testing.go:878 +0x353 exit status 2 FAIL _/usr<https://ci.centos.org/job/libvirt-go-check/systems=libvirt-freebsd-10/ws/> 0.371s Build step 'Execute shell' marked build as failure

See <https://ci.centos.org/job/libvirt-go-check/systems=libvirt-freebsd-10/117/display/redirect> ------------------------------------------ Started by upstream project "libvirt-go-check" build number 117 originally caused by: Started by upstream project "libvirt-go-build" build number 121 originally caused by: Started by upstream project "libvirt-build" build number 144 originally caused by: Started by an SCM change [EnvInject] - Loading node environment variables. Building remotely on libvirt-freebsd-10 (libvirt) in workspace <https://ci.centos.org/job/libvirt-go-check/systems=libvirt-freebsd-10/ws/> [libvirt-go] $ /bin/sh -xe /tmp/jenkins1834067033566435349.sh + export 'TEST_ARGS=-tags api' + go test -tags api Missing function 'virDomainSetIOThreadParams' Missing macro 'VIR_DOMAIN_IOTHREAD_POLL_GROW' Missing macro 'VIR_DOMAIN_IOTHREAD_POLL_MAX_NS' Missing macro 'VIR_DOMAIN_IOTHREAD_POLL_SHRINK' Missing enum 'VIR_DOMAIN_STATS_IOTHREAD' --- FAIL: TestAPICoverage (0.84s) panic: Missing symbols found [recovered] panic: Missing symbols found goroutine 19 [running]: testing.tRunner.func1(0xc0000c4100) /usr/local/go/src/testing/testing.go:792 +0x387 panic(0x5c94c0, 0x636030) /usr/local/go/src/runtime/panic.go:513 +0x1b9 _/usr<https://ci.centos.org/job/libvirt-go-check/systems=libvirt-freebsd-10/ws/.TestAPICoverage(0xc0000c4100)> /usr<https://ci.centos.org/job/libvirt-go-check/systems=libvirt-freebsd-10/ws/api_test.go>:507 +0x554 testing.tRunner(0xc0000c4100, 0x617740) /usr/local/go/src/testing/testing.go:827 +0xbf created by testing.(*T).Run /usr/local/go/src/testing/testing.go:878 +0x353 exit status 2 FAIL _/usr<https://ci.centos.org/job/libvirt-go-check/systems=libvirt-freebsd-10/ws/> 0.987s Build step 'Execute shell' marked build as failure

See <https://ci.centos.org/job/libvirt-go-check/systems=libvirt-freebsd-10/118/display/redirect> ------------------------------------------ Started by upstream project "libvirt-go-check" build number 118 originally caused by: Started by upstream project "libvirt-go-build" build number 122 originally caused by: Started by upstream project "libvirt-build" build number 145 originally caused by: Started by an SCM change [EnvInject] - Loading node environment variables. Building remotely on libvirt-freebsd-10 (libvirt) in workspace <https://ci.centos.org/job/libvirt-go-check/systems=libvirt-freebsd-10/ws/> [libvirt-go] $ /bin/sh -xe /tmp/jenkins7978127082609502669.sh + export 'TEST_ARGS=-tags api' + go test -tags api Missing function 'virDomainSetIOThreadParams' Missing macro 'VIR_DOMAIN_IOTHREAD_POLL_GROW' Missing macro 'VIR_DOMAIN_IOTHREAD_POLL_MAX_NS' Missing macro 'VIR_DOMAIN_IOTHREAD_POLL_SHRINK' Missing enum 'VIR_DOMAIN_STATS_IOTHREAD' --- FAIL: TestAPICoverage (0.30s) panic: Missing symbols found [recovered] panic: Missing symbols found goroutine 4 [running]: testing.tRunner.func1(0xc0000c8100) /usr/local/go/src/testing/testing.go:792 +0x387 panic(0x5c94c0, 0x636030) /usr/local/go/src/runtime/panic.go:513 +0x1b9 _/usr<https://ci.centos.org/job/libvirt-go-check/systems=libvirt-freebsd-10/ws/.TestAPICoverage(0xc0000c8100)> /usr<https://ci.centos.org/job/libvirt-go-check/systems=libvirt-freebsd-10/ws/api_test.go>:507 +0x554 testing.tRunner(0xc0000c8100, 0x617740) /usr/local/go/src/testing/testing.go:827 +0xbf created by testing.(*T).Run /usr/local/go/src/testing/testing.go:878 +0x353 exit status 2 FAIL _/usr<https://ci.centos.org/job/libvirt-go-check/systems=libvirt-freebsd-10/ws/> 0.497s Build step 'Execute shell' marked build as failure

participants (1)
-
ci@centos.org