[Libvirt-ci] Build failed in Jenkins: libvirt-go-check » libvirt-fedora-30 #921

See <https://ci.centos.org/job/libvirt-go-check/systems=libvirt-fedora-30/921/display/redirect> ------------------------------------------ Started by upstream project "libvirt-go-check" build number 921 originally caused by: Started by upstream project "libvirt-go-build" build number 935 originally caused by: Started by upstream project "libvirt-build" build number 1107 originally caused by: Started by an SCM change Running as SYSTEM [EnvInject] - Loading node environment variables. Building remotely on libvirt-fedora-30 (libvirt) in workspace <https://ci.centos.org/job/libvirt-go-check/systems=libvirt-fedora-30/ws/> [libvirt-go] $ /bin/sh -xe /tmp/jenkins1168269073514307958.sh + export 'TEST_ARGS=-tags api' + TEST_ARGS='-tags api' + go test -tags api Missing enum 'VIR_DOMAIN_GET_HOSTNAME_AGENT' Missing enum 'VIR_DOMAIN_GET_HOSTNAME_LEASE' Missing enum 'VIR_ERR_NO_HOSTNAME' --- FAIL: TestAPICoverage (1.04s) panic: Missing symbols found [recovered] panic: Missing symbols found goroutine 5 [running]: testing.tRunner.func1(0xc0000ac100) /usr/lib/golang/src/testing/testing.go:830 +0x392 panic(0x5d26a0, 0x648190) /usr/lib/golang/src/runtime/panic.go:522 +0x1b5 _<https://ci.centos.org/job/libvirt-go-check/systems=libvirt-fedora-30/ws/.TestAPICoverage(0xc0000ac100)> <https://ci.centos.org/job/libvirt-go-check/systems=libvirt-fedora-30/ws/api_test.go>:503 +0x551 testing.tRunner(0xc0000ac100, 0x622630) /usr/lib/golang/src/testing/testing.go:865 +0xc0 created by testing.(*T).Run /usr/lib/golang/src/testing/testing.go:916 +0x35a exit status 2 FAIL _<https://ci.centos.org/job/libvirt-go-check/systems=libvirt-fedora-30/ws/> 1.268s Build step 'Execute shell' marked build as failure

See <https://ci.centos.org/job/libvirt-go-check/systems=libvirt-fedora-30/922/display/redirect> ------------------------------------------ Started by upstream project "libvirt-go-check" build number 922 originally caused by: Started by upstream project "libvirt-go-build" build number 936 originally caused by: Started by upstream project "libvirt-build" build number 1108 originally caused by: Started by an SCM change Started by an SCM change Started by an SCM change Started by an SCM change Started by an SCM change Started by an SCM change Started by an SCM change Running as SYSTEM [EnvInject] - Loading node environment variables. Building remotely on libvirt-fedora-30 (libvirt) in workspace <https://ci.centos.org/job/libvirt-go-check/systems=libvirt-fedora-30/ws/> [libvirt-go] $ /bin/sh -xe /tmp/jenkins12540805219959199246.sh + export 'TEST_ARGS=-tags api' + TEST_ARGS='-tags api' + go test -tags api Missing enum 'VIR_DOMAIN_GET_HOSTNAME_AGENT' Missing enum 'VIR_DOMAIN_GET_HOSTNAME_LEASE' Missing enum 'VIR_ERR_NO_HOSTNAME' --- FAIL: TestAPICoverage (1.81s) panic: Missing symbols found [recovered] panic: Missing symbols found goroutine 5 [running]: testing.tRunner.func1(0xc0000ac100) /usr/lib/golang/src/testing/testing.go:830 +0x392 panic(0x5d26a0, 0x648190) /usr/lib/golang/src/runtime/panic.go:522 +0x1b5 _<https://ci.centos.org/job/libvirt-go-check/systems=libvirt-fedora-30/ws/.TestAPICoverage(0xc0000ac100)> <https://ci.centos.org/job/libvirt-go-check/systems=libvirt-fedora-30/ws/api_test.go>:503 +0x551 testing.tRunner(0xc0000ac100, 0x622630) /usr/lib/golang/src/testing/testing.go:865 +0xc0 created by testing.(*T).Run /usr/lib/golang/src/testing/testing.go:916 +0x35a exit status 2 FAIL _<https://ci.centos.org/job/libvirt-go-check/systems=libvirt-fedora-30/ws/> 2.128s Build step 'Execute shell' marked build as failure

See <https://ci.centos.org/job/libvirt-go-check/systems=libvirt-fedora-30/923/display/redirect> ------------------------------------------ Started by upstream project "libvirt-go-check" build number 923 originally caused by: Started by upstream project "libvirt-go-build" build number 937 originally caused by: Started by upstream project "libvirt-build" build number 1109 originally caused by: Started by an SCM change Running as SYSTEM [EnvInject] - Loading node environment variables. Building remotely on libvirt-fedora-30 (libvirt) in workspace <https://ci.centos.org/job/libvirt-go-check/systems=libvirt-fedora-30/ws/> [libvirt-go] $ /bin/sh -xe /tmp/jenkins1116765143835985491.sh + export 'TEST_ARGS=-tags api' + TEST_ARGS='-tags api' + go test -tags api Missing enum 'VIR_DOMAIN_GET_HOSTNAME_AGENT' Missing enum 'VIR_DOMAIN_GET_HOSTNAME_LEASE' Missing enum 'VIR_ERR_NO_HOSTNAME' --- FAIL: TestAPICoverage (1.54s) panic: Missing symbols found [recovered] panic: Missing symbols found goroutine 18 [running]: testing.tRunner.func1(0xc0000b8100) /usr/lib/golang/src/testing/testing.go:830 +0x392 panic(0x5d26a0, 0x648190) /usr/lib/golang/src/runtime/panic.go:522 +0x1b5 _<https://ci.centos.org/job/libvirt-go-check/systems=libvirt-fedora-30/ws/.TestAPICoverage(0xc0000b8100)> <https://ci.centos.org/job/libvirt-go-check/systems=libvirt-fedora-30/ws/api_test.go>:503 +0x551 testing.tRunner(0xc0000b8100, 0x622630) /usr/lib/golang/src/testing/testing.go:865 +0xc0 created by testing.(*T).Run /usr/lib/golang/src/testing/testing.go:916 +0x35a exit status 2 FAIL _<https://ci.centos.org/job/libvirt-go-check/systems=libvirt-fedora-30/ws/> 1.864s Build step 'Execute shell' marked build as failure

See <https://ci.centos.org/job/libvirt-go-check/systems=libvirt-fedora-30/924/display/redirect> ------------------------------------------ Started by upstream project "libvirt-go-check" build number 924 originally caused by: Started by upstream project "libvirt-go-build" build number 938 originally caused by: Started by upstream project "libvirt-build" build number 1110 originally caused by: Started by an SCM change Started by an SCM change Started by an SCM change Started by an SCM change Started by an SCM change Running as SYSTEM [EnvInject] - Loading node environment variables. Building remotely on libvirt-fedora-30 (libvirt) in workspace <https://ci.centos.org/job/libvirt-go-check/systems=libvirt-fedora-30/ws/> [libvirt-go] $ /bin/sh -xe /tmp/jenkins6456755081889566451.sh + export 'TEST_ARGS=-tags api' + TEST_ARGS='-tags api' + go test -tags api Missing enum 'VIR_DOMAIN_GET_HOSTNAME_AGENT' Missing enum 'VIR_DOMAIN_GET_HOSTNAME_LEASE' Missing enum 'VIR_ERR_NO_HOSTNAME' --- FAIL: TestAPICoverage (2.20s) panic: Missing symbols found [recovered] panic: Missing symbols found goroutine 18 [running]: testing.tRunner.func1(0xc0000b8100) /usr/lib/golang/src/testing/testing.go:830 +0x392 panic(0x5d26a0, 0x648190) /usr/lib/golang/src/runtime/panic.go:522 +0x1b5 _<https://ci.centos.org/job/libvirt-go-check/systems=libvirt-fedora-30/ws/.TestAPICoverage(0xc0000b8100)> <https://ci.centos.org/job/libvirt-go-check/systems=libvirt-fedora-30/ws/api_test.go>:503 +0x551 testing.tRunner(0xc0000b8100, 0x622630) /usr/lib/golang/src/testing/testing.go:865 +0xc0 created by testing.(*T).Run /usr/lib/golang/src/testing/testing.go:916 +0x35a exit status 2 FAIL _<https://ci.centos.org/job/libvirt-go-check/systems=libvirt-fedora-30/ws/> 2.659s Build step 'Execute shell' marked build as failure

See <https://ci.centos.org/job/libvirt-go-check/systems=libvirt-fedora-30/925/display/redirect> ------------------------------------------ Started by upstream project "libvirt-go-check" build number 925 originally caused by: Started by upstream project "libvirt-go-build" build number 939 originally caused by: Started by an SCM change Running as SYSTEM [EnvInject] - Loading node environment variables. Building remotely on libvirt-fedora-30 (libvirt) in workspace <https://ci.centos.org/job/libvirt-go-check/systems=libvirt-fedora-30/ws/> [libvirt-go] $ /bin/sh -xe /tmp/jenkins3976497873165704965.sh + export 'TEST_ARGS=-tags api' + TEST_ARGS='-tags api' + go test -tags api Missing enum 'VIR_DOMAIN_GET_HOSTNAME_AGENT' Missing enum 'VIR_DOMAIN_GET_HOSTNAME_LEASE' Missing enum 'VIR_ERR_NO_HOSTNAME' --- FAIL: TestAPICoverage (0.53s) panic: Missing symbols found [recovered] panic: Missing symbols found goroutine 19 [running]: testing.tRunner.func1(0xc0000c8100) /usr/lib/golang/src/testing/testing.go:830 +0x392 panic(0x5d26a0, 0x648190) /usr/lib/golang/src/runtime/panic.go:522 +0x1b5 _<https://ci.centos.org/job/libvirt-go-check/systems=libvirt-fedora-30/ws/.TestAPICoverage(0xc0000c8100)> <https://ci.centos.org/job/libvirt-go-check/systems=libvirt-fedora-30/ws/api_test.go>:503 +0x551 testing.tRunner(0xc0000c8100, 0x622630) /usr/lib/golang/src/testing/testing.go:865 +0xc0 created by testing.(*T).Run /usr/lib/golang/src/testing/testing.go:916 +0x35a exit status 2 FAIL _<https://ci.centos.org/job/libvirt-go-check/systems=libvirt-fedora-30/ws/> 0.637s Build step 'Execute shell' marked build as failure

See <https://ci.centos.org/job/libvirt-go-check/systems=libvirt-fedora-30/926/display/redirect> ------------------------------------------ Started by upstream project "libvirt-go-check" build number 926 originally caused by: Started by upstream project "libvirt-go-build" build number 940 originally caused by: Started by upstream project "libvirt-build" build number 1114 originally caused by: Started by an SCM change Running as SYSTEM [EnvInject] - Loading node environment variables. Building remotely on libvirt-fedora-30 (libvirt) in workspace <https://ci.centos.org/job/libvirt-go-check/systems=libvirt-fedora-30/ws/> [libvirt-go] $ /bin/sh -xe /tmp/jenkins4323464314021074486.sh + export 'TEST_ARGS=-tags api' + TEST_ARGS='-tags api' + go test -tags api Missing enum 'VIR_DOMAIN_GET_HOSTNAME_AGENT' Missing enum 'VIR_DOMAIN_GET_HOSTNAME_LEASE' Missing enum 'VIR_ERR_NO_HOSTNAME' --- FAIL: TestAPICoverage (1.88s) panic: Missing symbols found [recovered] panic: Missing symbols found goroutine 5 [running]: testing.tRunner.func1(0xc0000ac100) /usr/lib/golang/src/testing/testing.go:830 +0x392 panic(0x5d26a0, 0x648190) /usr/lib/golang/src/runtime/panic.go:522 +0x1b5 _<https://ci.centos.org/job/libvirt-go-check/systems=libvirt-fedora-30/ws/.TestAPICoverage(0xc0000ac100)> <https://ci.centos.org/job/libvirt-go-check/systems=libvirt-fedora-30/ws/api_test.go>:503 +0x551 testing.tRunner(0xc0000ac100, 0x622630) /usr/lib/golang/src/testing/testing.go:865 +0xc0 created by testing.(*T).Run /usr/lib/golang/src/testing/testing.go:916 +0x35a exit status 2 FAIL _<https://ci.centos.org/job/libvirt-go-check/systems=libvirt-fedora-30/ws/> 2.204s Build step 'Execute shell' marked build as failure

See <https://ci.centos.org/job/libvirt-go-check/systems=libvirt-fedora-30/927/display/redirect> ------------------------------------------ Started by upstream project "libvirt-go-check" build number 927 originally caused by: Started by upstream project "libvirt-go-build" build number 941 originally caused by: Started by upstream project "libvirt-build" build number 1115 originally caused by: Started by an SCM change Started by an SCM change Started by an SCM change Started by an SCM change Started by an SCM change Started by an SCM change Started by an SCM change Running as SYSTEM [EnvInject] - Loading node environment variables. Building remotely on libvirt-fedora-30 (libvirt) in workspace <https://ci.centos.org/job/libvirt-go-check/systems=libvirt-fedora-30/ws/> [libvirt-go] $ /bin/sh -xe /tmp/jenkins7161239041958709697.sh + export 'TEST_ARGS=-tags api' + TEST_ARGS='-tags api' + go test -tags api Missing enum 'VIR_DOMAIN_GET_HOSTNAME_AGENT' Missing enum 'VIR_DOMAIN_GET_HOSTNAME_LEASE' Missing enum 'VIR_ERR_NO_HOSTNAME' --- FAIL: TestAPICoverage (1.49s) panic: Missing symbols found [recovered] panic: Missing symbols found goroutine 19 [running]: testing.tRunner.func1(0xc0000c8100) /usr/lib/golang/src/testing/testing.go:830 +0x392 panic(0x5d26a0, 0x648190) /usr/lib/golang/src/runtime/panic.go:522 +0x1b5 _<https://ci.centos.org/job/libvirt-go-check/systems=libvirt-fedora-30/ws/.TestAPICoverage(0xc0000c8100)> <https://ci.centos.org/job/libvirt-go-check/systems=libvirt-fedora-30/ws/api_test.go>:503 +0x551 testing.tRunner(0xc0000c8100, 0x622630) /usr/lib/golang/src/testing/testing.go:865 +0xc0 created by testing.(*T).Run /usr/lib/golang/src/testing/testing.go:916 +0x35a exit status 2 FAIL _<https://ci.centos.org/job/libvirt-go-check/systems=libvirt-fedora-30/ws/> 1.750s Build step 'Execute shell' marked build as failure

See <https://ci.centos.org/job/libvirt-go-check/systems=libvirt-fedora-30/928/display/redirect> ------------------------------------------ Started by upstream project "libvirt-go-check" build number 928 originally caused by: Started by upstream project "libvirt-go-build" build number 942 originally caused by: Started by upstream project "libvirt-build" build number 1116 originally caused by: Started by an SCM change Running as SYSTEM [EnvInject] - Loading node environment variables. Building remotely on libvirt-fedora-30 (libvirt) in workspace <https://ci.centos.org/job/libvirt-go-check/systems=libvirt-fedora-30/ws/> [libvirt-go] $ /bin/sh -xe /tmp/jenkins2297715948026032161.sh + export 'TEST_ARGS=-tags api' + TEST_ARGS='-tags api' + go test -tags api Missing enum 'VIR_DOMAIN_GET_HOSTNAME_AGENT' Missing enum 'VIR_DOMAIN_GET_HOSTNAME_LEASE' Missing enum 'VIR_ERR_NO_HOSTNAME' --- FAIL: TestAPICoverage (2.31s) panic: Missing symbols found [recovered] panic: Missing symbols found goroutine 5 [running]: testing.tRunner.func1(0xc0000ac100) /usr/lib/golang/src/testing/testing.go:830 +0x392 panic(0x5d26a0, 0x648190) /usr/lib/golang/src/runtime/panic.go:522 +0x1b5 _<https://ci.centos.org/job/libvirt-go-check/systems=libvirt-fedora-30/ws/.TestAPICoverage(0xc0000ac100)> <https://ci.centos.org/job/libvirt-go-check/systems=libvirt-fedora-30/ws/api_test.go>:503 +0x551 testing.tRunner(0xc0000ac100, 0x622630) /usr/lib/golang/src/testing/testing.go:865 +0xc0 created by testing.(*T).Run /usr/lib/golang/src/testing/testing.go:916 +0x35a exit status 2 FAIL _<https://ci.centos.org/job/libvirt-go-check/systems=libvirt-fedora-30/ws/> 2.879s Build step 'Execute shell' marked build as failure

See <https://ci.centos.org/job/libvirt-go-check/systems=libvirt-fedora-30/929/display/redirect> ------------------------------------------ Started by upstream project "libvirt-go-check" build number 929 originally caused by: Started by upstream project "libvirt-go-build" build number 943 originally caused by: Started by upstream project "libvirt-build" build number 1117 originally caused by: Started by an SCM change Running as SYSTEM [EnvInject] - Loading node environment variables. Building remotely on libvirt-fedora-30 (libvirt) in workspace <https://ci.centos.org/job/libvirt-go-check/systems=libvirt-fedora-30/ws/> [libvirt-go] $ /bin/sh -xe /tmp/jenkins17264398671185907732.sh + export 'TEST_ARGS=-tags api' + TEST_ARGS='-tags api' + go test -tags api Missing enum 'VIR_DOMAIN_GET_HOSTNAME_AGENT' Missing enum 'VIR_DOMAIN_GET_HOSTNAME_LEASE' Missing enum 'VIR_ERR_NO_HOSTNAME' --- FAIL: TestAPICoverage (1.47s) panic: Missing symbols found [recovered] panic: Missing symbols found goroutine 19 [running]: testing.tRunner.func1(0xc0000c8100) /usr/lib/golang/src/testing/testing.go:830 +0x392 panic(0x5d26a0, 0x648190) /usr/lib/golang/src/runtime/panic.go:522 +0x1b5 _<https://ci.centos.org/job/libvirt-go-check/systems=libvirt-fedora-30/ws/.TestAPICoverage(0xc0000c8100)> <https://ci.centos.org/job/libvirt-go-check/systems=libvirt-fedora-30/ws/api_test.go>:503 +0x551 testing.tRunner(0xc0000c8100, 0x622630) /usr/lib/golang/src/testing/testing.go:865 +0xc0 created by testing.(*T).Run /usr/lib/golang/src/testing/testing.go:916 +0x35a exit status 2 FAIL _<https://ci.centos.org/job/libvirt-go-check/systems=libvirt-fedora-30/ws/> 1.850s Build step 'Execute shell' marked build as failure

See <https://ci.centos.org/job/libvirt-go-check/systems=libvirt-fedora-30/930/display/redirect> ------------------------------------------ Started by upstream project "libvirt-go-check" build number 930 originally caused by: Started by upstream project "libvirt-go-build" build number 944 originally caused by: Started by upstream project "libvirt-build" build number 1118 originally caused by: Started by an SCM change Running as SYSTEM [EnvInject] - Loading node environment variables. Building remotely on libvirt-fedora-30 (libvirt) in workspace <https://ci.centos.org/job/libvirt-go-check/systems=libvirt-fedora-30/ws/> [libvirt-go] $ /bin/sh -xe /tmp/jenkins2542263954729597267.sh + export 'TEST_ARGS=-tags api' + TEST_ARGS='-tags api' + go test -tags api Missing enum 'VIR_DOMAIN_GET_HOSTNAME_AGENT' Missing enum 'VIR_DOMAIN_GET_HOSTNAME_LEASE' Missing enum 'VIR_ERR_NO_HOSTNAME' --- FAIL: TestAPICoverage (1.25s) panic: Missing symbols found [recovered] panic: Missing symbols found goroutine 19 [running]: testing.tRunner.func1(0xc0000c8100) /usr/lib/golang/src/testing/testing.go:830 +0x392 panic(0x5d26a0, 0x648190) /usr/lib/golang/src/runtime/panic.go:522 +0x1b5 _<https://ci.centos.org/job/libvirt-go-check/systems=libvirt-fedora-30/ws/.TestAPICoverage(0xc0000c8100)> <https://ci.centos.org/job/libvirt-go-check/systems=libvirt-fedora-30/ws/api_test.go>:503 +0x551 testing.tRunner(0xc0000c8100, 0x622630) /usr/lib/golang/src/testing/testing.go:865 +0xc0 created by testing.(*T).Run /usr/lib/golang/src/testing/testing.go:916 +0x35a exit status 2 FAIL _<https://ci.centos.org/job/libvirt-go-check/systems=libvirt-fedora-30/ws/> 1.860s Build step 'Execute shell' marked build as failure

See <https://ci.centos.org/job/libvirt-go-check/systems=libvirt-fedora-30/931/display/redirect> ------------------------------------------ Started by upstream project "libvirt-go-check" build number 931 originally caused by: Started by upstream project "libvirt-go-build" build number 945 originally caused by: Started by upstream project "libvirt-build" build number 1119 originally caused by: Started by an SCM change Running as SYSTEM [EnvInject] - Loading node environment variables. Building remotely on libvirt-fedora-30 (libvirt) in workspace <https://ci.centos.org/job/libvirt-go-check/systems=libvirt-fedora-30/ws/> [libvirt-go] $ /bin/sh -xe /tmp/jenkins4322729903198152064.sh + export 'TEST_ARGS=-tags api' + TEST_ARGS='-tags api' + go test -tags api Missing enum 'VIR_DOMAIN_GET_HOSTNAME_AGENT' Missing enum 'VIR_DOMAIN_GET_HOSTNAME_LEASE' Missing enum 'VIR_ERR_NO_HOSTNAME' --- FAIL: TestAPICoverage (1.87s) panic: Missing symbols found [recovered] panic: Missing symbols found goroutine 19 [running]: testing.tRunner.func1(0xc0000c8100) /usr/lib/golang/src/testing/testing.go:830 +0x392 panic(0x5d26a0, 0x648190) /usr/lib/golang/src/runtime/panic.go:522 +0x1b5 _<https://ci.centos.org/job/libvirt-go-check/systems=libvirt-fedora-30/ws/.TestAPICoverage(0xc0000c8100)> <https://ci.centos.org/job/libvirt-go-check/systems=libvirt-fedora-30/ws/api_test.go>:503 +0x551 testing.tRunner(0xc0000c8100, 0x622630) /usr/lib/golang/src/testing/testing.go:865 +0xc0 created by testing.(*T).Run /usr/lib/golang/src/testing/testing.go:916 +0x35a exit status 2 FAIL _<https://ci.centos.org/job/libvirt-go-check/systems=libvirt-fedora-30/ws/> 2.257s Build step 'Execute shell' marked build as failure

See <https://ci.centos.org/job/libvirt-go-check/systems=libvirt-fedora-30/932/display/redirect> ------------------------------------------ Started by upstream project "libvirt-go-check" build number 932 originally caused by: Started by upstream project "libvirt-go-build" build number 946 originally caused by: Started by upstream project "libvirt-build" build number 1120 originally caused by: Started by an SCM change Running as SYSTEM [EnvInject] - Loading node environment variables. Building remotely on libvirt-fedora-30 (libvirt) in workspace <https://ci.centos.org/job/libvirt-go-check/systems=libvirt-fedora-30/ws/> [libvirt-go] $ /bin/sh -xe /tmp/jenkins10162839943324060601.sh + export 'TEST_ARGS=-tags api' + TEST_ARGS='-tags api' + go test -tags api Missing enum 'VIR_DOMAIN_GET_HOSTNAME_AGENT' Missing enum 'VIR_DOMAIN_GET_HOSTNAME_LEASE' Missing enum 'VIR_ERR_NO_HOSTNAME' --- FAIL: TestAPICoverage (0.81s) panic: Missing symbols found [recovered] panic: Missing symbols found goroutine 5 [running]: testing.tRunner.func1(0xc0000ac100) /usr/lib/golang/src/testing/testing.go:830 +0x392 panic(0x5d26a0, 0x648190) /usr/lib/golang/src/runtime/panic.go:522 +0x1b5 _<https://ci.centos.org/job/libvirt-go-check/systems=libvirt-fedora-30/ws/.TestAPICoverage(0xc0000ac100)> <https://ci.centos.org/job/libvirt-go-check/systems=libvirt-fedora-30/ws/api_test.go>:503 +0x551 testing.tRunner(0xc0000ac100, 0x622630) /usr/lib/golang/src/testing/testing.go:865 +0xc0 created by testing.(*T).Run /usr/lib/golang/src/testing/testing.go:916 +0x35a exit status 2 FAIL _<https://ci.centos.org/job/libvirt-go-check/systems=libvirt-fedora-30/ws/> 1.108s Build step 'Execute shell' marked build as failure

See <https://ci.centos.org/job/libvirt-go-check/systems=libvirt-fedora-30/933/display/redirect> ------------------------------------------ Started by upstream project "libvirt-go-check" build number 933 originally caused by: Started by upstream project "libvirt-go-build" build number 947 originally caused by: Started by upstream project "libvirt-build" build number 1121 originally caused by: Started by an SCM change Running as SYSTEM [EnvInject] - Loading node environment variables. Building remotely on libvirt-fedora-30 (libvirt) in workspace <https://ci.centos.org/job/libvirt-go-check/systems=libvirt-fedora-30/ws/> [libvirt-go] $ /bin/sh -xe /tmp/jenkins16576594654264717664.sh + export 'TEST_ARGS=-tags api' + TEST_ARGS='-tags api' + go test -tags api Missing enum 'VIR_DOMAIN_GET_HOSTNAME_AGENT' Missing enum 'VIR_DOMAIN_GET_HOSTNAME_LEASE' Missing enum 'VIR_ERR_NO_HOSTNAME' --- FAIL: TestAPICoverage (1.04s) panic: Missing symbols found [recovered] panic: Missing symbols found goroutine 5 [running]: testing.tRunner.func1(0xc0000ac100) /usr/lib/golang/src/testing/testing.go:830 +0x392 panic(0x5d26a0, 0x648190) /usr/lib/golang/src/runtime/panic.go:522 +0x1b5 _<https://ci.centos.org/job/libvirt-go-check/systems=libvirt-fedora-30/ws/.TestAPICoverage(0xc0000ac100)> <https://ci.centos.org/job/libvirt-go-check/systems=libvirt-fedora-30/ws/api_test.go>:503 +0x551 testing.tRunner(0xc0000ac100, 0x622630) /usr/lib/golang/src/testing/testing.go:865 +0xc0 created by testing.(*T).Run /usr/lib/golang/src/testing/testing.go:916 +0x35a exit status 2 FAIL _<https://ci.centos.org/job/libvirt-go-check/systems=libvirt-fedora-30/ws/> 1.275s Build step 'Execute shell' marked build as failure

See <https://ci.centos.org/job/libvirt-go-check/systems=libvirt-fedora-30/934/display/redirect> ------------------------------------------ Started by upstream project "libvirt-go-check" build number 934 originally caused by: Started by upstream project "libvirt-go-build" build number 948 originally caused by: Started by upstream project "libvirt-build" build number 1122 originally caused by: Started by an SCM change Running as SYSTEM [EnvInject] - Loading node environment variables. Building remotely on libvirt-fedora-30 (libvirt) in workspace <https://ci.centos.org/job/libvirt-go-check/systems=libvirt-fedora-30/ws/> [libvirt-go] $ /bin/sh -xe /tmp/jenkins2931479959633231756.sh + export 'TEST_ARGS=-tags api' + TEST_ARGS='-tags api' + go test -tags api Missing enum 'VIR_DOMAIN_GET_HOSTNAME_AGENT' Missing enum 'VIR_DOMAIN_GET_HOSTNAME_LEASE' Missing enum 'VIR_ERR_NO_HOSTNAME' --- FAIL: TestAPICoverage (1.16s) panic: Missing symbols found [recovered] panic: Missing symbols found goroutine 19 [running]: testing.tRunner.func1(0xc0000c8100) /usr/lib/golang/src/testing/testing.go:830 +0x392 panic(0x5d26a0, 0x648190) /usr/lib/golang/src/runtime/panic.go:522 +0x1b5 _<https://ci.centos.org/job/libvirt-go-check/systems=libvirt-fedora-30/ws/.TestAPICoverage(0xc0000c8100)> <https://ci.centos.org/job/libvirt-go-check/systems=libvirt-fedora-30/ws/api_test.go>:503 +0x551 testing.tRunner(0xc0000c8100, 0x622630) /usr/lib/golang/src/testing/testing.go:865 +0xc0 created by testing.(*T).Run /usr/lib/golang/src/testing/testing.go:916 +0x35a exit status 2 FAIL _<https://ci.centos.org/job/libvirt-go-check/systems=libvirt-fedora-30/ws/> 1.446s Build step 'Execute shell' marked build as failure

See <https://ci.centos.org/job/libvirt-go-check/systems=libvirt-fedora-30/935/display/redirect> ------------------------------------------ Started by upstream project "libvirt-go-check" build number 935 originally caused by: Started by upstream project "libvirt-go-build" build number 949 originally caused by: Started by upstream project "libvirt-build" build number 1123 originally caused by: Started by an SCM change Started by an SCM change Running as SYSTEM [EnvInject] - Loading node environment variables. Building remotely on libvirt-fedora-30 (libvirt) in workspace <https://ci.centos.org/job/libvirt-go-check/systems=libvirt-fedora-30/ws/> [libvirt-go] $ /bin/sh -xe /tmp/jenkins6810703573800931079.sh + export 'TEST_ARGS=-tags api' + TEST_ARGS='-tags api' + go test -tags api Missing enum 'VIR_DOMAIN_GET_HOSTNAME_AGENT' Missing enum 'VIR_DOMAIN_GET_HOSTNAME_LEASE' Missing enum 'VIR_ERR_NO_HOSTNAME' --- FAIL: TestAPICoverage (1.67s) panic: Missing symbols found [recovered] panic: Missing symbols found goroutine 5 [running]: testing.tRunner.func1(0xc0000ac100) /usr/lib/golang/src/testing/testing.go:830 +0x392 panic(0x5d26a0, 0x648190) /usr/lib/golang/src/runtime/panic.go:522 +0x1b5 _<https://ci.centos.org/job/libvirt-go-check/systems=libvirt-fedora-30/ws/.TestAPICoverage(0xc0000ac100)> <https://ci.centos.org/job/libvirt-go-check/systems=libvirt-fedora-30/ws/api_test.go>:503 +0x551 testing.tRunner(0xc0000ac100, 0x622630) /usr/lib/golang/src/testing/testing.go:865 +0xc0 created by testing.(*T).Run /usr/lib/golang/src/testing/testing.go:916 +0x35a exit status 2 FAIL _<https://ci.centos.org/job/libvirt-go-check/systems=libvirt-fedora-30/ws/> 1.852s Build step 'Execute shell' marked build as failure

See <https://ci.centos.org/job/libvirt-go-check/systems=libvirt-fedora-30/936/display/redirect> ------------------------------------------ Started by upstream project "libvirt-go-check" build number 936 originally caused by: Started by upstream project "libvirt-go-build" build number 950 originally caused by: Started by upstream project "libvirt-build" build number 1124 originally caused by: Started by an SCM change Running as SYSTEM [EnvInject] - Loading node environment variables. Building remotely on libvirt-fedora-30 (libvirt) in workspace <https://ci.centos.org/job/libvirt-go-check/systems=libvirt-fedora-30/ws/> [libvirt-go] $ /bin/sh -xe /tmp/jenkins16513063289680667895.sh + export 'TEST_ARGS=-tags api' + TEST_ARGS='-tags api' + go test -tags api Missing enum 'VIR_DOMAIN_GET_HOSTNAME_AGENT' Missing enum 'VIR_DOMAIN_GET_HOSTNAME_LEASE' Missing enum 'VIR_ERR_NO_HOSTNAME' --- FAIL: TestAPICoverage (1.87s) panic: Missing symbols found [recovered] panic: Missing symbols found goroutine 4 [running]: testing.tRunner.func1(0xc0000ca100) /usr/lib/golang/src/testing/testing.go:830 +0x392 panic(0x5d26a0, 0x648190) /usr/lib/golang/src/runtime/panic.go:522 +0x1b5 _<https://ci.centos.org/job/libvirt-go-check/systems=libvirt-fedora-30/ws/.TestAPICoverage(0xc0000ca100)> <https://ci.centos.org/job/libvirt-go-check/systems=libvirt-fedora-30/ws/api_test.go>:503 +0x551 testing.tRunner(0xc0000ca100, 0x622630) /usr/lib/golang/src/testing/testing.go:865 +0xc0 created by testing.(*T).Run /usr/lib/golang/src/testing/testing.go:916 +0x35a exit status 2 FAIL _<https://ci.centos.org/job/libvirt-go-check/systems=libvirt-fedora-30/ws/> 2.143s Build step 'Execute shell' marked build as failure

See <https://ci.centos.org/job/libvirt-go-check/systems=libvirt-fedora-30/937/display/redirect> ------------------------------------------ Started by upstream project "libvirt-go-check" build number 937 originally caused by: Started by upstream project "libvirt-go-build" build number 951 originally caused by: Started by upstream project "libvirt-build" build number 1125 originally caused by: Started by an SCM change Running as SYSTEM [EnvInject] - Loading node environment variables. Building remotely on libvirt-fedora-30 (libvirt) in workspace <https://ci.centos.org/job/libvirt-go-check/systems=libvirt-fedora-30/ws/> [libvirt-go] $ /bin/sh -xe /tmp/jenkins6673437883821568484.sh + export 'TEST_ARGS=-tags api' + TEST_ARGS='-tags api' + go test -tags api Missing enum 'VIR_DOMAIN_GET_HOSTNAME_AGENT' Missing enum 'VIR_DOMAIN_GET_HOSTNAME_LEASE' Missing enum 'VIR_ERR_NO_HOSTNAME' --- FAIL: TestAPICoverage (0.83s) panic: Missing symbols found [recovered] panic: Missing symbols found goroutine 5 [running]: testing.tRunner.func1(0xc0000ac100) /usr/lib/golang/src/testing/testing.go:830 +0x392 panic(0x5d26a0, 0x648190) /usr/lib/golang/src/runtime/panic.go:522 +0x1b5 _<https://ci.centos.org/job/libvirt-go-check/systems=libvirt-fedora-30/ws/.TestAPICoverage(0xc0000ac100)> <https://ci.centos.org/job/libvirt-go-check/systems=libvirt-fedora-30/ws/api_test.go>:503 +0x551 testing.tRunner(0xc0000ac100, 0x622630) /usr/lib/golang/src/testing/testing.go:865 +0xc0 created by testing.(*T).Run /usr/lib/golang/src/testing/testing.go:916 +0x35a exit status 2 FAIL _<https://ci.centos.org/job/libvirt-go-check/systems=libvirt-fedora-30/ws/> 1.025s Build step 'Execute shell' marked build as failure

See <https://ci.centos.org/job/libvirt-go-check/systems=libvirt-fedora-30/938/display/redirect> ------------------------------------------ Started by upstream project "libvirt-go-check" build number 938 originally caused by: Started by upstream project "libvirt-go-build" build number 952 originally caused by: Started by upstream project "libvirt-build" build number 1126 originally caused by: Started by an SCM change Started by an SCM change Started by an SCM change Started by an SCM change Running as SYSTEM [EnvInject] - Loading node environment variables. Building remotely on libvirt-fedora-30 (libvirt) in workspace <https://ci.centos.org/job/libvirt-go-check/systems=libvirt-fedora-30/ws/> [libvirt-go] $ /bin/sh -xe /tmp/jenkins8369194782644421850.sh + export 'TEST_ARGS=-tags api' + TEST_ARGS='-tags api' + go test -tags api Missing enum 'VIR_DOMAIN_GET_HOSTNAME_AGENT' Missing enum 'VIR_DOMAIN_GET_HOSTNAME_LEASE' Missing enum 'VIR_ERR_NO_HOSTNAME' --- FAIL: TestAPICoverage (1.21s) panic: Missing symbols found [recovered] panic: Missing symbols found goroutine 5 [running]: testing.tRunner.func1(0xc0000ac100) /usr/lib/golang/src/testing/testing.go:830 +0x392 panic(0x5d26a0, 0x648190) /usr/lib/golang/src/runtime/panic.go:522 +0x1b5 _<https://ci.centos.org/job/libvirt-go-check/systems=libvirt-fedora-30/ws/.TestAPICoverage(0xc0000ac100)> <https://ci.centos.org/job/libvirt-go-check/systems=libvirt-fedora-30/ws/api_test.go>:503 +0x551 testing.tRunner(0xc0000ac100, 0x622630) /usr/lib/golang/src/testing/testing.go:865 +0xc0 created by testing.(*T).Run /usr/lib/golang/src/testing/testing.go:916 +0x35a exit status 2 FAIL _<https://ci.centos.org/job/libvirt-go-check/systems=libvirt-fedora-30/ws/> 1.491s Build step 'Execute shell' marked build as failure

See <https://ci.centos.org/job/libvirt-go-check/systems=libvirt-fedora-30/939/display/redirect> ------------------------------------------ Started by upstream project "libvirt-go-check" build number 939 originally caused by: Started by upstream project "libvirt-go-build" build number 953 originally caused by: Started by upstream project "libvirt-build" build number 1127 originally caused by: Started by an SCM change Started by an SCM change Running as SYSTEM [EnvInject] - Loading node environment variables. Building remotely on libvirt-fedora-30 (libvirt) in workspace <https://ci.centos.org/job/libvirt-go-check/systems=libvirt-fedora-30/ws/> [libvirt-go] $ /bin/sh -xe /tmp/jenkins6662346995623593475.sh + export 'TEST_ARGS=-tags api' + TEST_ARGS='-tags api' + go test -tags api Missing enum 'VIR_DOMAIN_GET_HOSTNAME_AGENT' Missing enum 'VIR_DOMAIN_GET_HOSTNAME_LEASE' Missing enum 'VIR_ERR_NO_HOSTNAME' --- FAIL: TestAPICoverage (0.67s) panic: Missing symbols found [recovered] panic: Missing symbols found goroutine 5 [running]: testing.tRunner.func1(0xc0000ac100) /usr/lib/golang/src/testing/testing.go:830 +0x392 panic(0x5d26a0, 0x648190) /usr/lib/golang/src/runtime/panic.go:522 +0x1b5 _<https://ci.centos.org/job/libvirt-go-check/systems=libvirt-fedora-30/ws/.TestAPICoverage(0xc0000ac100)> <https://ci.centos.org/job/libvirt-go-check/systems=libvirt-fedora-30/ws/api_test.go>:503 +0x551 testing.tRunner(0xc0000ac100, 0x622630) /usr/lib/golang/src/testing/testing.go:865 +0xc0 created by testing.(*T).Run /usr/lib/golang/src/testing/testing.go:916 +0x35a exit status 2 FAIL _<https://ci.centos.org/job/libvirt-go-check/systems=libvirt-fedora-30/ws/> 0.798s Build step 'Execute shell' marked build as failure

See <https://ci.centos.org/job/libvirt-go-check/systems=libvirt-fedora-30/940/display/redirect> ------------------------------------------ Started by upstream project "libvirt-go-check" build number 940 originally caused by: Started by upstream project "libvirt-go-build" build number 954 originally caused by: Started by upstream project "libvirt-build" build number 1128 originally caused by: Started by an SCM change Running as SYSTEM [EnvInject] - Loading node environment variables. Building remotely on libvirt-fedora-30 (libvirt) in workspace <https://ci.centos.org/job/libvirt-go-check/systems=libvirt-fedora-30/ws/> [libvirt-go] $ /bin/sh -xe /tmp/jenkins4973227265326563057.sh + export 'TEST_ARGS=-tags api' + TEST_ARGS='-tags api' + go test -tags api Missing enum 'VIR_DOMAIN_GET_HOSTNAME_AGENT' Missing enum 'VIR_DOMAIN_GET_HOSTNAME_LEASE' Missing enum 'VIR_ERR_NO_HOSTNAME' --- FAIL: TestAPICoverage (0.34s) panic: Missing symbols found [recovered] panic: Missing symbols found goroutine 18 [running]: testing.tRunner.func1(0xc0000c0100) /usr/lib/golang/src/testing/testing.go:830 +0x392 panic(0x5d26a0, 0x648190) /usr/lib/golang/src/runtime/panic.go:522 +0x1b5 _<https://ci.centos.org/job/libvirt-go-check/systems=libvirt-fedora-30/ws/.TestAPICoverage(0xc0000c0100)> <https://ci.centos.org/job/libvirt-go-check/systems=libvirt-fedora-30/ws/api_test.go>:503 +0x551 testing.tRunner(0xc0000c0100, 0x622630) /usr/lib/golang/src/testing/testing.go:865 +0xc0 created by testing.(*T).Run /usr/lib/golang/src/testing/testing.go:916 +0x35a exit status 2 FAIL _<https://ci.centos.org/job/libvirt-go-check/systems=libvirt-fedora-30/ws/> 0.437s Build step 'Execute shell' marked build as failure

See <https://ci.centos.org/job/libvirt-go-check/systems=libvirt-fedora-30/941/display/redirect> ------------------------------------------ Started by upstream project "libvirt-go-check" build number 941 originally caused by: Started by upstream project "libvirt-go-build" build number 955 originally caused by: Started by upstream project "libvirt-build" build number 1131 originally caused by: Started by an SCM change Running as SYSTEM [EnvInject] - Loading node environment variables. Building remotely on libvirt-fedora-30 (libvirt) in workspace <https://ci.centos.org/job/libvirt-go-check/systems=libvirt-fedora-30/ws/> [libvirt-go] $ /bin/sh -xe /tmp/jenkins7508718056294901449.sh + export 'TEST_ARGS=-tags api' + TEST_ARGS='-tags api' + go test -tags api Missing enum 'VIR_DOMAIN_GET_HOSTNAME_AGENT' Missing enum 'VIR_DOMAIN_GET_HOSTNAME_LEASE' Missing enum 'VIR_ERR_NO_HOSTNAME' --- FAIL: TestAPICoverage (1.41s) panic: Missing symbols found [recovered] panic: Missing symbols found goroutine 5 [running]: testing.tRunner.func1(0xc0000ac100) /usr/lib/golang/src/testing/testing.go:830 +0x392 panic(0x5d26a0, 0x648190) /usr/lib/golang/src/runtime/panic.go:522 +0x1b5 _<https://ci.centos.org/job/libvirt-go-check/systems=libvirt-fedora-30/ws/.TestAPICoverage(0xc0000ac100)> <https://ci.centos.org/job/libvirt-go-check/systems=libvirt-fedora-30/ws/api_test.go>:503 +0x551 testing.tRunner(0xc0000ac100, 0x622630) /usr/lib/golang/src/testing/testing.go:865 +0xc0 created by testing.(*T).Run /usr/lib/golang/src/testing/testing.go:916 +0x35a exit status 2 FAIL _<https://ci.centos.org/job/libvirt-go-check/systems=libvirt-fedora-30/ws/> 1.720s Build step 'Execute shell' marked build as failure

See <https://ci.centos.org/job/libvirt-go-check/systems=libvirt-fedora-30/942/display/redirect> ------------------------------------------ Started by upstream project "libvirt-go-check" build number 942 originally caused by: Started by upstream project "libvirt-go-build" build number 956 originally caused by: Started by upstream project "libvirt-build" build number 1132 originally caused by: Started by an SCM change Started by an SCM change Started by an SCM change Started by an SCM change Running as SYSTEM [EnvInject] - Loading node environment variables. Building remotely on libvirt-fedora-30 (libvirt) in workspace <https://ci.centos.org/job/libvirt-go-check/systems=libvirt-fedora-30/ws/> [libvirt-go] $ /bin/sh -xe /tmp/jenkins7469931464685120634.sh + export 'TEST_ARGS=-tags api' + TEST_ARGS='-tags api' + go test -tags api Missing enum 'VIR_DOMAIN_GET_HOSTNAME_AGENT' Missing enum 'VIR_DOMAIN_GET_HOSTNAME_LEASE' Missing enum 'VIR_ERR_NO_HOSTNAME' --- FAIL: TestAPICoverage (1.48s) panic: Missing symbols found [recovered] panic: Missing symbols found goroutine 5 [running]: testing.tRunner.func1(0xc0000ac100) /usr/lib/golang/src/testing/testing.go:830 +0x392 panic(0x5d26a0, 0x648190) /usr/lib/golang/src/runtime/panic.go:522 +0x1b5 _<https://ci.centos.org/job/libvirt-go-check/systems=libvirt-fedora-30/ws/.TestAPICoverage(0xc0000ac100)> <https://ci.centos.org/job/libvirt-go-check/systems=libvirt-fedora-30/ws/api_test.go>:503 +0x551 testing.tRunner(0xc0000ac100, 0x622630) /usr/lib/golang/src/testing/testing.go:865 +0xc0 created by testing.(*T).Run /usr/lib/golang/src/testing/testing.go:916 +0x35a exit status 2 FAIL _<https://ci.centos.org/job/libvirt-go-check/systems=libvirt-fedora-30/ws/> 1.856s Build step 'Execute shell' marked build as failure

See <https://ci.centos.org/job/libvirt-go-check/systems=libvirt-fedora-30/943/display/redirect> ------------------------------------------ Started by upstream project "libvirt-go-check" build number 943 originally caused by: Started by upstream project "libvirt-go-build" build number 957 originally caused by: Started by upstream project "libvirt-build" build number 1133 originally caused by: Started by an SCM change Running as SYSTEM [EnvInject] - Loading node environment variables. Building remotely on libvirt-fedora-30 (libvirt) in workspace <https://ci.centos.org/job/libvirt-go-check/systems=libvirt-fedora-30/ws/> [libvirt-go] $ /bin/sh -xe /tmp/jenkins14815109149419778504.sh + export 'TEST_ARGS=-tags api' + TEST_ARGS='-tags api' + go test -tags api Missing enum 'VIR_DOMAIN_GET_HOSTNAME_AGENT' Missing enum 'VIR_DOMAIN_GET_HOSTNAME_LEASE' Missing enum 'VIR_ERR_NO_HOSTNAME' --- FAIL: TestAPICoverage (0.42s) panic: Missing symbols found [recovered] panic: Missing symbols found goroutine 18 [running]: testing.tRunner.func1(0xc0000b8100) /usr/lib/golang/src/testing/testing.go:830 +0x392 panic(0x5d26a0, 0x648190) /usr/lib/golang/src/runtime/panic.go:522 +0x1b5 _<https://ci.centos.org/job/libvirt-go-check/systems=libvirt-fedora-30/ws/.TestAPICoverage(0xc0000b8100)> <https://ci.centos.org/job/libvirt-go-check/systems=libvirt-fedora-30/ws/api_test.go>:503 +0x551 testing.tRunner(0xc0000b8100, 0x622630) /usr/lib/golang/src/testing/testing.go:865 +0xc0 created by testing.(*T).Run /usr/lib/golang/src/testing/testing.go:916 +0x35a exit status 2 FAIL _<https://ci.centos.org/job/libvirt-go-check/systems=libvirt-fedora-30/ws/> 0.516s Build step 'Execute shell' marked build as failure

participants (1)
-
ci@centos.org