[Libvirt-ci] Build failed in Jenkins: libvirt-check » libvirt-fedora-31 #815

See <https://ci.centos.org/job/libvirt-check/systems=libvirt-fedora-31/815/display/redirect> ------------------------------------------ [...truncated 19.59 KB...] CC uniwidth/test-uc_width.o CC uniwidth/test-uc_width2.o CCLD test-unlockpt CCLD test-unsetenv CCLD test-usleep CCLD test-vasnprintf CCLD test-verify CCLD test-vsnprintf CCLD test-wchar CCLD test-wcrtomb CCLD test-wcrtomb-w32 CCLD test-wctype-h CCLD test-wcwidth CCLD test-write CCLD test-xalloc-die CCLD test-uc_width CCLD test-uc_width2 gmake[4]: Leaving directory '<https://ci.centos.org/job/libvirt-check/systems=libvirt-fedora-31/ws/build/gnulib/tests'> /usr/bin/gmake check-TESTS gmake[4]: Entering directory '<https://ci.centos.org/job/libvirt-check/systems=libvirt-fedora-31/ws/build/gnulib/tests'> gmake[5]: Entering directory '<https://ci.centos.org/job/libvirt-check/systems=libvirt-fedora-31/ws/build/gnulib/tests'> PASS: test-alloca-opt PASS: test-arpa_inet PASS: test-accept SKIP: test-btowc1.sh PASS: test-bind PASS: test-binary-io.sh SKIP: test-btowc2.sh PASS: test-c-ctype PASS: test-c-strcase.sh PASS: test-canonicalize-lgpl PASS: test-cloexec PASS: test-chown PASS: test-close PASS: test-connect PASS: test-ctype PASS: test-dup PASS: test-errno PASS: test-dup2 PASS: test-environ PASS: test-fcntl-h PASS: test-fcntl PASS: test-fclose PASS: test-fflush PASS: test-fdopen PASS: test-fdatasync PASS: test-fgetc PASS: test-fflush2.sh PASS: test-float PASS: test-fnmatch PASS: test-fnmatch-h PASS: test-fpurge PASS: test-fputc PASS: test-freading PASS: test-fread PASS: test-fseek2.sh PASS: test-fseek.sh PASS: test-fseeko2.sh PASS: test-fseeko.sh PASS: test-fseeko3.sh PASS: test-fseeko4.sh PASS: test-fstat PASS: test-ftell.sh PASS: test-ftell2.sh PASS: test-ftell3 PASS: test-fsync PASS: test-ftello2.sh PASS: test-ftello.sh PASS: test-ftello3 PASS: test-ftruncate.sh PASS: test-ftello4.sh PASS: test-fwrite PASS: test-getcwd-lgpl PASS: test-getdelim PASS: test-getdtablesize PASS: test-getgroups PASS: test-gethostname PASS: test-getaddrinfo PASS: test-getline PASS: test-getpeername PASS: test-getprogname PASS: test-getsockname PASS: test-getsockopt PASS: test-gettimeofday PASS: test-grantpt PASS: test-inet_ntop PASS: test-ignore-value PASS: test-inet_pton PASS: test-intprops PASS: test-inttypes PASS: test-ioctl PASS: test-isatty PASS: test-isblank PASS: test-langinfo PASS: test-limits-h PASS: test-localeconv PASS: test-locale PASS: test-listen PASS: test-lstat PASS: test-localename PASS: test-lseek.sh SKIP: test-mbrtowc1.sh SKIP: test-mbrtowc2.sh SKIP: test-mbrtowc3.sh SKIP: test-mbrtowc4.sh PASS: test-mbrtowc5.sh PASS: test-malloca SKIP: test-mbrtowc-w32-1.sh SKIP: test-mbrtowc-w32-3.sh SKIP: test-mbrtowc-w32-2.sh SKIP: test-mbrtowc-w32-4.sh SKIP: test-mbrtowc-w32-5.sh SKIP: test-mbsrtowcs1.sh SKIP: test-mbsinit.sh SKIP: test-mbsrtowcs4.sh SKIP: test-mbsrtowcs2.sh SKIP: test-mbsrtowcs3.sh PASS: test-net_if PASS: test-netdb PASS: test-netinet_in PASS: test-nanosleep PASS: test-memchr PASS: test-nonblocking PASS: test-open PASS: test-openpty PASS: test-passfd PASS: test-pathmax PASS: test-perror.sh PASS: test-perror2 PASS: test-pipe PASS: test-pipe2 PASS: test-poll-h PASS: test-poll PASS: test-posix_openpt PASS: test-posix_spawn_file_actions_addclose PASS: test-posix_spawn_file_actions_adddup2 PASS: test-posix_spawn_file_actions_addopen PASS: test-posix_spawn1 PASS: test-posix_spawn2 PASS: test-pthread PASS: test-pthread-thread PASS: test-pthread_sigmask1 PASS: test-nonblocking-pipe.sh SKIP: test-ptsname SKIP: test-ptsname_r PASS: test-raise PASS: test-rawmemchr PASS: test-read PASS: test-readlink PASS: test-recv PASS: test-sched PASS: test-select PASS: test-pthread_sigmask2 PASS: test-select-out.sh PASS: test-send PASS: test-setenv SKIP: test-setlocale1.sh PASS: test-setlocale2.sh PASS: test-setsockopt PASS: test-sigaction PASS: test-signal-h PASS: test-sigpipe.sh PASS: test-nonblocking-socket.sh PASS: test-select-in.sh PASS: test-snprintf PASS: test-sockets PASS: test-spawn PASS: test-stat PASS: test-stat-time PASS: test-stdalign PASS: test-stdbool PASS: test-stddef PASS: test-stdint PASS: test-stdio PASS: test-stdlib PASS: test-strchrnul PASS: test-strerror PASS: test-strerror_r PASS: test-string PASS: test-strings PASS: test-symlink PASS: test-sys_ioctl PASS: test-sys_select PASS: test-sys_socket PASS: test-sys_stat PASS: test-sys_time PASS: test-sys_types PASS: test-sys_uio PASS: test-sys_utsname PASS: test-sys_wait PASS: test-sigprocmask PASS: test-termios PASS: test-sleep PASS: test-time SKIP: test-ttyname_r PASS: test-uname PASS: test-unistd PASS: test-uc_width PASS: test-unlockpt PASS: test-init.sh PASS: uniwidth/test-uc_width2.sh PASS: test-unsetenv PASS: test-vasnprintf PASS: test-verify PASS: test-vsnprintf PASS: test-wchar PASS: test-wcrtomb.sh SKIP: test-wcrtomb-w32-1.sh SKIP: test-wcrtomb-w32-2.sh SKIP: test-wcrtomb-w32-3.sh SKIP: test-wcrtomb-w32-4.sh SKIP: test-wcrtomb-w32-5.sh PASS: test-wctype-h PASS: test-wcwidth PASS: test-write PASS: test-xalloc-die.sh ../../../build-aux/test-driver: line 107: 1584517 Aborted (core dumped) "$@" > $log_file 2>&1 FAIL: test-usleep PASS: test-verify.sh ============================================================================ Testsuite summary for libvirt 6.0.0 ============================================================================ # TOTAL: 197 # PASS: 171 # SKIP: 25 # XFAIL: 0 # FAIL: 1 # XPASS: 0 # ERROR: 0 ============================================================================ See gnulib/tests/test-suite.log Please report to libvir-list@redhat.com ============================================================================ gmake[5]: *** [Makefile:4789: test-suite.log] Error 1 gmake[5]: Leaving directory '<https://ci.centos.org/job/libvirt-check/systems=libvirt-fedora-31/ws/build/gnulib/tests'> gmake[4]: *** [Makefile:4897: check-TESTS] Error 2 gmake[4]: Leaving directory '<https://ci.centos.org/job/libvirt-check/systems=libvirt-fedora-31/ws/build/gnulib/tests'> gmake[3]: *** [Makefile:6368: check-am] Error 2 gmake[3]: Leaving directory '<https://ci.centos.org/job/libvirt-check/systems=libvirt-fedora-31/ws/build/gnulib/tests'> gmake[2]: *** [Makefile:4681: check-recursive] Error 1 gmake[2]: Leaving directory '<https://ci.centos.org/job/libvirt-check/systems=libvirt-fedora-31/ws/build/gnulib/tests'> gmake[1]: *** [Makefile:6370: check] Error 2 gmake[1]: Leaving directory '<https://ci.centos.org/job/libvirt-check/systems=libvirt-fedora-31/ws/build/gnulib/tests'> gmake: *** [Makefile:1957: check-recursive] Error 1 + cat tests/test-suite.log cat: tests/test-suite.log: No such file or directory + true + exit 1 Build step 'Execute shell' marked build as failure

participants (1)
-
ci@centos.org