[Libvirt-ci] Build failed in Jenkins: libvirt-go-xml-check » libvirt-freebsd-11 #173

See <https://ci.centos.org/job/libvirt-go-xml-check/systems=libvirt-freebsd-11/173/display/redirect> ------------------------------------------ Started by upstream project "libvirt-go-xml-check" build number 173 originally caused by: Started by upstream project "libvirt-go-xml-build" build number 173 originally caused by: Started by upstream project "libvirt-build" build number 205 originally caused by: Started by an SCM change [EnvInject] - Loading node environment variables. Building remotely on libvirt-freebsd-11 (libvirt) in workspace <https://ci.centos.org/job/libvirt-go-xml-check/systems=libvirt-freebsd-11/ws/> [libvirt-go-xml] $ /bin/sh -xe /tmp/jenkins2816723782626507395.sh + export 'TEST_ARGS=-tags xmlroundtrip' + go test -tags xmlroundtrip --- FAIL: TestRoundTrip (22.37s) xml_test.go:400: testdata/libvirt/tests/qemuxml2argvdata/memory-hotplug-nvdimm-align.xml: /domain[0]/devices[0]/memory[0]/source[0]/alignsize[0]: element in expected XML missing in actual XML FAIL exit status 1 FAIL _/usr<https://ci.centos.org/job/libvirt-go-xml-check/systems=libvirt-freebsd-11/ws/> 22.431s Build step 'Execute shell' marked build as failure

See <https://ci.centos.org/job/libvirt-go-xml-check/systems=libvirt-freebsd-11/174/display/redirect> ------------------------------------------ Started by upstream project "libvirt-go-xml-check" build number 174 originally caused by: Started by upstream project "libvirt-go-xml-build" build number 174 originally caused by: Started by upstream project "libvirt-build" build number 206 originally caused by: Started by an SCM change [EnvInject] - Loading node environment variables. Building remotely on libvirt-freebsd-11 (libvirt) in workspace <https://ci.centos.org/job/libvirt-go-xml-check/systems=libvirt-freebsd-11/ws/> [libvirt-go-xml] $ /bin/sh -xe /tmp/jenkins4768339615210250418.sh + export 'TEST_ARGS=-tags xmlroundtrip' + go test -tags xmlroundtrip --- FAIL: TestRoundTrip (5.48s) xml_test.go:400: testdata/libvirt/tests/qemuxml2argvdata/memory-hotplug-nvdimm-align.xml: /domain[0]/devices[0]/memory[0]/source[0]/alignsize[0]: element in expected XML missing in actual XML FAIL exit status 1 FAIL _/usr<https://ci.centos.org/job/libvirt-go-xml-check/systems=libvirt-freebsd-11/ws/> 5.575s Build step 'Execute shell' marked build as failure

See <https://ci.centos.org/job/libvirt-go-xml-check/systems=libvirt-freebsd-11/175/display/redirect> ------------------------------------------ Started by upstream project "libvirt-go-xml-check" build number 175 originally caused by: Started by upstream project "libvirt-go-xml-build" build number 175 originally caused by: Started by upstream project "libvirt-build" build number 209 originally caused by: Started by an SCM change [EnvInject] - Loading node environment variables. Building remotely on libvirt-freebsd-11 (libvirt) in workspace <https://ci.centos.org/job/libvirt-go-xml-check/systems=libvirt-freebsd-11/ws/> [libvirt-go-xml] $ /bin/sh -xe /tmp/jenkins4845449219057856882.sh + export 'TEST_ARGS=-tags xmlroundtrip' + go test -tags xmlroundtrip --- FAIL: TestRoundTrip (16.15s) xml_test.go:400: testdata/libvirt/tests/qemuxml2argvdata/memory-hotplug-nvdimm-align.xml: /domain[0]/devices[0]/memory[0]/source[0]/alignsize[0]: element in expected XML missing in actual XML FAIL exit status 1 FAIL _/usr<https://ci.centos.org/job/libvirt-go-xml-check/systems=libvirt-freebsd-11/ws/> 16.241s Build step 'Execute shell' marked build as failure

See <https://ci.centos.org/job/libvirt-go-xml-check/systems=libvirt-freebsd-11/176/display/redirect> ------------------------------------------ Started by upstream project "libvirt-go-xml-check" build number 176 originally caused by: Started by upstream project "libvirt-go-xml-build" build number 176 originally caused by: Started by upstream project "libvirt-build" build number 210 originally caused by: Started by an SCM change [EnvInject] - Loading node environment variables. Building remotely on libvirt-freebsd-11 (libvirt) in workspace <https://ci.centos.org/job/libvirt-go-xml-check/systems=libvirt-freebsd-11/ws/> [libvirt-go-xml] $ /bin/sh -xe /tmp/jenkins5464919244262364904.sh + export 'TEST_ARGS=-tags xmlroundtrip' + go test -tags xmlroundtrip --- FAIL: TestRoundTrip (6.74s) xml_test.go:400: testdata/libvirt/tests/qemuxml2argvdata/memory-hotplug-nvdimm-align.xml: /domain[0]/devices[0]/memory[0]/source[0]/alignsize[0]: element in expected XML missing in actual XML FAIL exit status 1 FAIL _/usr<https://ci.centos.org/job/libvirt-go-xml-check/systems=libvirt-freebsd-11/ws/> 6.781s Build step 'Execute shell' marked build as failure

See <https://ci.centos.org/job/libvirt-go-xml-check/systems=libvirt-freebsd-11/177/display/redirect> ------------------------------------------ Started by upstream project "libvirt-go-xml-check" build number 177 originally caused by: Started by upstream project "libvirt-go-xml-build" build number 177 originally caused by: Started by upstream project "libvirt-build" build number 211 originally caused by: Started by an SCM change [EnvInject] - Loading node environment variables. Building remotely on libvirt-freebsd-11 (libvirt) in workspace <https://ci.centos.org/job/libvirt-go-xml-check/systems=libvirt-freebsd-11/ws/> [libvirt-go-xml] $ /bin/sh -xe /tmp/jenkins6996914161664016564.sh + export 'TEST_ARGS=-tags xmlroundtrip' + go test -tags xmlroundtrip --- FAIL: TestRoundTrip (8.69s) xml_test.go:400: testdata/libvirt/tests/qemuxml2argvdata/memory-hotplug-nvdimm-align.xml: /domain[0]/devices[0]/memory[0]/source[0]/alignsize[0]: element in expected XML missing in actual XML FAIL exit status 1 FAIL _/usr<https://ci.centos.org/job/libvirt-go-xml-check/systems=libvirt-freebsd-11/ws/> 8.811s Build step 'Execute shell' marked build as failure

See <https://ci.centos.org/job/libvirt-go-xml-check/systems=libvirt-freebsd-11/178/display/redirect> ------------------------------------------ Started by upstream project "libvirt-go-xml-check" build number 178 originally caused by: Started by upstream project "libvirt-go-xml-build" build number 178 originally caused by: Started by upstream project "libvirt-build" build number 212 originally caused by: Started by an SCM change Started by an SCM change Started by an SCM change Started by an SCM change Started by an SCM change Started by an SCM change Started by an SCM change [EnvInject] - Loading node environment variables. Building remotely on libvirt-freebsd-11 (libvirt) in workspace <https://ci.centos.org/job/libvirt-go-xml-check/systems=libvirt-freebsd-11/ws/> [libvirt-go-xml] $ /bin/sh -xe /tmp/jenkins4007650181271337907.sh + export 'TEST_ARGS=-tags xmlroundtrip' + go test -tags xmlroundtrip --- FAIL: TestRoundTrip (4.71s) xml_test.go:400: testdata/libvirt/tests/qemuxml2argvdata/memory-hotplug-nvdimm-align.xml: /domain[0]/devices[0]/memory[0]/source[0]/alignsize[0]: element in expected XML missing in actual XML FAIL exit status 1 FAIL _/usr<https://ci.centos.org/job/libvirt-go-xml-check/systems=libvirt-freebsd-11/ws/> 4.794s Build step 'Execute shell' marked build as failure

See <https://ci.centos.org/job/libvirt-go-xml-check/systems=libvirt-freebsd-11/179/display/redirect> ------------------------------------------ Started by upstream project "libvirt-go-xml-check" build number 179 originally caused by: Started by upstream project "libvirt-go-xml-build" build number 179 originally caused by: Started by upstream project "libvirt-build" build number 213 originally caused by: Started by an SCM change [EnvInject] - Loading node environment variables. Building remotely on libvirt-freebsd-11 (libvirt) in workspace <https://ci.centos.org/job/libvirt-go-xml-check/systems=libvirt-freebsd-11/ws/> [libvirt-go-xml] $ /bin/sh -xe /tmp/jenkins211050422841600838.sh + export 'TEST_ARGS=-tags xmlroundtrip' + go test -tags xmlroundtrip --- FAIL: TestRoundTrip (10.89s) xml_test.go:400: testdata/libvirt/tests/qemuxml2argvdata/memory-hotplug-nvdimm-align.xml: /domain[0]/devices[0]/memory[0]/source[0]/alignsize[0]: element in expected XML missing in actual XML FAIL exit status 1 FAIL _/usr<https://ci.centos.org/job/libvirt-go-xml-check/systems=libvirt-freebsd-11/ws/> 11.024s Build step 'Execute shell' marked build as failure

See <https://ci.centos.org/job/libvirt-go-xml-check/systems=libvirt-freebsd-11/180/display/redirect> ------------------------------------------ Started by upstream project "libvirt-go-xml-check" build number 180 originally caused by: Started by upstream project "libvirt-go-xml-build" build number 180 originally caused by: Started by upstream project "libvirt-build" build number 214 originally caused by: Started by an SCM change [EnvInject] - Loading node environment variables. Building remotely on libvirt-freebsd-11 (libvirt) in workspace <https://ci.centos.org/job/libvirt-go-xml-check/systems=libvirt-freebsd-11/ws/> [libvirt-go-xml] $ /bin/sh -xe /tmp/jenkins2895167100031465967.sh + export 'TEST_ARGS=-tags xmlroundtrip' + go test -tags xmlroundtrip --- FAIL: TestRoundTrip (30.57s) xml_test.go:400: testdata/libvirt/tests/qemuxml2argvdata/memory-hotplug-nvdimm-align.xml: /domain[0]/devices[0]/memory[0]/source[0]/alignsize[0]: element in expected XML missing in actual XML FAIL exit status 1 FAIL _/usr<https://ci.centos.org/job/libvirt-go-xml-check/systems=libvirt-freebsd-11/ws/> 30.693s Build step 'Execute shell' marked build as failure

See <https://ci.centos.org/job/libvirt-go-xml-check/systems=libvirt-freebsd-11/181/display/redirect> ------------------------------------------ Started by upstream project "libvirt-go-xml-check" build number 181 originally caused by: Started by upstream project "libvirt-go-xml-build" build number 181 originally caused by: Started by upstream project "libvirt-build" build number 215 originally caused by: Started by an SCM change [EnvInject] - Loading node environment variables. Building remotely on libvirt-freebsd-11 (libvirt) in workspace <https://ci.centos.org/job/libvirt-go-xml-check/systems=libvirt-freebsd-11/ws/> [libvirt-go-xml] $ /bin/sh -xe /tmp/jenkins3845967510623107454.sh + export 'TEST_ARGS=-tags xmlroundtrip' + go test -tags xmlroundtrip --- FAIL: TestRoundTrip (11.28s) xml_test.go:400: testdata/libvirt/tests/qemuxml2argvdata/memory-hotplug-nvdimm-align.xml: /domain[0]/devices[0]/memory[0]/source[0]/alignsize[0]: element in expected XML missing in actual XML FAIL exit status 1 FAIL _/usr<https://ci.centos.org/job/libvirt-go-xml-check/systems=libvirt-freebsd-11/ws/> 11.647s Build step 'Execute shell' marked build as failure

See <https://ci.centos.org/job/libvirt-go-xml-check/systems=libvirt-freebsd-11/182/display/redirect> ------------------------------------------ Started by upstream project "libvirt-go-xml-check" build number 182 originally caused by: Started by upstream project "libvirt-go-xml-build" build number 182 originally caused by: Started by upstream project "libvirt-build" build number 216 originally caused by: Started by an SCM change Started by an SCM change Started by an SCM change [EnvInject] - Loading node environment variables. Building remotely on libvirt-freebsd-11 (libvirt) in workspace <https://ci.centos.org/job/libvirt-go-xml-check/systems=libvirt-freebsd-11/ws/> [libvirt-go-xml] $ /bin/sh -xe /tmp/jenkins2548057042147961466.sh + export 'TEST_ARGS=-tags xmlroundtrip' + go test -tags xmlroundtrip --- FAIL: TestRoundTrip (12.29s) xml_test.go:400: testdata/libvirt/tests/qemuxml2argvdata/memory-hotplug-nvdimm-align.xml: /domain[0]/devices[0]/memory[0]/source[0]/alignsize[0]: element in expected XML missing in actual XML FAIL exit status 1 FAIL _/usr<https://ci.centos.org/job/libvirt-go-xml-check/systems=libvirt-freebsd-11/ws/> 12.388s Build step 'Execute shell' marked build as failure

See <https://ci.centos.org/job/libvirt-go-xml-check/systems=libvirt-freebsd-11/183/display/redirect> ------------------------------------------ Started by upstream project "libvirt-go-xml-check" build number 183 originally caused by: Started by upstream project "libvirt-go-xml-build" build number 183 originally caused by: Started by upstream project "libvirt-build" build number 217 originally caused by: Started by an SCM change [EnvInject] - Loading node environment variables. Building remotely on libvirt-freebsd-11 (libvirt) in workspace <https://ci.centos.org/job/libvirt-go-xml-check/systems=libvirt-freebsd-11/ws/> [libvirt-go-xml] $ /bin/sh -xe /tmp/jenkins7677498587654387336.sh + export 'TEST_ARGS=-tags xmlroundtrip' + go test -tags xmlroundtrip --- FAIL: TestRoundTrip (9.92s) xml_test.go:400: testdata/libvirt/tests/qemuxml2argvdata/memory-hotplug-nvdimm-align.xml: /domain[0]/devices[0]/memory[0]/source[0]/alignsize[0]: element in expected XML missing in actual XML FAIL exit status 1 FAIL _/usr<https://ci.centos.org/job/libvirt-go-xml-check/systems=libvirt-freebsd-11/ws/> 10.003s Build step 'Execute shell' marked build as failure

See <https://ci.centos.org/job/libvirt-go-xml-check/systems=libvirt-freebsd-11/184/display/redirect> ------------------------------------------ Started by upstream project "libvirt-go-xml-check" build number 184 originally caused by: Started by upstream project "libvirt-go-xml-build" build number 184 originally caused by: Started by upstream project "libvirt-build" build number 218 originally caused by: Started by an SCM change [EnvInject] - Loading node environment variables. Building remotely on libvirt-freebsd-11 (libvirt) in workspace <https://ci.centos.org/job/libvirt-go-xml-check/systems=libvirt-freebsd-11/ws/> [libvirt-go-xml] $ /bin/sh -xe /tmp/jenkins6207856172672266645.sh + export 'TEST_ARGS=-tags xmlroundtrip' + go test -tags xmlroundtrip --- FAIL: TestRoundTrip (25.29s) xml_test.go:400: testdata/libvirt/tests/qemuxml2argvdata/memory-hotplug-nvdimm-align.xml: /domain[0]/devices[0]/memory[0]/source[0]/alignsize[0]: element in expected XML missing in actual XML FAIL exit status 1 FAIL _/usr<https://ci.centos.org/job/libvirt-go-xml-check/systems=libvirt-freebsd-11/ws/> 25.399s Build step 'Execute shell' marked build as failure

See <https://ci.centos.org/job/libvirt-go-xml-check/systems=libvirt-freebsd-11/185/display/redirect> ------------------------------------------ Started by upstream project "libvirt-go-xml-check" build number 185 originally caused by: Started by upstream project "libvirt-go-xml-build" build number 185 originally caused by: Started by upstream project "libvirt-build" build number 219 originally caused by: Started by an SCM change Started by an SCM change Started by an SCM change Started by an SCM change [EnvInject] - Loading node environment variables. Building remotely on libvirt-freebsd-11 (libvirt) in workspace <https://ci.centos.org/job/libvirt-go-xml-check/systems=libvirt-freebsd-11/ws/> [libvirt-go-xml] $ /bin/sh -xe /tmp/jenkins8514005406676646648.sh + export 'TEST_ARGS=-tags xmlroundtrip' + go test -tags xmlroundtrip --- FAIL: TestRoundTrip (7.32s) xml_test.go:400: testdata/libvirt/tests/qemuxml2argvdata/memory-hotplug-nvdimm-align.xml: /domain[0]/devices[0]/memory[0]/source[0]/alignsize[0]: element in expected XML missing in actual XML FAIL exit status 1 FAIL _/usr<https://ci.centos.org/job/libvirt-go-xml-check/systems=libvirt-freebsd-11/ws/> 7.432s Build step 'Execute shell' marked build as failure

See <https://ci.centos.org/job/libvirt-go-xml-check/systems=libvirt-freebsd-11/186/display/redirect> ------------------------------------------ Started by upstream project "libvirt-go-xml-check" build number 186 originally caused by: Started by upstream project "libvirt-go-xml-build" build number 186 originally caused by: Started by upstream project "libvirt-build" build number 220 originally caused by: Started by an SCM change Started by an SCM change [EnvInject] - Loading node environment variables. Building remotely on libvirt-freebsd-11 (libvirt) in workspace <https://ci.centos.org/job/libvirt-go-xml-check/systems=libvirt-freebsd-11/ws/> [libvirt-go-xml] $ /bin/sh -xe /tmp/jenkins8109572454327648129.sh + export 'TEST_ARGS=-tags xmlroundtrip' + go test -tags xmlroundtrip --- FAIL: TestRoundTrip (4.98s) xml_test.go:400: testdata/libvirt/tests/qemuxml2argvdata/memory-hotplug-nvdimm-align.xml: /domain[0]/devices[0]/memory[0]/source[0]/alignsize[0]: element in expected XML missing in actual XML FAIL exit status 1 FAIL _/usr<https://ci.centos.org/job/libvirt-go-xml-check/systems=libvirt-freebsd-11/ws/> 5.093s Build step 'Execute shell' marked build as failure

See <https://ci.centos.org/job/libvirt-go-xml-check/systems=libvirt-freebsd-11/187/display/redirect> ------------------------------------------ Started by upstream project "libvirt-go-xml-check" build number 187 originally caused by: Started by upstream project "libvirt-go-xml-build" build number 187 originally caused by: Started by upstream project "libvirt-build" build number 221 originally caused by: Started by an SCM change Started by an SCM change Started by an SCM change Started by an SCM change [EnvInject] - Loading node environment variables. Building remotely on libvirt-freebsd-11 (libvirt) in workspace <https://ci.centos.org/job/libvirt-go-xml-check/systems=libvirt-freebsd-11/ws/> [libvirt-go-xml] $ /bin/sh -xe /tmp/jenkins4736065501701997842.sh + export 'TEST_ARGS=-tags xmlroundtrip' + go test -tags xmlroundtrip --- FAIL: TestRoundTrip (5.76s) xml_test.go:400: testdata/libvirt/tests/qemuxml2argvdata/memory-hotplug-nvdimm-align.xml: /domain[0]/devices[0]/memory[0]/source[0]/alignsize[0]: element in expected XML missing in actual XML FAIL exit status 1 FAIL _/usr<https://ci.centos.org/job/libvirt-go-xml-check/systems=libvirt-freebsd-11/ws/> 5.885s Build step 'Execute shell' marked build as failure

See <https://ci.centos.org/job/libvirt-go-xml-check/systems=libvirt-freebsd-11/188/display/redirect> ------------------------------------------ Started by upstream project "libvirt-go-xml-check" build number 188 originally caused by: Started by upstream project "libvirt-go-xml-build" build number 188 originally caused by: Started by upstream project "libvirt-build" build number 222 originally caused by: Started by an SCM change [EnvInject] - Loading node environment variables. Building remotely on libvirt-freebsd-11 (libvirt) in workspace <https://ci.centos.org/job/libvirt-go-xml-check/systems=libvirt-freebsd-11/ws/> [libvirt-go-xml] $ /bin/sh -xe /tmp/jenkins292739217340732856.sh + export 'TEST_ARGS=-tags xmlroundtrip' + go test -tags xmlroundtrip --- FAIL: TestRoundTrip (27.35s) xml_test.go:400: testdata/libvirt/tests/qemuxml2argvdata/memory-hotplug-nvdimm-align.xml: /domain[0]/devices[0]/memory[0]/source[0]/alignsize[0]: element in expected XML missing in actual XML FAIL exit status 1 FAIL _/usr<https://ci.centos.org/job/libvirt-go-xml-check/systems=libvirt-freebsd-11/ws/> 27.444s Build step 'Execute shell' marked build as failure

See <https://ci.centos.org/job/libvirt-go-xml-check/systems=libvirt-freebsd-11/189/display/redirect> ------------------------------------------ Started by upstream project "libvirt-go-xml-check" build number 189 originally caused by: Started by upstream project "libvirt-go-xml-build" build number 189 originally caused by: Started by upstream project "libvirt-build" build number 223 originally caused by: Started by an SCM change [EnvInject] - Loading node environment variables. Building remotely on libvirt-freebsd-11 (libvirt) in workspace <https://ci.centos.org/job/libvirt-go-xml-check/systems=libvirt-freebsd-11/ws/> [libvirt-go-xml] $ /bin/sh -xe /tmp/jenkins7605759170270589673.sh + export 'TEST_ARGS=-tags xmlroundtrip' + go test -tags xmlroundtrip --- FAIL: TestRoundTrip (9.46s) xml_test.go:400: testdata/libvirt/tests/qemuxml2argvdata/memory-hotplug-nvdimm-align.xml: /domain[0]/devices[0]/memory[0]/source[0]/alignsize[0]: element in expected XML missing in actual XML FAIL exit status 1 FAIL _/usr<https://ci.centos.org/job/libvirt-go-xml-check/systems=libvirt-freebsd-11/ws/> 9.621s Build step 'Execute shell' marked build as failure

See <https://ci.centos.org/job/libvirt-go-xml-check/systems=libvirt-freebsd-11/190/display/redirect> ------------------------------------------ Started by upstream project "libvirt-go-xml-check" build number 190 originally caused by: Started by upstream project "libvirt-go-xml-build" build number 190 originally caused by: Started by upstream project "libvirt-build" build number 224 originally caused by: Started by an SCM change [EnvInject] - Loading node environment variables. Building remotely on libvirt-freebsd-11 (libvirt) in workspace <https://ci.centos.org/job/libvirt-go-xml-check/systems=libvirt-freebsd-11/ws/> [libvirt-go-xml] $ /bin/sh -xe /tmp/jenkins511874724606027977.sh + export 'TEST_ARGS=-tags xmlroundtrip' + go test -tags xmlroundtrip --- FAIL: TestRoundTrip (35.79s) xml_test.go:400: testdata/libvirt/tests/qemuxml2argvdata/memory-hotplug-nvdimm-align.xml: /domain[0]/devices[0]/memory[0]/source[0]/alignsize[0]: element in expected XML missing in actual XML FAIL exit status 1 FAIL _/usr<https://ci.centos.org/job/libvirt-go-xml-check/systems=libvirt-freebsd-11/ws/> 35.851s Build step 'Execute shell' marked build as failure

See <https://ci.centos.org/job/libvirt-go-xml-check/systems=libvirt-freebsd-11/191/display/redirect> ------------------------------------------ Started by upstream project "libvirt-go-xml-check" build number 191 originally caused by: Started by upstream project "libvirt-go-xml-build" build number 191 originally caused by: Started by upstream project "libvirt-build" build number 225 originally caused by: Started by an SCM change Started by an SCM change Started by an SCM change Started by an SCM change Started by an SCM change [EnvInject] - Loading node environment variables. Building remotely on libvirt-freebsd-11 (libvirt) in workspace <https://ci.centos.org/job/libvirt-go-xml-check/systems=libvirt-freebsd-11/ws/> [libvirt-go-xml] $ /bin/sh -xe /tmp/jenkins73879626955738254.sh + export 'TEST_ARGS=-tags xmlroundtrip' + go test -tags xmlroundtrip --- FAIL: TestRoundTrip (6.90s) xml_test.go:400: testdata/libvirt/tests/qemuxml2argvdata/memory-hotplug-nvdimm-align.xml: /domain[0]/devices[0]/memory[0]/source[0]/alignsize[0]: element in expected XML missing in actual XML FAIL exit status 1 FAIL _/usr<https://ci.centos.org/job/libvirt-go-xml-check/systems=libvirt-freebsd-11/ws/> 7.001s Build step 'Execute shell' marked build as failure

See <https://ci.centos.org/job/libvirt-go-xml-check/systems=libvirt-freebsd-11/192/display/redirect> ------------------------------------------ Started by upstream project "libvirt-go-xml-check" build number 192 originally caused by: Started by upstream project "libvirt-go-xml-build" build number 192 originally caused by: Started by upstream project "libvirt-build" build number 226 originally caused by: Started by an SCM change [EnvInject] - Loading node environment variables. Building remotely on libvirt-freebsd-11 (libvirt) in workspace <https://ci.centos.org/job/libvirt-go-xml-check/systems=libvirt-freebsd-11/ws/> [libvirt-go-xml] $ /bin/sh -xe /tmp/jenkins8443148499812080889.sh + export 'TEST_ARGS=-tags xmlroundtrip' + go test -tags xmlroundtrip --- FAIL: TestRoundTrip (24.74s) xml_test.go:400: testdata/libvirt/tests/qemuxml2argvdata/memory-hotplug-nvdimm-align.xml: /domain[0]/devices[0]/memory[0]/source[0]/alignsize[0]: element in expected XML missing in actual XML FAIL exit status 1 FAIL _/usr<https://ci.centos.org/job/libvirt-go-xml-check/systems=libvirt-freebsd-11/ws/> 24.860s Build step 'Execute shell' marked build as failure

See <https://ci.centos.org/job/libvirt-go-xml-check/systems=libvirt-freebsd-11/193/display/redirect> ------------------------------------------ Started by upstream project "libvirt-go-xml-check" build number 193 originally caused by: Started by upstream project "libvirt-go-xml-build" build number 193 originally caused by: Started by upstream project "libvirt-build" build number 227 originally caused by: Started by an SCM change [EnvInject] - Loading node environment variables. Building remotely on libvirt-freebsd-11 (libvirt) in workspace <https://ci.centos.org/job/libvirt-go-xml-check/systems=libvirt-freebsd-11/ws/> [libvirt-go-xml] $ /bin/sh -xe /tmp/jenkins8368032740810295241.sh + export 'TEST_ARGS=-tags xmlroundtrip' + go test -tags xmlroundtrip --- FAIL: TestRoundTrip (22.25s) xml_test.go:400: testdata/libvirt/tests/qemuxml2argvdata/memory-hotplug-nvdimm-align.xml: /domain[0]/devices[0]/memory[0]/source[0]/alignsize[0]: element in expected XML missing in actual XML FAIL exit status 1 FAIL _/usr<https://ci.centos.org/job/libvirt-go-xml-check/systems=libvirt-freebsd-11/ws/> 22.410s Build step 'Execute shell' marked build as failure

See <https://ci.centos.org/job/libvirt-go-xml-check/systems=libvirt-freebsd-11/194/display/redirect> ------------------------------------------ Started by upstream project "libvirt-go-xml-check" build number 194 originally caused by: Started by upstream project "libvirt-go-xml-build" build number 194 originally caused by: Started by upstream project "libvirt-build" build number 228 originally caused by: Started by an SCM change Started by an SCM change Started by an SCM change Started by an SCM change Started by an SCM change Started by an SCM change Started by an SCM change [EnvInject] - Loading node environment variables. Building remotely on libvirt-freebsd-11 (libvirt) in workspace <https://ci.centos.org/job/libvirt-go-xml-check/systems=libvirt-freebsd-11/ws/> [libvirt-go-xml] $ /bin/sh -xe /tmp/jenkins7664714630871511208.sh + export 'TEST_ARGS=-tags xmlroundtrip' + go test -tags xmlroundtrip --- FAIL: TestRoundTrip (4.95s) xml_test.go:400: testdata/libvirt/tests/qemuxml2argvdata/memory-hotplug-nvdimm-align.xml: /domain[0]/devices[0]/memory[0]/source[0]/alignsize[0]: element in expected XML missing in actual XML FAIL exit status 1 FAIL _/usr<https://ci.centos.org/job/libvirt-go-xml-check/systems=libvirt-freebsd-11/ws/> 5.002s Build step 'Execute shell' marked build as failure

See <https://ci.centos.org/job/libvirt-go-xml-check/systems=libvirt-freebsd-11/195/display/redirect> ------------------------------------------ Started by upstream project "libvirt-go-xml-check" build number 195 originally caused by: Started by upstream project "libvirt-go-xml-build" build number 195 originally caused by: Started by upstream project "libvirt-build" build number 229 originally caused by: Started by an SCM change Started by an SCM change Started by an SCM change Started by an SCM change [EnvInject] - Loading node environment variables. Building remotely on libvirt-freebsd-11 (libvirt) in workspace <https://ci.centos.org/job/libvirt-go-xml-check/systems=libvirt-freebsd-11/ws/> [libvirt-go-xml] $ /bin/sh -xe /tmp/jenkins2561879127172659977.sh + export 'TEST_ARGS=-tags xmlroundtrip' + go test -tags xmlroundtrip --- FAIL: TestRoundTrip (7.75s) xml_test.go:400: testdata/libvirt/tests/qemuxml2argvdata/memory-hotplug-nvdimm-align.xml: /domain[0]/devices[0]/memory[0]/source[0]/alignsize[0]: element in expected XML missing in actual XML FAIL exit status 1 FAIL _/usr<https://ci.centos.org/job/libvirt-go-xml-check/systems=libvirt-freebsd-11/ws/> 7.860s Build step 'Execute shell' marked build as failure

participants (1)
-
ci@centos.org