[Libvirt-ci] Build failed in Jenkins: libvirt-go-xml-check » libvirt-fedora-29 #173

See <https://ci.centos.org/job/libvirt-go-xml-check/systems=libvirt-fedora-29/173/display/redirect> ------------------------------------------ Started by upstream project "libvirt-go-xml-check" build number 173 originally caused by: Started by upstream project "libvirt-go-xml-build" build number 173 originally caused by: Started by upstream project "libvirt-build" build number 205 originally caused by: Started by an SCM change [EnvInject] - Loading node environment variables. Building remotely on libvirt-fedora-29 (libvirt) in workspace <https://ci.centos.org/job/libvirt-go-xml-check/systems=libvirt-fedora-29/ws/> [libvirt-go-xml] $ /bin/sh -xe /tmp/jenkins6840069690028759449.sh + export 'TEST_ARGS=-tags xmlroundtrip' + TEST_ARGS='-tags xmlroundtrip' + go test -tags xmlroundtrip --- FAIL: TestRoundTrip (19.22s) xml_test.go:400: testdata/libvirt/tests/qemuxml2argvdata/memory-hotplug-nvdimm-align.xml: /domain[0]/devices[0]/memory[0]/source[0]/alignsize[0]: element in expected XML missing in actual XML FAIL exit status 1 FAIL _<https://ci.centos.org/job/libvirt-go-xml-check/systems=libvirt-fedora-29/ws/> 19.368s Build step 'Execute shell' marked build as failure

See <https://ci.centos.org/job/libvirt-go-xml-check/systems=libvirt-fedora-29/174/display/redirect> ------------------------------------------ Started by upstream project "libvirt-go-xml-check" build number 174 originally caused by: Started by upstream project "libvirt-go-xml-build" build number 174 originally caused by: Started by upstream project "libvirt-build" build number 206 originally caused by: Started by an SCM change [EnvInject] - Loading node environment variables. Building remotely on libvirt-fedora-29 (libvirt) in workspace <https://ci.centos.org/job/libvirt-go-xml-check/systems=libvirt-fedora-29/ws/> [libvirt-go-xml] $ /bin/sh -xe /tmp/jenkins5256601704318112389.sh + export 'TEST_ARGS=-tags xmlroundtrip' + TEST_ARGS='-tags xmlroundtrip' + go test -tags xmlroundtrip --- FAIL: TestRoundTrip (12.61s) xml_test.go:400: testdata/libvirt/tests/qemuxml2argvdata/memory-hotplug-nvdimm-align.xml: /domain[0]/devices[0]/memory[0]/source[0]/alignsize[0]: element in expected XML missing in actual XML FAIL exit status 1 FAIL _<https://ci.centos.org/job/libvirt-go-xml-check/systems=libvirt-fedora-29/ws/> 12.760s Build step 'Execute shell' marked build as failure

See <https://ci.centos.org/job/libvirt-go-xml-check/systems=libvirt-fedora-29/175/display/redirect> ------------------------------------------ Started by upstream project "libvirt-go-xml-check" build number 175 originally caused by: Started by upstream project "libvirt-go-xml-build" build number 175 originally caused by: Started by upstream project "libvirt-build" build number 209 originally caused by: Started by an SCM change [EnvInject] - Loading node environment variables. Building remotely on libvirt-fedora-29 (libvirt) in workspace <https://ci.centos.org/job/libvirt-go-xml-check/systems=libvirt-fedora-29/ws/> [libvirt-go-xml] $ /bin/sh -xe /tmp/jenkins5753707489880539980.sh + export 'TEST_ARGS=-tags xmlroundtrip' + TEST_ARGS='-tags xmlroundtrip' + go test -tags xmlroundtrip --- FAIL: TestRoundTrip (12.43s) xml_test.go:400: testdata/libvirt/tests/qemuxml2argvdata/memory-hotplug-nvdimm-align.xml: /domain[0]/devices[0]/memory[0]/source[0]/alignsize[0]: element in expected XML missing in actual XML FAIL exit status 1 FAIL _<https://ci.centos.org/job/libvirt-go-xml-check/systems=libvirt-fedora-29/ws/> 12.596s Build step 'Execute shell' marked build as failure

See <https://ci.centos.org/job/libvirt-go-xml-check/systems=libvirt-fedora-29/176/display/redirect> ------------------------------------------ Started by upstream project "libvirt-go-xml-check" build number 176 originally caused by: Started by upstream project "libvirt-go-xml-build" build number 176 originally caused by: Started by upstream project "libvirt-build" build number 210 originally caused by: Started by an SCM change [EnvInject] - Loading node environment variables. Building remotely on libvirt-fedora-29 (libvirt) in workspace <https://ci.centos.org/job/libvirt-go-xml-check/systems=libvirt-fedora-29/ws/> [libvirt-go-xml] $ /bin/sh -xe /tmp/jenkins4720858865667885862.sh + export 'TEST_ARGS=-tags xmlroundtrip' + TEST_ARGS='-tags xmlroundtrip' + go test -tags xmlroundtrip --- FAIL: TestRoundTrip (11.79s) xml_test.go:400: testdata/libvirt/tests/qemuxml2argvdata/memory-hotplug-nvdimm-align.xml: /domain[0]/devices[0]/memory[0]/source[0]/alignsize[0]: element in expected XML missing in actual XML FAIL exit status 1 FAIL _<https://ci.centos.org/job/libvirt-go-xml-check/systems=libvirt-fedora-29/ws/> 11.903s Build step 'Execute shell' marked build as failure

See <https://ci.centos.org/job/libvirt-go-xml-check/systems=libvirt-fedora-29/177/display/redirect> ------------------------------------------ Started by upstream project "libvirt-go-xml-check" build number 177 originally caused by: Started by upstream project "libvirt-go-xml-build" build number 177 originally caused by: Started by upstream project "libvirt-build" build number 211 originally caused by: Started by an SCM change [EnvInject] - Loading node environment variables. Building remotely on libvirt-fedora-29 (libvirt) in workspace <https://ci.centos.org/job/libvirt-go-xml-check/systems=libvirt-fedora-29/ws/> [libvirt-go-xml] $ /bin/sh -xe /tmp/jenkins1714356582680827133.sh + export 'TEST_ARGS=-tags xmlroundtrip' + TEST_ARGS='-tags xmlroundtrip' + go test -tags xmlroundtrip --- FAIL: TestRoundTrip (14.58s) xml_test.go:400: testdata/libvirt/tests/qemuxml2argvdata/memory-hotplug-nvdimm-align.xml: /domain[0]/devices[0]/memory[0]/source[0]/alignsize[0]: element in expected XML missing in actual XML FAIL exit status 1 FAIL _<https://ci.centos.org/job/libvirt-go-xml-check/systems=libvirt-fedora-29/ws/> 14.744s Build step 'Execute shell' marked build as failure

See <https://ci.centos.org/job/libvirt-go-xml-check/systems=libvirt-fedora-29/178/display/redirect> ------------------------------------------ Started by upstream project "libvirt-go-xml-check" build number 178 originally caused by: Started by upstream project "libvirt-go-xml-build" build number 178 originally caused by: Started by upstream project "libvirt-build" build number 212 originally caused by: Started by an SCM change Started by an SCM change Started by an SCM change Started by an SCM change Started by an SCM change Started by an SCM change Started by an SCM change [EnvInject] - Loading node environment variables. Building remotely on libvirt-fedora-29 (libvirt) in workspace <https://ci.centos.org/job/libvirt-go-xml-check/systems=libvirt-fedora-29/ws/> [libvirt-go-xml] $ /bin/sh -xe /tmp/jenkins4449540881609588779.sh + export 'TEST_ARGS=-tags xmlroundtrip' + TEST_ARGS='-tags xmlroundtrip' + go test -tags xmlroundtrip --- FAIL: TestRoundTrip (10.96s) xml_test.go:400: testdata/libvirt/tests/qemuxml2argvdata/memory-hotplug-nvdimm-align.xml: /domain[0]/devices[0]/memory[0]/source[0]/alignsize[0]: element in expected XML missing in actual XML FAIL exit status 1 FAIL _<https://ci.centos.org/job/libvirt-go-xml-check/systems=libvirt-fedora-29/ws/> 11.213s Build step 'Execute shell' marked build as failure

See <https://ci.centos.org/job/libvirt-go-xml-check/systems=libvirt-fedora-29/179/display/redirect> ------------------------------------------ Started by upstream project "libvirt-go-xml-check" build number 179 originally caused by: Started by upstream project "libvirt-go-xml-build" build number 179 originally caused by: Started by upstream project "libvirt-build" build number 213 originally caused by: Started by an SCM change [EnvInject] - Loading node environment variables. Building remotely on libvirt-fedora-29 (libvirt) in workspace <https://ci.centos.org/job/libvirt-go-xml-check/systems=libvirt-fedora-29/ws/> [libvirt-go-xml] $ /bin/sh -xe /tmp/jenkins4334425394173329244.sh + export 'TEST_ARGS=-tags xmlroundtrip' + TEST_ARGS='-tags xmlroundtrip' + go test -tags xmlroundtrip --- FAIL: TestRoundTrip (19.79s) xml_test.go:400: testdata/libvirt/tests/qemuxml2argvdata/memory-hotplug-nvdimm-align.xml: /domain[0]/devices[0]/memory[0]/source[0]/alignsize[0]: element in expected XML missing in actual XML FAIL exit status 1 FAIL _<https://ci.centos.org/job/libvirt-go-xml-check/systems=libvirt-fedora-29/ws/> 20.077s Build step 'Execute shell' marked build as failure

See <https://ci.centos.org/job/libvirt-go-xml-check/systems=libvirt-fedora-29/180/display/redirect> ------------------------------------------ Started by upstream project "libvirt-go-xml-check" build number 180 originally caused by: Started by upstream project "libvirt-go-xml-build" build number 180 originally caused by: Started by upstream project "libvirt-build" build number 214 originally caused by: Started by an SCM change [EnvInject] - Loading node environment variables. Building remotely on libvirt-fedora-29 (libvirt) in workspace <https://ci.centos.org/job/libvirt-go-xml-check/systems=libvirt-fedora-29/ws/> [libvirt-go-xml] $ /bin/sh -xe /tmp/jenkins6576301721664990138.sh + export 'TEST_ARGS=-tags xmlroundtrip' + TEST_ARGS='-tags xmlroundtrip' + go test -tags xmlroundtrip --- FAIL: TestRoundTrip (21.31s) xml_test.go:400: testdata/libvirt/tests/qemuxml2argvdata/memory-hotplug-nvdimm-align.xml: /domain[0]/devices[0]/memory[0]/source[0]/alignsize[0]: element in expected XML missing in actual XML FAIL exit status 1 FAIL _<https://ci.centos.org/job/libvirt-go-xml-check/systems=libvirt-fedora-29/ws/> 21.438s Build step 'Execute shell' marked build as failure

See <https://ci.centos.org/job/libvirt-go-xml-check/systems=libvirt-fedora-29/181/display/redirect> ------------------------------------------ Started by upstream project "libvirt-go-xml-check" build number 181 originally caused by: Started by upstream project "libvirt-go-xml-build" build number 181 originally caused by: Started by upstream project "libvirt-build" build number 215 originally caused by: Started by an SCM change [EnvInject] - Loading node environment variables. Building remotely on libvirt-fedora-29 (libvirt) in workspace <https://ci.centos.org/job/libvirt-go-xml-check/systems=libvirt-fedora-29/ws/> [libvirt-go-xml] $ /bin/sh -xe /tmp/jenkins1433513102430217680.sh + export 'TEST_ARGS=-tags xmlroundtrip' + TEST_ARGS='-tags xmlroundtrip' + go test -tags xmlroundtrip --- FAIL: TestRoundTrip (15.80s) xml_test.go:400: testdata/libvirt/tests/qemuxml2argvdata/memory-hotplug-nvdimm-align.xml: /domain[0]/devices[0]/memory[0]/source[0]/alignsize[0]: element in expected XML missing in actual XML FAIL exit status 1 FAIL _<https://ci.centos.org/job/libvirt-go-xml-check/systems=libvirt-fedora-29/ws/> 16.038s Build step 'Execute shell' marked build as failure

See <https://ci.centos.org/job/libvirt-go-xml-check/systems=libvirt-fedora-29/182/display/redirect> ------------------------------------------ Started by upstream project "libvirt-go-xml-check" build number 182 originally caused by: Started by upstream project "libvirt-go-xml-build" build number 182 originally caused by: Started by upstream project "libvirt-build" build number 216 originally caused by: Started by an SCM change Started by an SCM change Started by an SCM change [EnvInject] - Loading node environment variables. Building remotely on libvirt-fedora-29 (libvirt) in workspace <https://ci.centos.org/job/libvirt-go-xml-check/systems=libvirt-fedora-29/ws/> [libvirt-go-xml] $ /bin/sh -xe /tmp/jenkins2238169723812261154.sh + export 'TEST_ARGS=-tags xmlroundtrip' + TEST_ARGS='-tags xmlroundtrip' + go test -tags xmlroundtrip --- FAIL: TestRoundTrip (18.67s) xml_test.go:400: testdata/libvirt/tests/qemuxml2argvdata/memory-hotplug-nvdimm-align.xml: /domain[0]/devices[0]/memory[0]/source[0]/alignsize[0]: element in expected XML missing in actual XML FAIL exit status 1 FAIL _<https://ci.centos.org/job/libvirt-go-xml-check/systems=libvirt-fedora-29/ws/> 18.747s Build step 'Execute shell' marked build as failure

See <https://ci.centos.org/job/libvirt-go-xml-check/systems=libvirt-fedora-29/183/display/redirect> ------------------------------------------ Started by upstream project "libvirt-go-xml-check" build number 183 originally caused by: Started by upstream project "libvirt-go-xml-build" build number 183 originally caused by: Started by upstream project "libvirt-build" build number 217 originally caused by: Started by an SCM change [EnvInject] - Loading node environment variables. Building remotely on libvirt-fedora-29 (libvirt) in workspace <https://ci.centos.org/job/libvirt-go-xml-check/systems=libvirt-fedora-29/ws/> [libvirt-go-xml] $ /bin/sh -xe /tmp/jenkins1489213676006932972.sh + export 'TEST_ARGS=-tags xmlroundtrip' + TEST_ARGS='-tags xmlroundtrip' + go test -tags xmlroundtrip --- FAIL: TestRoundTrip (17.56s) xml_test.go:400: testdata/libvirt/tests/qemuxml2argvdata/memory-hotplug-nvdimm-align.xml: /domain[0]/devices[0]/memory[0]/source[0]/alignsize[0]: element in expected XML missing in actual XML FAIL exit status 1 FAIL _<https://ci.centos.org/job/libvirt-go-xml-check/systems=libvirt-fedora-29/ws/> 17.731s Build step 'Execute shell' marked build as failure

See <https://ci.centos.org/job/libvirt-go-xml-check/systems=libvirt-fedora-29/184/display/redirect> ------------------------------------------ Started by upstream project "libvirt-go-xml-check" build number 184 originally caused by: Started by upstream project "libvirt-go-xml-build" build number 184 originally caused by: Started by upstream project "libvirt-build" build number 218 originally caused by: Started by an SCM change [EnvInject] - Loading node environment variables. Building remotely on libvirt-fedora-29 (libvirt) in workspace <https://ci.centos.org/job/libvirt-go-xml-check/systems=libvirt-fedora-29/ws/> [libvirt-go-xml] $ /bin/sh -xe /tmp/jenkins2154331086799718510.sh + export 'TEST_ARGS=-tags xmlroundtrip' + TEST_ARGS='-tags xmlroundtrip' + go test -tags xmlroundtrip --- FAIL: TestRoundTrip (22.09s) xml_test.go:400: testdata/libvirt/tests/qemuxml2argvdata/memory-hotplug-nvdimm-align.xml: /domain[0]/devices[0]/memory[0]/source[0]/alignsize[0]: element in expected XML missing in actual XML FAIL exit status 1 FAIL _<https://ci.centos.org/job/libvirt-go-xml-check/systems=libvirt-fedora-29/ws/> 22.265s Build step 'Execute shell' marked build as failure

See <https://ci.centos.org/job/libvirt-go-xml-check/systems=libvirt-fedora-29/185/display/redirect> ------------------------------------------ Started by upstream project "libvirt-go-xml-check" build number 185 originally caused by: Started by upstream project "libvirt-go-xml-build" build number 185 originally caused by: Started by upstream project "libvirt-build" build number 219 originally caused by: Started by an SCM change Started by an SCM change Started by an SCM change Started by an SCM change [EnvInject] - Loading node environment variables. Building remotely on libvirt-fedora-29 (libvirt) in workspace <https://ci.centos.org/job/libvirt-go-xml-check/systems=libvirt-fedora-29/ws/> [libvirt-go-xml] $ /bin/sh -xe /tmp/jenkins3438972445387064805.sh + export 'TEST_ARGS=-tags xmlroundtrip' + TEST_ARGS='-tags xmlroundtrip' + go test -tags xmlroundtrip --- FAIL: TestRoundTrip (9.20s) xml_test.go:400: testdata/libvirt/tests/qemuxml2argvdata/memory-hotplug-nvdimm-align.xml: /domain[0]/devices[0]/memory[0]/source[0]/alignsize[0]: element in expected XML missing in actual XML FAIL exit status 1 FAIL _<https://ci.centos.org/job/libvirt-go-xml-check/systems=libvirt-fedora-29/ws/> 9.321s Build step 'Execute shell' marked build as failure

See <https://ci.centos.org/job/libvirt-go-xml-check/systems=libvirt-fedora-29/186/display/redirect> ------------------------------------------ Started by upstream project "libvirt-go-xml-check" build number 186 originally caused by: Started by upstream project "libvirt-go-xml-build" build number 186 originally caused by: Started by upstream project "libvirt-build" build number 220 originally caused by: Started by an SCM change Started by an SCM change [EnvInject] - Loading node environment variables. Building remotely on libvirt-fedora-29 (libvirt) in workspace <https://ci.centos.org/job/libvirt-go-xml-check/systems=libvirt-fedora-29/ws/> [libvirt-go-xml] $ /bin/sh -xe /tmp/jenkins3700743709387268058.sh + export 'TEST_ARGS=-tags xmlroundtrip' + TEST_ARGS='-tags xmlroundtrip' + go test -tags xmlroundtrip --- FAIL: TestRoundTrip (10.30s) xml_test.go:400: testdata/libvirt/tests/qemuxml2argvdata/memory-hotplug-nvdimm-align.xml: /domain[0]/devices[0]/memory[0]/source[0]/alignsize[0]: element in expected XML missing in actual XML FAIL exit status 1 FAIL _<https://ci.centos.org/job/libvirt-go-xml-check/systems=libvirt-fedora-29/ws/> 10.386s Build step 'Execute shell' marked build as failure

See <https://ci.centos.org/job/libvirt-go-xml-check/systems=libvirt-fedora-29/187/display/redirect> ------------------------------------------ Started by upstream project "libvirt-go-xml-check" build number 187 originally caused by: Started by upstream project "libvirt-go-xml-build" build number 187 originally caused by: Started by upstream project "libvirt-build" build number 221 originally caused by: Started by an SCM change Started by an SCM change Started by an SCM change Started by an SCM change [EnvInject] - Loading node environment variables. Building remotely on libvirt-fedora-29 (libvirt) in workspace <https://ci.centos.org/job/libvirt-go-xml-check/systems=libvirt-fedora-29/ws/> [libvirt-go-xml] $ /bin/sh -xe /tmp/jenkins5962293396922450273.sh + export 'TEST_ARGS=-tags xmlroundtrip' + TEST_ARGS='-tags xmlroundtrip' + go test -tags xmlroundtrip --- FAIL: TestRoundTrip (12.09s) xml_test.go:400: testdata/libvirt/tests/qemuxml2argvdata/memory-hotplug-nvdimm-align.xml: /domain[0]/devices[0]/memory[0]/source[0]/alignsize[0]: element in expected XML missing in actual XML FAIL exit status 1 FAIL _<https://ci.centos.org/job/libvirt-go-xml-check/systems=libvirt-fedora-29/ws/> 12.126s Build step 'Execute shell' marked build as failure

See <https://ci.centos.org/job/libvirt-go-xml-check/systems=libvirt-fedora-29/188/display/redirect> ------------------------------------------ Started by upstream project "libvirt-go-xml-check" build number 188 originally caused by: Started by upstream project "libvirt-go-xml-build" build number 188 originally caused by: Started by upstream project "libvirt-build" build number 222 originally caused by: Started by an SCM change [EnvInject] - Loading node environment variables. Building remotely on libvirt-fedora-29 (libvirt) in workspace <https://ci.centos.org/job/libvirt-go-xml-check/systems=libvirt-fedora-29/ws/> [libvirt-go-xml] $ /bin/sh -xe /tmp/jenkins2834782282411730210.sh + export 'TEST_ARGS=-tags xmlroundtrip' + TEST_ARGS='-tags xmlroundtrip' + go test -tags xmlroundtrip --- FAIL: TestRoundTrip (20.93s) xml_test.go:400: testdata/libvirt/tests/qemuxml2argvdata/memory-hotplug-nvdimm-align.xml: /domain[0]/devices[0]/memory[0]/source[0]/alignsize[0]: element in expected XML missing in actual XML FAIL exit status 1 FAIL _<https://ci.centos.org/job/libvirt-go-xml-check/systems=libvirt-fedora-29/ws/> 21.150s Build step 'Execute shell' marked build as failure

See <https://ci.centos.org/job/libvirt-go-xml-check/systems=libvirt-fedora-29/189/display/redirect> ------------------------------------------ Started by upstream project "libvirt-go-xml-check" build number 189 originally caused by: Started by upstream project "libvirt-go-xml-build" build number 189 originally caused by: Started by upstream project "libvirt-build" build number 223 originally caused by: Started by an SCM change [EnvInject] - Loading node environment variables. Building remotely on libvirt-fedora-29 (libvirt) in workspace <https://ci.centos.org/job/libvirt-go-xml-check/systems=libvirt-fedora-29/ws/> [libvirt-go-xml] $ /bin/sh -xe /tmp/jenkins5536457553843909453.sh + export 'TEST_ARGS=-tags xmlroundtrip' + TEST_ARGS='-tags xmlroundtrip' + go test -tags xmlroundtrip --- FAIL: TestRoundTrip (16.34s) xml_test.go:400: testdata/libvirt/tests/qemuxml2argvdata/memory-hotplug-nvdimm-align.xml: /domain[0]/devices[0]/memory[0]/source[0]/alignsize[0]: element in expected XML missing in actual XML FAIL exit status 1 FAIL _<https://ci.centos.org/job/libvirt-go-xml-check/systems=libvirt-fedora-29/ws/> 16.542s Build step 'Execute shell' marked build as failure

See <https://ci.centos.org/job/libvirt-go-xml-check/systems=libvirt-fedora-29/190/display/redirect> ------------------------------------------ Started by upstream project "libvirt-go-xml-check" build number 190 originally caused by: Started by upstream project "libvirt-go-xml-build" build number 190 originally caused by: Started by upstream project "libvirt-build" build number 224 originally caused by: Started by an SCM change [EnvInject] - Loading node environment variables. Building remotely on libvirt-fedora-29 (libvirt) in workspace <https://ci.centos.org/job/libvirt-go-xml-check/systems=libvirt-fedora-29/ws/> [libvirt-go-xml] $ /bin/sh -xe /tmp/jenkins4135704790782410252.sh + export 'TEST_ARGS=-tags xmlroundtrip' + TEST_ARGS='-tags xmlroundtrip' + go test -tags xmlroundtrip --- FAIL: TestRoundTrip (15.24s) xml_test.go:400: testdata/libvirt/tests/qemuxml2argvdata/memory-hotplug-nvdimm-align.xml: /domain[0]/devices[0]/memory[0]/source[0]/alignsize[0]: element in expected XML missing in actual XML FAIL exit status 1 FAIL _<https://ci.centos.org/job/libvirt-go-xml-check/systems=libvirt-fedora-29/ws/> 15.405s Build step 'Execute shell' marked build as failure

See <https://ci.centos.org/job/libvirt-go-xml-check/systems=libvirt-fedora-29/191/display/redirect> ------------------------------------------ Started by upstream project "libvirt-go-xml-check" build number 191 originally caused by: Started by upstream project "libvirt-go-xml-build" build number 191 originally caused by: Started by upstream project "libvirt-build" build number 225 originally caused by: Started by an SCM change Started by an SCM change Started by an SCM change Started by an SCM change Started by an SCM change [EnvInject] - Loading node environment variables. Building remotely on libvirt-fedora-29 (libvirt) in workspace <https://ci.centos.org/job/libvirt-go-xml-check/systems=libvirt-fedora-29/ws/> [libvirt-go-xml] $ /bin/sh -xe /tmp/jenkins3909229584760121221.sh + export 'TEST_ARGS=-tags xmlroundtrip' + TEST_ARGS='-tags xmlroundtrip' + go test -tags xmlroundtrip --- FAIL: TestRoundTrip (14.79s) xml_test.go:400: testdata/libvirt/tests/qemuxml2argvdata/memory-hotplug-nvdimm-align.xml: /domain[0]/devices[0]/memory[0]/source[0]/alignsize[0]: element in expected XML missing in actual XML FAIL exit status 1 FAIL _<https://ci.centos.org/job/libvirt-go-xml-check/systems=libvirt-fedora-29/ws/> 14.957s Build step 'Execute shell' marked build as failure

See <https://ci.centos.org/job/libvirt-go-xml-check/systems=libvirt-fedora-29/192/display/redirect> ------------------------------------------ Started by upstream project "libvirt-go-xml-check" build number 192 originally caused by: Started by upstream project "libvirt-go-xml-build" build number 192 originally caused by: Started by upstream project "libvirt-build" build number 226 originally caused by: Started by an SCM change [EnvInject] - Loading node environment variables. Building remotely on libvirt-fedora-29 (libvirt) in workspace <https://ci.centos.org/job/libvirt-go-xml-check/systems=libvirt-fedora-29/ws/> [libvirt-go-xml] $ /bin/sh -xe /tmp/jenkins1379982798571537247.sh + export 'TEST_ARGS=-tags xmlroundtrip' + TEST_ARGS='-tags xmlroundtrip' + go test -tags xmlroundtrip --- FAIL: TestRoundTrip (31.34s) xml_test.go:400: testdata/libvirt/tests/qemuxml2argvdata/memory-hotplug-nvdimm-align.xml: /domain[0]/devices[0]/memory[0]/source[0]/alignsize[0]: element in expected XML missing in actual XML FAIL exit status 1 FAIL _<https://ci.centos.org/job/libvirt-go-xml-check/systems=libvirt-fedora-29/ws/> 31.455s Build step 'Execute shell' marked build as failure

See <https://ci.centos.org/job/libvirt-go-xml-check/systems=libvirt-fedora-29/193/display/redirect> ------------------------------------------ Started by upstream project "libvirt-go-xml-check" build number 193 originally caused by: Started by upstream project "libvirt-go-xml-build" build number 193 originally caused by: Started by upstream project "libvirt-build" build number 227 originally caused by: Started by an SCM change [EnvInject] - Loading node environment variables. Building remotely on libvirt-fedora-29 (libvirt) in workspace <https://ci.centos.org/job/libvirt-go-xml-check/systems=libvirt-fedora-29/ws/> [libvirt-go-xml] $ /bin/sh -xe /tmp/jenkins8195327440504433692.sh + export 'TEST_ARGS=-tags xmlroundtrip' + TEST_ARGS='-tags xmlroundtrip' + go test -tags xmlroundtrip --- FAIL: TestRoundTrip (19.88s) xml_test.go:400: testdata/libvirt/tests/qemuxml2argvdata/memory-hotplug-nvdimm-align.xml: /domain[0]/devices[0]/memory[0]/source[0]/alignsize[0]: element in expected XML missing in actual XML FAIL exit status 1 FAIL _<https://ci.centos.org/job/libvirt-go-xml-check/systems=libvirt-fedora-29/ws/> 20.057s Build step 'Execute shell' marked build as failure

See <https://ci.centos.org/job/libvirt-go-xml-check/systems=libvirt-fedora-29/194/display/redirect> ------------------------------------------ Started by upstream project "libvirt-go-xml-check" build number 194 originally caused by: Started by upstream project "libvirt-go-xml-build" build number 194 originally caused by: Started by upstream project "libvirt-build" build number 228 originally caused by: Started by an SCM change Started by an SCM change Started by an SCM change Started by an SCM change Started by an SCM change Started by an SCM change Started by an SCM change [EnvInject] - Loading node environment variables. Building remotely on libvirt-fedora-29 (libvirt) in workspace <https://ci.centos.org/job/libvirt-go-xml-check/systems=libvirt-fedora-29/ws/> [libvirt-go-xml] $ /bin/sh -xe /tmp/jenkins5386204030361923511.sh + export 'TEST_ARGS=-tags xmlroundtrip' + TEST_ARGS='-tags xmlroundtrip' + go test -tags xmlroundtrip --- FAIL: TestRoundTrip (12.85s) xml_test.go:400: testdata/libvirt/tests/qemuxml2argvdata/memory-hotplug-nvdimm-align.xml: /domain[0]/devices[0]/memory[0]/source[0]/alignsize[0]: element in expected XML missing in actual XML FAIL exit status 1 FAIL _<https://ci.centos.org/job/libvirt-go-xml-check/systems=libvirt-fedora-29/ws/> 12.971s Build step 'Execute shell' marked build as failure

See <https://ci.centos.org/job/libvirt-go-xml-check/systems=libvirt-fedora-29/195/display/redirect> ------------------------------------------ Started by upstream project "libvirt-go-xml-check" build number 195 originally caused by: Started by upstream project "libvirt-go-xml-build" build number 195 originally caused by: Started by upstream project "libvirt-build" build number 229 originally caused by: Started by an SCM change Started by an SCM change Started by an SCM change Started by an SCM change [EnvInject] - Loading node environment variables. Building remotely on libvirt-fedora-29 (libvirt) in workspace <https://ci.centos.org/job/libvirt-go-xml-check/systems=libvirt-fedora-29/ws/> [libvirt-go-xml] $ /bin/sh -xe /tmp/jenkins2628813413393848514.sh + export 'TEST_ARGS=-tags xmlroundtrip' + TEST_ARGS='-tags xmlroundtrip' + go test -tags xmlroundtrip --- FAIL: TestRoundTrip (16.90s) xml_test.go:400: testdata/libvirt/tests/qemuxml2argvdata/memory-hotplug-nvdimm-align.xml: /domain[0]/devices[0]/memory[0]/source[0]/alignsize[0]: element in expected XML missing in actual XML FAIL exit status 1 FAIL _<https://ci.centos.org/job/libvirt-go-xml-check/systems=libvirt-fedora-29/ws/> 17.006s Build step 'Execute shell' marked build as failure

participants (1)
-
ci@centos.org