Build failed in Jenkins: libvirt-go-xml-check » libvirt-fedora-31 #959

See <https://ci.centos.org/job/libvirt-go-xml-check/systems=libvirt-fedora-31/959/display/redirect> ------------------------------------------ Started by upstream project "libvirt-go-xml-check" build number 959 originally caused by: Started by upstream project "libvirt-go-xml-build" build number 962 originally caused by: Started by upstream project "libvirt-build" build number 1127 originally caused by: Started by an SCM change Started by an SCM change Running as SYSTEM [EnvInject] - Loading node environment variables. Building remotely on libvirt-fedora-31 (libvirt) in workspace <https://ci.centos.org/job/libvirt-go-xml-check/systems=libvirt-fedora-31/ws/> [libvirt-go-xml] $ /bin/sh -xe /tmp/jenkins841293421529054594.sh + export 'TEST_ARGS=-tags xmlroundtrip' + TEST_ARGS='-tags xmlroundtrip' + go test -tags xmlroundtrip --- FAIL: TestRoundTrip (26.72s) xml_test.go:374: testdata/libvirt/tests/qemuxml2argvdata/virtio-rng-builtin.xml: /domain[0]/devices[0]/rng[0]/backend[0]: element in expected XML missing in actual XML FAIL exit status 1 FAIL _<https://ci.centos.org/job/libvirt-go-xml-check/systems=libvirt-fedora-31/ws/> 26.788s Build step 'Execute shell' marked build as failure

See <https://ci.centos.org/job/libvirt-go-xml-check/systems=libvirt-fedora-31/960/display/redirect> ------------------------------------------ Started by upstream project "libvirt-go-xml-check" build number 960 originally caused by: Started by upstream project "libvirt-go-xml-build" build number 963 originally caused by: Started by upstream project "libvirt-build" build number 1128 originally caused by: Started by an SCM change Running as SYSTEM [EnvInject] - Loading node environment variables. Building remotely on libvirt-fedora-31 (libvirt) in workspace <https://ci.centos.org/job/libvirt-go-xml-check/systems=libvirt-fedora-31/ws/> [libvirt-go-xml] $ /bin/sh -xe /tmp/jenkins7009684998895621890.sh + export 'TEST_ARGS=-tags xmlroundtrip' + TEST_ARGS='-tags xmlroundtrip' + go test -tags xmlroundtrip --- FAIL: TestRoundTrip (23.10s) xml_test.go:374: testdata/libvirt/tests/qemuxml2argvdata/virtio-rng-builtin.xml: /domain[0]/devices[0]/rng[0]/backend[0]: element in expected XML missing in actual XML FAIL exit status 1 FAIL _<https://ci.centos.org/job/libvirt-go-xml-check/systems=libvirt-fedora-31/ws/> 23.297s Build step 'Execute shell' marked build as failure

See <https://ci.centos.org/job/libvirt-go-xml-check/systems=libvirt-fedora-31/961/display/redirect> ------------------------------------------ Started by upstream project "libvirt-go-xml-check" build number 961 originally caused by: Started by upstream project "libvirt-go-xml-build" build number 964 originally caused by: Started by upstream project "libvirt-build" build number 1131 originally caused by: Started by an SCM change Running as SYSTEM [EnvInject] - Loading node environment variables. Building remotely on libvirt-fedora-31 (libvirt) in workspace <https://ci.centos.org/job/libvirt-go-xml-check/systems=libvirt-fedora-31/ws/> [libvirt-go-xml] $ /bin/sh -xe /tmp/jenkins4946696970678405539.sh + export 'TEST_ARGS=-tags xmlroundtrip' + TEST_ARGS='-tags xmlroundtrip' + go test -tags xmlroundtrip --- FAIL: TestRoundTrip (34.74s) xml_test.go:374: testdata/libvirt/tests/qemuxml2argvdata/virtio-rng-builtin.xml: /domain[0]/devices[0]/rng[0]/backend[0]: element in expected XML missing in actual XML FAIL exit status 1 FAIL _<https://ci.centos.org/job/libvirt-go-xml-check/systems=libvirt-fedora-31/ws/> 34.898s Build step 'Execute shell' marked build as failure

See <https://ci.centos.org/job/libvirt-go-xml-check/systems=libvirt-fedora-31/962/display/redirect> ------------------------------------------ Started by upstream project "libvirt-go-xml-check" build number 962 originally caused by: Started by upstream project "libvirt-go-xml-build" build number 965 originally caused by: Started by upstream project "libvirt-build" build number 1132 originally caused by: Started by an SCM change Started by an SCM change Started by an SCM change Started by an SCM change Running as SYSTEM [EnvInject] - Loading node environment variables. Building remotely on libvirt-fedora-31 (libvirt) in workspace <https://ci.centos.org/job/libvirt-go-xml-check/systems=libvirt-fedora-31/ws/> [libvirt-go-xml] $ /bin/sh -xe /tmp/jenkins444402075047514190.sh + export 'TEST_ARGS=-tags xmlroundtrip' + TEST_ARGS='-tags xmlroundtrip' + go test -tags xmlroundtrip --- FAIL: TestRoundTrip (30.82s) xml_test.go:374: testdata/libvirt/tests/qemuxml2argvdata/virtio-rng-builtin.xml: /domain[0]/devices[0]/rng[0]/backend[0]: element in expected XML missing in actual XML FAIL exit status 1 FAIL _<https://ci.centos.org/job/libvirt-go-xml-check/systems=libvirt-fedora-31/ws/> 31.028s Build step 'Execute shell' marked build as failure

See <https://ci.centos.org/job/libvirt-go-xml-check/systems=libvirt-fedora-31/963/display/redirect> ------------------------------------------ Started by upstream project "libvirt-go-xml-check" build number 963 originally caused by: Started by upstream project "libvirt-go-xml-build" build number 966 originally caused by: Started by upstream project "libvirt-build" build number 1133 originally caused by: Started by an SCM change Running as SYSTEM [EnvInject] - Loading node environment variables. Building remotely on libvirt-fedora-31 (libvirt) in workspace <https://ci.centos.org/job/libvirt-go-xml-check/systems=libvirt-fedora-31/ws/> [libvirt-go-xml] $ /bin/sh -xe /tmp/jenkins6035317521740387035.sh + export 'TEST_ARGS=-tags xmlroundtrip' + TEST_ARGS='-tags xmlroundtrip' + go test -tags xmlroundtrip --- FAIL: TestRoundTrip (24.36s) xml_test.go:374: testdata/libvirt/tests/qemuxml2argvdata/virtio-rng-builtin.xml: /domain[0]/devices[0]/rng[0]/backend[0]: element in expected XML missing in actual XML FAIL exit status 1 FAIL _<https://ci.centos.org/job/libvirt-go-xml-check/systems=libvirt-fedora-31/ws/> 24.446s Build step 'Execute shell' marked build as failure

participants (1)
-
ci@centos.org