[Libvirt-ci] Build failed in Jenkins: libvirt-go-check » libvirt-debian-8 #231

See <https://ci.centos.org/job/libvirt-go-check/systems=libvirt-debian-8/231/display/redirect> ------------------------------------------ Started by upstream project "libvirt-go-check" build number 231 originally caused by: Started by upstream project "libvirt-go-build" build number 235 originally caused by: Started by upstream project "libvirt-build" build number 295 originally caused by: Started by an SCM change Started by an SCM change Started by an SCM change Started by an SCM change [EnvInject] - Loading node environment variables. Building remotely on libvirt-debian-8 (libvirt) in workspace <https://ci.centos.org/job/libvirt-go-check/systems=libvirt-debian-8/ws/> [libvirt-go] $ /bin/sh -xe /tmp/jenkins3034011168081587003.sh + export TEST_ARGS=-tags api + go test -tags api Missing macro 'VIR_MIGRATE_PARAM_BANDWIDTH_POSTCOPY' Missing enum 'VIR_DOMAIN_MIGRATE_MAX_SPEED_POSTCOPY' --- FAIL: TestAPICoverage (0.41s) panic: Missing symbols found [recovered] panic: Missing symbols found goroutine 19 [running]: panic(0x5b56c0, 0xc42042e3d0) /usr/lib/go-1.7/src/runtime/panic.go:500 +0x1a1 testing.tRunner.func1(0xc420086180) /usr/lib/go-1.7/src/testing/testing.go:579 +0x25d panic(0x5b56c0, 0xc42042e3d0) /usr/lib/go-1.7/src/runtime/panic.go:458 +0x243 _<https://ci.centos.org/job/libvirt-go-check/systems=libvirt-debian-8/ws/.TestAPICoverage(0xc420086180)> <https://ci.centos.org/job/libvirt-go-check/systems=libvirt-debian-8/ws/api_test.go>:501 +0x5ff testing.tRunner(0xc420086180, 0x608e08) /usr/lib/go-1.7/src/testing/testing.go:610 +0x81 created by testing.(*T).Run /usr/lib/go-1.7/src/testing/testing.go:646 +0x2ec exit status 2 FAIL _<https://ci.centos.org/job/libvirt-go-check/systems=libvirt-debian-8/ws/> 0.477s Build step 'Execute shell' marked build as failure

See <https://ci.centos.org/job/libvirt-go-check/systems=libvirt-debian-8/232/display/redirect> ------------------------------------------ Started by upstream project "libvirt-go-check" build number 232 originally caused by: Started by upstream project "libvirt-go-build" build number 236 originally caused by: Started by upstream project "libvirt-build" build number 296 originally caused by: Started by an SCM change [EnvInject] - Loading node environment variables. Building remotely on libvirt-debian-8 (libvirt) in workspace <https://ci.centos.org/job/libvirt-go-check/systems=libvirt-debian-8/ws/> [libvirt-go] $ /bin/sh -xe /tmp/jenkins6447932011666515008.sh + export TEST_ARGS=-tags api + go test -tags api Missing macro 'VIR_MIGRATE_PARAM_BANDWIDTH_POSTCOPY' Missing enum 'VIR_DOMAIN_MIGRATE_MAX_SPEED_POSTCOPY' --- FAIL: TestAPICoverage (0.88s) panic: Missing symbols found [recovered] panic: Missing symbols found goroutine 5 [running]: panic(0x5b56c0, 0xc42044a120) /usr/lib/go-1.7/src/runtime/panic.go:500 +0x1a1 testing.tRunner.func1(0xc420078180) /usr/lib/go-1.7/src/testing/testing.go:579 +0x25d panic(0x5b56c0, 0xc42044a120) /usr/lib/go-1.7/src/runtime/panic.go:458 +0x243 _<https://ci.centos.org/job/libvirt-go-check/systems=libvirt-debian-8/ws/.TestAPICoverage(0xc420078180)> <https://ci.centos.org/job/libvirt-go-check/systems=libvirt-debian-8/ws/api_test.go>:501 +0x5ff testing.tRunner(0xc420078180, 0x608e08) /usr/lib/go-1.7/src/testing/testing.go:610 +0x81 created by testing.(*T).Run /usr/lib/go-1.7/src/testing/testing.go:646 +0x2ec exit status 2 FAIL _<https://ci.centos.org/job/libvirt-go-check/systems=libvirt-debian-8/ws/> 0.968s Build step 'Execute shell' marked build as failure

See <https://ci.centos.org/job/libvirt-go-check/systems=libvirt-debian-8/233/display/redirect> ------------------------------------------ Started by upstream project "libvirt-go-check" build number 233 originally caused by: Started by upstream project "libvirt-go-build" build number 237 originally caused by: Started by upstream project "libvirt-build" build number 297 originally caused by: Started by an SCM change [EnvInject] - Loading node environment variables. Building remotely on libvirt-debian-8 (libvirt) in workspace <https://ci.centos.org/job/libvirt-go-check/systems=libvirt-debian-8/ws/> [libvirt-go] $ /bin/sh -xe /tmp/jenkins5049066428472210827.sh + export TEST_ARGS=-tags api + go test -tags api Missing macro 'VIR_MIGRATE_PARAM_BANDWIDTH_POSTCOPY' Missing enum 'VIR_DOMAIN_MIGRATE_MAX_SPEED_POSTCOPY' --- FAIL: TestAPICoverage (0.20s) panic: Missing symbols found [recovered] panic: Missing symbols found goroutine 18 [running]: panic(0x5b56c0, 0xc420436a50) /usr/lib/go-1.7/src/runtime/panic.go:500 +0x1a1 testing.tRunner.func1(0xc4200b20c0) /usr/lib/go-1.7/src/testing/testing.go:579 +0x25d panic(0x5b56c0, 0xc420436a50) /usr/lib/go-1.7/src/runtime/panic.go:458 +0x243 _<https://ci.centos.org/job/libvirt-go-check/systems=libvirt-debian-8/ws/.TestAPICoverage(0xc4200b20c0)> <https://ci.centos.org/job/libvirt-go-check/systems=libvirt-debian-8/ws/api_test.go>:501 +0x5ff testing.tRunner(0xc4200b20c0, 0x608e08) /usr/lib/go-1.7/src/testing/testing.go:610 +0x81 created by testing.(*T).Run /usr/lib/go-1.7/src/testing/testing.go:646 +0x2ec exit status 2 FAIL _<https://ci.centos.org/job/libvirt-go-check/systems=libvirt-debian-8/ws/> 0.230s Build step 'Execute shell' marked build as failure

See <https://ci.centos.org/job/libvirt-go-check/systems=libvirt-debian-8/234/display/redirect> ------------------------------------------ Started by upstream project "libvirt-go-check" build number 234 originally caused by: Started by upstream project "libvirt-go-build" build number 238 originally caused by: Started by upstream project "libvirt-build" build number 298 originally caused by: Started by an SCM change Started by an SCM change Started by an SCM change Started by an SCM change Started by an SCM change Started by an SCM change [EnvInject] - Loading node environment variables. Building remotely on libvirt-debian-8 (libvirt) in workspace <https://ci.centos.org/job/libvirt-go-check/systems=libvirt-debian-8/ws/> [libvirt-go] $ /bin/sh -xe /tmp/jenkins2221003707840423700.sh + export TEST_ARGS=-tags api + go test -tags api Missing macro 'VIR_MIGRATE_PARAM_BANDWIDTH_POSTCOPY' Missing enum 'VIR_DOMAIN_MIGRATE_MAX_SPEED_POSTCOPY' --- FAIL: TestAPICoverage (0.39s) panic: Missing symbols found [recovered] panic: Missing symbols found goroutine 5 [running]: panic(0x5b56c0, 0xc420432560) /usr/lib/go-1.7/src/runtime/panic.go:500 +0x1a1 testing.tRunner.func1(0xc420078180) /usr/lib/go-1.7/src/testing/testing.go:579 +0x25d panic(0x5b56c0, 0xc420432560) /usr/lib/go-1.7/src/runtime/panic.go:458 +0x243 _<https://ci.centos.org/job/libvirt-go-check/systems=libvirt-debian-8/ws/.TestAPICoverage(0xc420078180)> <https://ci.centos.org/job/libvirt-go-check/systems=libvirt-debian-8/ws/api_test.go>:501 +0x5ff testing.tRunner(0xc420078180, 0x608e08) /usr/lib/go-1.7/src/testing/testing.go:610 +0x81 created by testing.(*T).Run /usr/lib/go-1.7/src/testing/testing.go:646 +0x2ec exit status 2 FAIL _<https://ci.centos.org/job/libvirt-go-check/systems=libvirt-debian-8/ws/> 0.483s Build step 'Execute shell' marked build as failure

See <https://ci.centos.org/job/libvirt-go-check/systems=libvirt-debian-8/235/display/redirect> ------------------------------------------ Started by upstream project "libvirt-go-check" build number 235 originally caused by: Started by upstream project "libvirt-go-build" build number 239 originally caused by: Started by upstream project "libvirt-build" build number 299 originally caused by: Started by an SCM change Started by an SCM change Started by an SCM change Started by an SCM change Started by an SCM change [EnvInject] - Loading node environment variables. Building remotely on libvirt-debian-8 (libvirt) in workspace <https://ci.centos.org/job/libvirt-go-check/systems=libvirt-debian-8/ws/> [libvirt-go] $ /bin/sh -xe /tmp/jenkins3937618410321326421.sh + export TEST_ARGS=-tags api + go test -tags api Missing macro 'VIR_MIGRATE_PARAM_BANDWIDTH_POSTCOPY' Missing enum 'VIR_DOMAIN_MIGRATE_MAX_SPEED_POSTCOPY' --- FAIL: TestAPICoverage (0.27s) panic: Missing symbols found [recovered] panic: Missing symbols found goroutine 19 [running]: panic(0x5b56c0, 0xc4202204c0) /usr/lib/go-1.7/src/runtime/panic.go:500 +0x1a1 testing.tRunner.func1(0xc420086180) /usr/lib/go-1.7/src/testing/testing.go:579 +0x25d panic(0x5b56c0, 0xc4202204c0) /usr/lib/go-1.7/src/runtime/panic.go:458 +0x243 _<https://ci.centos.org/job/libvirt-go-check/systems=libvirt-debian-8/ws/.TestAPICoverage(0xc420086180)> <https://ci.centos.org/job/libvirt-go-check/systems=libvirt-debian-8/ws/api_test.go>:501 +0x5ff testing.tRunner(0xc420086180, 0x608e08) /usr/lib/go-1.7/src/testing/testing.go:610 +0x81 created by testing.(*T).Run /usr/lib/go-1.7/src/testing/testing.go:646 +0x2ec exit status 2 FAIL _<https://ci.centos.org/job/libvirt-go-check/systems=libvirt-debian-8/ws/> 0.310s Build step 'Execute shell' marked build as failure

See <https://ci.centos.org/job/libvirt-go-check/systems=libvirt-debian-8/236/display/redirect> ------------------------------------------ Started by upstream project "libvirt-go-check" build number 236 originally caused by: Started by upstream project "libvirt-go-build" build number 240 originally caused by: Started by upstream project "libvirt-build" build number 300 originally caused by: Started by an SCM change Started by an SCM change Started by an SCM change Started by an SCM change Started by an SCM change Started by an SCM change Started by an SCM change [EnvInject] - Loading node environment variables. Building remotely on libvirt-debian-8 (libvirt) in workspace <https://ci.centos.org/job/libvirt-go-check/systems=libvirt-debian-8/ws/> [libvirt-go] $ /bin/sh -xe /tmp/jenkins6876415387415352902.sh + export TEST_ARGS=-tags api + go test -tags api Missing macro 'VIR_MIGRATE_PARAM_BANDWIDTH_POSTCOPY' Missing enum 'VIR_DOMAIN_MIGRATE_MAX_SPEED_POSTCOPY' --- FAIL: TestAPICoverage (0.76s) panic: Missing symbols found [recovered] panic: Missing symbols found goroutine 5 [running]: panic(0x5b56c0, 0xc42021e990) /usr/lib/go-1.7/src/runtime/panic.go:500 +0x1a1 testing.tRunner.func1(0xc420078180) /usr/lib/go-1.7/src/testing/testing.go:579 +0x25d panic(0x5b56c0, 0xc42021e990) /usr/lib/go-1.7/src/runtime/panic.go:458 +0x243 _<https://ci.centos.org/job/libvirt-go-check/systems=libvirt-debian-8/ws/.TestAPICoverage(0xc420078180)> <https://ci.centos.org/job/libvirt-go-check/systems=libvirt-debian-8/ws/api_test.go>:501 +0x5ff testing.tRunner(0xc420078180, 0x608e08) /usr/lib/go-1.7/src/testing/testing.go:610 +0x81 created by testing.(*T).Run /usr/lib/go-1.7/src/testing/testing.go:646 +0x2ec exit status 2 FAIL _<https://ci.centos.org/job/libvirt-go-check/systems=libvirt-debian-8/ws/> 0.886s Build step 'Execute shell' marked build as failure

participants (1)
-
ci@centos.org