[Libvirt-ci] Build failed in Jenkins: libvirt-go-xml-check » libvirt-fedora-29 #222

See <https://ci.centos.org/job/libvirt-go-xml-check/systems=libvirt-fedora-29/222/display/redirect> ------------------------------------------ Started by upstream project "libvirt-go-xml-check" build number 222 originally caused by: Started by upstream project "libvirt-go-xml-build" build number 222 originally caused by: Started by upstream project "libvirt-build" build number 280 originally caused by: Started by an SCM change Started by an SCM change Started by an SCM change [EnvInject] - Loading node environment variables. Building remotely on libvirt-fedora-29 (libvirt) in workspace <https://ci.centos.org/job/libvirt-go-xml-check/systems=libvirt-fedora-29/ws/> [libvirt-go-xml] $ /bin/sh -xe /tmp/jenkins6081532051443757315.sh + export 'TEST_ARGS=-tags xmlroundtrip' + TEST_ARGS='-tags xmlroundtrip' + go test -tags xmlroundtrip --- FAIL: TestRoundTrip (6.69s) xml_test.go:400: testdata/libvirt/tests/networkxml2xmlin/routed-network.xml: /network[0]/bridge[0]/@zone: attribute 'myzone' in expected XML missing in actual XML FAIL exit status 1 FAIL _<https://ci.centos.org/job/libvirt-go-xml-check/systems=libvirt-fedora-29/ws/> 6.801s Build step 'Execute shell' marked build as failure

See <https://ci.centos.org/job/libvirt-go-xml-check/systems=libvirt-fedora-29/223/display/redirect> ------------------------------------------ Started by upstream project "libvirt-go-xml-check" build number 223 originally caused by: Started by upstream project "libvirt-go-xml-build" build number 223 originally caused by: Started by upstream project "libvirt-build" build number 281 originally caused by: Started by an SCM change Started by an SCM change Started by an SCM change Started by an SCM change Started by an SCM change Started by an SCM change Started by an SCM change Started by an SCM change [EnvInject] - Loading node environment variables. Building remotely on libvirt-fedora-29 (libvirt) in workspace <https://ci.centos.org/job/libvirt-go-xml-check/systems=libvirt-fedora-29/ws/> [libvirt-go-xml] $ /bin/sh -xe /tmp/jenkins2325843036568472819.sh + export 'TEST_ARGS=-tags xmlroundtrip' + TEST_ARGS='-tags xmlroundtrip' + go test -tags xmlroundtrip --- FAIL: TestRoundTrip (7.78s) xml_test.go:400: testdata/libvirt/tests/networkxml2xmlin/routed-network.xml: /network[0]/bridge[0]/@zone: attribute 'myzone' in expected XML missing in actual XML FAIL exit status 1 FAIL _<https://ci.centos.org/job/libvirt-go-xml-check/systems=libvirt-fedora-29/ws/> 7.934s Build step 'Execute shell' marked build as failure

See <https://ci.centos.org/job/libvirt-go-xml-check/systems=libvirt-fedora-29/224/display/redirect> ------------------------------------------ Started by upstream project "libvirt-go-xml-check" build number 224 originally caused by: Started by upstream project "libvirt-go-xml-build" build number 224 originally caused by: Started by upstream project "libvirt-build" build number 282 originally caused by: Started by an SCM change [EnvInject] - Loading node environment variables. Building remotely on libvirt-fedora-29 (libvirt) in workspace <https://ci.centos.org/job/libvirt-go-xml-check/systems=libvirt-fedora-29/ws/> [libvirt-go-xml] $ /bin/sh -xe /tmp/jenkins9190510555156662249.sh + export 'TEST_ARGS=-tags xmlroundtrip' + TEST_ARGS='-tags xmlroundtrip' + go test -tags xmlroundtrip --- FAIL: TestRoundTrip (14.48s) xml_test.go:400: testdata/libvirt/tests/networkxml2xmlin/routed-network.xml: /network[0]/bridge[0]/@zone: attribute 'myzone' in expected XML missing in actual XML FAIL exit status 1 FAIL _<https://ci.centos.org/job/libvirt-go-xml-check/systems=libvirt-fedora-29/ws/> 14.708s Build step 'Execute shell' marked build as failure

See <https://ci.centos.org/job/libvirt-go-xml-check/systems=libvirt-fedora-29/225/display/redirect> ------------------------------------------ Started by upstream project "libvirt-go-xml-check" build number 225 originally caused by: Started by upstream project "libvirt-go-xml-build" build number 225 originally caused by: Started by upstream project "libvirt-build" build number 284 originally caused by: Started by an SCM change [EnvInject] - Loading node environment variables. Building remotely on libvirt-fedora-29 (libvirt) in workspace <https://ci.centos.org/job/libvirt-go-xml-check/systems=libvirt-fedora-29/ws/> [libvirt-go-xml] $ /bin/sh -xe /tmp/jenkins7893680006746574401.sh + export 'TEST_ARGS=-tags xmlroundtrip' + TEST_ARGS='-tags xmlroundtrip' + go test -tags xmlroundtrip --- FAIL: TestRoundTrip (16.32s) xml_test.go:400: testdata/libvirt/tests/networkxml2xmlin/routed-network.xml: /network[0]/bridge[0]/@zone: attribute 'myzone' in expected XML missing in actual XML FAIL exit status 1 FAIL _<https://ci.centos.org/job/libvirt-go-xml-check/systems=libvirt-fedora-29/ws/> 16.467s Build step 'Execute shell' marked build as failure

participants (1)
-
ci@centos.org