[Libvirt-ci] Build failed in Jenkins: libvirt-go-xml-master-check » libvirt-centos-7 #405

See <https://ci.centos.org/job/libvirt-go-xml-master-check/systems=libvirt-centos-7/405/display/redirect> ------------------------------------------ Started by upstream project "libvirt-go-xml-master-check" build number 405 originally caused by: Started by upstream project "libvirt-go-xml-master-build" build number 413 originally caused by: Started by upstream project "libvirt-master-build" build number 1463 originally caused by: Started by an SCM change [EnvInject] - Loading node environment variables. Building remotely on libvirt-centos-7 (libvirt) in workspace <https://ci.centos.org/job/libvirt-go-xml-master-check/systems=libvirt-centos-7/ws/> [libvirt-go-xml-master] $ /bin/sh -xe /tmp/jenkins6584844512793588480.sh + export 'TEST_ARGS=-tags xmlroundtrip' + TEST_ARGS='-tags xmlroundtrip' + go test -tags xmlroundtrip --- FAIL: TestRoundTrip (15.74s) xml_test.go:383: testdata/libvirt/tests/domaincapsschemadata/basic.xml: /domainCapabilities[0]/features[0]/genid[0]: element in expected XML missing in actual XML FAIL exit status 1 FAIL _<https://ci.centos.org/job/libvirt-go-xml-master-check/systems=libvirt-centos-7/ws/> 15.835s Build step 'Execute shell' marked build as failure

See <https://ci.centos.org/job/libvirt-go-xml-master-check/systems=libvirt-centos-7/406/display/redirect> ------------------------------------------ Started by upstream project "libvirt-go-xml-master-check" build number 406 originally caused by: Started by upstream project "libvirt-go-xml-master-build" build number 414 originally caused by: Started by upstream project "libvirt-master-build" build number 1464 originally caused by: Started by an SCM change [EnvInject] - Loading node environment variables. Building remotely on libvirt-centos-7 (libvirt) in workspace <https://ci.centos.org/job/libvirt-go-xml-master-check/systems=libvirt-centos-7/ws/> [libvirt-go-xml-master] $ /bin/sh -xe /tmp/jenkins4746604978291337670.sh + export 'TEST_ARGS=-tags xmlroundtrip' + TEST_ARGS='-tags xmlroundtrip' + go test -tags xmlroundtrip --- FAIL: TestRoundTrip (17.71s) xml_test.go:383: testdata/libvirt/tests/capabilityschemadata/caps-test2.xml: /capabilities[0]/host[0]/cpu[0]/microcode[0]: element in expected XML missing in actual XML FAIL exit status 1 FAIL _<https://ci.centos.org/job/libvirt-go-xml-master-check/systems=libvirt-centos-7/ws/> 17.891s Build step 'Execute shell' marked build as failure

See <https://ci.centos.org/job/libvirt-go-xml-master-check/systems=libvirt-centos-7/407/display/redirect> ------------------------------------------ Started by upstream project "libvirt-go-xml-master-check" build number 407 originally caused by: Started by upstream project "libvirt-go-xml-master-build" build number 415 originally caused by: Started by upstream project "libvirt-master-build" build number 1465 originally caused by: Started by an SCM change [EnvInject] - Loading node environment variables. Building remotely on libvirt-centos-7 (libvirt) in workspace <https://ci.centos.org/job/libvirt-go-xml-master-check/systems=libvirt-centos-7/ws/> [libvirt-go-xml-master] $ /bin/sh -xe /tmp/jenkins5168735256300302720.sh + export 'TEST_ARGS=-tags xmlroundtrip' + TEST_ARGS='-tags xmlroundtrip' + go test -tags xmlroundtrip --- FAIL: TestRoundTrip (20.20s) xml_test.go:383: testdata/libvirt/tests/capabilityschemadata/caps-test2.xml: /capabilities[0]/host[0]/cpu[0]/microcode[0]: element in expected XML missing in actual XML FAIL exit status 1 FAIL _<https://ci.centos.org/job/libvirt-go-xml-master-check/systems=libvirt-centos-7/ws/> 20.354s Build step 'Execute shell' marked build as failure

See <https://ci.centos.org/job/libvirt-go-xml-master-check/systems=libvirt-centos-7/408/display/redirect> ------------------------------------------ Started by upstream project "libvirt-go-xml-master-check" build number 408 originally caused by: Started by upstream project "libvirt-go-xml-master-build" build number 416 originally caused by: Started by upstream project "libvirt-master-build" build number 1466 originally caused by: Started by an SCM change [EnvInject] - Loading node environment variables. Building remotely on libvirt-centos-7 (libvirt) in workspace <https://ci.centos.org/job/libvirt-go-xml-master-check/systems=libvirt-centos-7/ws/> [libvirt-go-xml-master] $ /bin/sh -xe /tmp/jenkins6566999595053757625.sh + export 'TEST_ARGS=-tags xmlroundtrip' + TEST_ARGS='-tags xmlroundtrip' + go test -tags xmlroundtrip --- FAIL: TestRoundTrip (14.72s) xml_test.go:383: testdata/libvirt/tests/capabilityschemadata/caps-test2.xml: /capabilities[0]/host[0]/cpu[0]/microcode[0]: element in expected XML missing in actual XML FAIL exit status 1 FAIL _<https://ci.centos.org/job/libvirt-go-xml-master-check/systems=libvirt-centos-7/ws/> 15.151s Build step 'Execute shell' marked build as failure

See <https://ci.centos.org/job/libvirt-go-xml-master-check/systems=libvirt-centos-7/409/display/redirect> ------------------------------------------ Started by upstream project "libvirt-go-xml-master-check" build number 409 originally caused by: Started by upstream project "libvirt-go-xml-master-build" build number 417 originally caused by: Started by upstream project "libvirt-master-build" build number 1467 originally caused by: Started by an SCM change Started by an SCM change [EnvInject] - Loading node environment variables. Building remotely on libvirt-centos-7 (libvirt) in workspace <https://ci.centos.org/job/libvirt-go-xml-master-check/systems=libvirt-centos-7/ws/> [libvirt-go-xml-master] $ /bin/sh -xe /tmp/jenkins2688528427763558050.sh + export 'TEST_ARGS=-tags xmlroundtrip' + TEST_ARGS='-tags xmlroundtrip' + go test -tags xmlroundtrip --- FAIL: TestRoundTrip (12.63s) xml_test.go:383: testdata/libvirt/tests/capabilityschemadata/caps-test2.xml: /capabilities[0]/host[0]/cpu[0]/microcode[0]: element in expected XML missing in actual XML FAIL exit status 1 FAIL _<https://ci.centos.org/job/libvirt-go-xml-master-check/systems=libvirt-centos-7/ws/> 12.818s Build step 'Execute shell' marked build as failure

See <https://ci.centos.org/job/libvirt-go-xml-master-check/systems=libvirt-centos-7/410/display/redirect> ------------------------------------------ Started by upstream project "libvirt-go-xml-master-check" build number 410 originally caused by: Started by upstream project "libvirt-go-xml-master-build" build number 418 originally caused by: Started by upstream project "libvirt-master-build" build number 1468 originally caused by: Started by an SCM change [EnvInject] - Loading node environment variables. Building remotely on libvirt-centos-7 (libvirt) in workspace <https://ci.centos.org/job/libvirt-go-xml-master-check/systems=libvirt-centos-7/ws/> [libvirt-go-xml-master] $ /bin/sh -xe /tmp/jenkins2995499251285138206.sh + export 'TEST_ARGS=-tags xmlroundtrip' + TEST_ARGS='-tags xmlroundtrip' + go test -tags xmlroundtrip --- FAIL: TestRoundTrip (24.99s) xml_test.go:383: testdata/libvirt/tests/capabilityschemadata/caps-test2.xml: /capabilities[0]/host[0]/cpu[0]/microcode[0]: element in expected XML missing in actual XML FAIL exit status 1 FAIL _<https://ci.centos.org/job/libvirt-go-xml-master-check/systems=libvirt-centos-7/ws/> 25.113s Build step 'Execute shell' marked build as failure

See <https://ci.centos.org/job/libvirt-go-xml-master-check/systems=libvirt-centos-7/411/display/redirect> ------------------------------------------ Started by upstream project "libvirt-go-xml-master-check" build number 411 originally caused by: Started by upstream project "libvirt-go-xml-master-build" build number 419 originally caused by: Started by upstream project "libvirt-master-build" build number 1469 originally caused by: Started by an SCM change [EnvInject] - Loading node environment variables. Building remotely on libvirt-centos-7 (libvirt) in workspace <https://ci.centos.org/job/libvirt-go-xml-master-check/systems=libvirt-centos-7/ws/> [libvirt-go-xml-master] $ /bin/sh -xe /tmp/jenkins6887045308925662905.sh + export 'TEST_ARGS=-tags xmlroundtrip' + TEST_ARGS='-tags xmlroundtrip' + go test -tags xmlroundtrip --- FAIL: TestRoundTrip (18.09s) xml_test.go:383: testdata/libvirt/tests/capabilityschemadata/caps-test2.xml: /capabilities[0]/host[0]/cpu[0]/microcode[0]: element in expected XML missing in actual XML FAIL exit status 1 FAIL _<https://ci.centos.org/job/libvirt-go-xml-master-check/systems=libvirt-centos-7/ws/> 18.501s Build step 'Execute shell' marked build as failure

See <https://ci.centos.org/job/libvirt-go-xml-master-check/systems=libvirt-centos-7/412/display/redirect> ------------------------------------------ Started by upstream project "libvirt-go-xml-master-check" build number 412 originally caused by: Started by upstream project "libvirt-go-xml-master-build" build number 420 originally caused by: Started by upstream project "libvirt-master-build" build number 1470 originally caused by: Started by an SCM change [EnvInject] - Loading node environment variables. Building remotely on libvirt-centos-7 (libvirt) in workspace <https://ci.centos.org/job/libvirt-go-xml-master-check/systems=libvirt-centos-7/ws/> [libvirt-go-xml-master] $ /bin/sh -xe /tmp/jenkins8563025829280658532.sh + export 'TEST_ARGS=-tags xmlroundtrip' + TEST_ARGS='-tags xmlroundtrip' + go test -tags xmlroundtrip --- FAIL: TestRoundTrip (23.81s) xml_test.go:383: testdata/libvirt/tests/capabilityschemadata/caps-test2.xml: /capabilities[0]/host[0]/cpu[0]/microcode[0]: element in expected XML missing in actual XML FAIL exit status 1 FAIL _<https://ci.centos.org/job/libvirt-go-xml-master-check/systems=libvirt-centos-7/ws/> 24.001s Build step 'Execute shell' marked build as failure

See <https://ci.centos.org/job/libvirt-go-xml-master-check/systems=libvirt-centos-7/413/display/redirect> ------------------------------------------ Started by upstream project "libvirt-go-xml-master-check" build number 413 originally caused by: Started by upstream project "libvirt-go-xml-master-build" build number 421 originally caused by: Started by upstream project "libvirt-master-build" build number 1471 originally caused by: Started by an SCM change Started by an SCM change [EnvInject] - Loading node environment variables. Building remotely on libvirt-centos-7 (libvirt) in workspace <https://ci.centos.org/job/libvirt-go-xml-master-check/systems=libvirt-centos-7/ws/> [libvirt-go-xml-master] $ /bin/sh -xe /tmp/jenkins159911401822771449.sh + export 'TEST_ARGS=-tags xmlroundtrip' + TEST_ARGS='-tags xmlroundtrip' + go test -tags xmlroundtrip --- FAIL: TestRoundTrip (4.67s) xml_test.go:383: testdata/libvirt/tests/capabilityschemadata/caps-test2.xml: /capabilities[0]/host[0]/cpu[0]/microcode[0]: element in expected XML missing in actual XML FAIL exit status 1 FAIL _<https://ci.centos.org/job/libvirt-go-xml-master-check/systems=libvirt-centos-7/ws/> 4.917s Build step 'Execute shell' marked build as failure

See <https://ci.centos.org/job/libvirt-go-xml-master-check/systems=libvirt-centos-7/414/display/redirect> ------------------------------------------ Started by upstream project "libvirt-go-xml-master-check" build number 414 originally caused by: Started by upstream project "libvirt-go-xml-master-build" build number 422 originally caused by: Started by upstream project "libvirt-master-build" build number 1472 originally caused by: Started by an SCM change [EnvInject] - Loading node environment variables. Building remotely on libvirt-centos-7 (libvirt) in workspace <https://ci.centos.org/job/libvirt-go-xml-master-check/systems=libvirt-centos-7/ws/> [libvirt-go-xml-master] $ /bin/sh -xe /tmp/jenkins5871808297076760869.sh + export 'TEST_ARGS=-tags xmlroundtrip' + TEST_ARGS='-tags xmlroundtrip' + go test -tags xmlroundtrip --- FAIL: TestRoundTrip (25.52s) xml_test.go:383: testdata/libvirt/tests/capabilityschemadata/caps-test2.xml: /capabilities[0]/host[0]/cpu[0]/microcode[0]: element in expected XML missing in actual XML FAIL exit status 1 FAIL _<https://ci.centos.org/job/libvirt-go-xml-master-check/systems=libvirt-centos-7/ws/> 25.847s Build step 'Execute shell' marked build as failure

See <https://ci.centos.org/job/libvirt-go-xml-master-check/systems=libvirt-centos-7/415/display/redirect> ------------------------------------------ Started by upstream project "libvirt-go-xml-master-check" build number 415 originally caused by: Started by upstream project "libvirt-go-xml-master-build" build number 423 originally caused by: Started by upstream project "libvirt-master-build" build number 1473 originally caused by: Started by an SCM change [EnvInject] - Loading node environment variables. Building remotely on libvirt-centos-7 (libvirt) in workspace <https://ci.centos.org/job/libvirt-go-xml-master-check/systems=libvirt-centos-7/ws/> [libvirt-go-xml-master] $ /bin/sh -xe /tmp/jenkins8485773400944385065.sh + export 'TEST_ARGS=-tags xmlroundtrip' + TEST_ARGS='-tags xmlroundtrip' + go test -tags xmlroundtrip --- FAIL: TestRoundTrip (13.45s) xml_test.go:383: testdata/libvirt/tests/capabilityschemadata/caps-test2.xml: /capabilities[0]/host[0]/cpu[0]/microcode[0]: element in expected XML missing in actual XML FAIL exit status 1 FAIL _<https://ci.centos.org/job/libvirt-go-xml-master-check/systems=libvirt-centos-7/ws/> 13.818s Build step 'Execute shell' marked build as failure

See <https://ci.centos.org/job/libvirt-go-xml-master-check/systems=libvirt-centos-7/416/display/redirect> ------------------------------------------ Started by upstream project "libvirt-go-xml-master-check" build number 416 originally caused by: Started by upstream project "libvirt-go-xml-master-build" build number 424 originally caused by: Started by upstream project "libvirt-master-build" build number 1474 originally caused by: Started by an SCM change Started by an SCM change Started by an SCM change [EnvInject] - Loading node environment variables. Building remotely on libvirt-centos-7 (libvirt) in workspace <https://ci.centos.org/job/libvirt-go-xml-master-check/systems=libvirt-centos-7/ws/> [libvirt-go-xml-master] $ /bin/sh -xe /tmp/jenkins2730473445214356536.sh + export 'TEST_ARGS=-tags xmlroundtrip' + TEST_ARGS='-tags xmlroundtrip' + go test -tags xmlroundtrip --- FAIL: TestRoundTrip (4.58s) xml_test.go:383: testdata/libvirt/tests/capabilityschemadata/caps-test2.xml: /capabilities[0]/host[0]/cpu[0]/microcode[0]: element in expected XML missing in actual XML FAIL exit status 1 FAIL _<https://ci.centos.org/job/libvirt-go-xml-master-check/systems=libvirt-centos-7/ws/> 4.764s Build step 'Execute shell' marked build as failure

See <https://ci.centos.org/job/libvirt-go-xml-master-check/systems=libvirt-centos-7/417/display/redirect> ------------------------------------------ Started by upstream project "libvirt-go-xml-master-check" build number 417 originally caused by: Started by upstream project "libvirt-go-xml-master-build" build number 425 originally caused by: Started by upstream project "libvirt-master-build" build number 1475 originally caused by: Started by an SCM change [EnvInject] - Loading node environment variables. Building remotely on libvirt-centos-7 (libvirt) in workspace <https://ci.centos.org/job/libvirt-go-xml-master-check/systems=libvirt-centos-7/ws/> [libvirt-go-xml-master] $ /bin/sh -xe /tmp/jenkins336699262246940378.sh + export 'TEST_ARGS=-tags xmlroundtrip' + TEST_ARGS='-tags xmlroundtrip' + go test -tags xmlroundtrip --- FAIL: TestRoundTrip (16.15s) xml_test.go:383: testdata/libvirt/tests/capabilityschemadata/caps-test2.xml: /capabilities[0]/host[0]/cpu[0]/microcode[0]: element in expected XML missing in actual XML FAIL exit status 1 FAIL _<https://ci.centos.org/job/libvirt-go-xml-master-check/systems=libvirt-centos-7/ws/> 16.262s Build step 'Execute shell' marked build as failure

See <https://ci.centos.org/job/libvirt-go-xml-master-check/systems=libvirt-centos-7/418/display/redirect> ------------------------------------------ Started by upstream project "libvirt-go-xml-master-check" build number 418 originally caused by: Started by upstream project "libvirt-go-xml-master-build" build number 426 originally caused by: Started by upstream project "libvirt-master-build" build number 1476 originally caused by: Started by an SCM change [EnvInject] - Loading node environment variables. Building remotely on libvirt-centos-7 (libvirt) in workspace <https://ci.centos.org/job/libvirt-go-xml-master-check/systems=libvirt-centos-7/ws/> [libvirt-go-xml-master] $ /bin/sh -xe /tmp/jenkins2054227705697743419.sh + export 'TEST_ARGS=-tags xmlroundtrip' + TEST_ARGS='-tags xmlroundtrip' + go test -tags xmlroundtrip --- FAIL: TestRoundTrip (17.74s) xml_test.go:383: testdata/libvirt/tests/capabilityschemadata/caps-test2.xml: /capabilities[0]/host[0]/cpu[0]/microcode[0]: element in expected XML missing in actual XML FAIL exit status 1 FAIL _<https://ci.centos.org/job/libvirt-go-xml-master-check/systems=libvirt-centos-7/ws/> 18.015s Build step 'Execute shell' marked build as failure

See <https://ci.centos.org/job/libvirt-go-xml-master-check/systems=libvirt-centos-7/419/display/redirect> ------------------------------------------ Started by upstream project "libvirt-go-xml-master-check" build number 419 originally caused by: Started by upstream project "libvirt-go-xml-master-build" build number 427 originally caused by: Started by upstream project "libvirt-master-build" build number 1477 originally caused by: Started by an SCM change Started by an SCM change Started by an SCM change [EnvInject] - Loading node environment variables. Building remotely on libvirt-centos-7 (libvirt) in workspace <https://ci.centos.org/job/libvirt-go-xml-master-check/systems=libvirt-centos-7/ws/> [libvirt-go-xml-master] $ /bin/sh -xe /tmp/jenkins4994653180543318024.sh + export 'TEST_ARGS=-tags xmlroundtrip' + TEST_ARGS='-tags xmlroundtrip' + go test -tags xmlroundtrip --- FAIL: TestRoundTrip (14.85s) xml_test.go:383: testdata/libvirt/tests/capabilityschemadata/caps-test2.xml: /capabilities[0]/host[0]/cpu[0]/microcode[0]: element in expected XML missing in actual XML FAIL exit status 1 FAIL _<https://ci.centos.org/job/libvirt-go-xml-master-check/systems=libvirt-centos-7/ws/> 15.037s Build step 'Execute shell' marked build as failure

See <https://ci.centos.org/job/libvirt-go-xml-master-check/systems=libvirt-centos-7/420/display/redirect> ------------------------------------------ Started by upstream project "libvirt-go-xml-master-check" build number 420 originally caused by: Started by upstream project "libvirt-go-xml-master-build" build number 428 originally caused by: Started by upstream project "libvirt-master-build" build number 1478 originally caused by: Started by an SCM change [EnvInject] - Loading node environment variables. Building remotely on libvirt-centos-7 (libvirt) in workspace <https://ci.centos.org/job/libvirt-go-xml-master-check/systems=libvirt-centos-7/ws/> [libvirt-go-xml-master] $ /bin/sh -xe /tmp/jenkins3227425000082386283.sh + export 'TEST_ARGS=-tags xmlroundtrip' + TEST_ARGS='-tags xmlroundtrip' + go test -tags xmlroundtrip --- FAIL: TestRoundTrip (19.32s) xml_test.go:383: testdata/libvirt/tests/capabilityschemadata/caps-test2.xml: /capabilities[0]/host[0]/cpu[0]/microcode[0]: element in expected XML missing in actual XML FAIL exit status 1 FAIL _<https://ci.centos.org/job/libvirt-go-xml-master-check/systems=libvirt-centos-7/ws/> 19.612s Build step 'Execute shell' marked build as failure

See <https://ci.centos.org/job/libvirt-go-xml-master-check/systems=libvirt-centos-7/421/display/redirect> ------------------------------------------ Started by upstream project "libvirt-go-xml-master-check" build number 421 originally caused by: Started by upstream project "libvirt-go-xml-master-build" build number 429 originally caused by: Started by upstream project "libvirt-master-build" build number 1479 originally caused by: Started by an SCM change [EnvInject] - Loading node environment variables. Building remotely on libvirt-centos-7 (libvirt) in workspace <https://ci.centos.org/job/libvirt-go-xml-master-check/systems=libvirt-centos-7/ws/> [libvirt-go-xml-master] $ /bin/sh -xe /tmp/jenkins9054258963342097269.sh + export 'TEST_ARGS=-tags xmlroundtrip' + TEST_ARGS='-tags xmlroundtrip' + go test -tags xmlroundtrip --- FAIL: TestRoundTrip (18.65s) xml_test.go:383: testdata/libvirt/tests/capabilityschemadata/caps-test2.xml: /capabilities[0]/host[0]/cpu[0]/microcode[0]: element in expected XML missing in actual XML FAIL exit status 1 FAIL _<https://ci.centos.org/job/libvirt-go-xml-master-check/systems=libvirt-centos-7/ws/> 18.880s Build step 'Execute shell' marked build as failure

See <https://ci.centos.org/job/libvirt-go-xml-master-check/systems=libvirt-centos-7/422/display/redirect> ------------------------------------------ Started by upstream project "libvirt-go-xml-master-check" build number 422 originally caused by: Started by upstream project "libvirt-go-xml-master-build" build number 430 originally caused by: Started by upstream project "libvirt-master-build" build number 1480 originally caused by: Started by an SCM change [EnvInject] - Loading node environment variables. Building remotely on libvirt-centos-7 (libvirt) in workspace <https://ci.centos.org/job/libvirt-go-xml-master-check/systems=libvirt-centos-7/ws/> [libvirt-go-xml-master] $ /bin/sh -xe /tmp/jenkins6908118396290010136.sh + export 'TEST_ARGS=-tags xmlroundtrip' + TEST_ARGS='-tags xmlroundtrip' + go test -tags xmlroundtrip --- FAIL: TestRoundTrip (18.01s) xml_test.go:383: testdata/libvirt/tests/capabilityschemadata/caps-test2.xml: /capabilities[0]/host[0]/cpu[0]/microcode[0]: element in expected XML missing in actual XML FAIL exit status 1 FAIL _<https://ci.centos.org/job/libvirt-go-xml-master-check/systems=libvirt-centos-7/ws/> 18.194s Build step 'Execute shell' marked build as failure

See <https://ci.centos.org/job/libvirt-go-xml-master-check/systems=libvirt-centos-7/423/display/redirect> ------------------------------------------ Started by upstream project "libvirt-go-xml-master-check" build number 423 originally caused by: Started by upstream project "libvirt-go-xml-master-build" build number 431 originally caused by: Started by upstream project "libvirt-master-build" build number 1481 originally caused by: Started by an SCM change Started by an SCM change [EnvInject] - Loading node environment variables. Building remotely on libvirt-centos-7 (libvirt) in workspace <https://ci.centos.org/job/libvirt-go-xml-master-check/systems=libvirt-centos-7/ws/> [libvirt-go-xml-master] $ /bin/sh -xe /tmp/jenkins3523453963554161008.sh + export 'TEST_ARGS=-tags xmlroundtrip' + TEST_ARGS='-tags xmlroundtrip' + go test -tags xmlroundtrip --- FAIL: TestRoundTrip (6.94s) xml_test.go:383: testdata/libvirt/tests/capabilityschemadata/caps-test2.xml: /capabilities[0]/host[0]/cpu[0]/microcode[0]: element in expected XML missing in actual XML FAIL exit status 1 FAIL _<https://ci.centos.org/job/libvirt-go-xml-master-check/systems=libvirt-centos-7/ws/> 7.152s Build step 'Execute shell' marked build as failure

participants (1)
-
ci@centos.org