[Libvirt-ci] Build failed in Jenkins: libvirt-go-check » libvirt-debian-8 #218

See <https://ci.centos.org/job/libvirt-go-check/systems=libvirt-debian-8/218/display/redirect> ------------------------------------------ Started by upstream project "libvirt-go-check" build number 218 originally caused by: Started by upstream project "libvirt-go-build" build number 222 originally caused by: Started by upstream project "libvirt-build" build number 281 originally caused by: Started by an SCM change Started by an SCM change Started by an SCM change Started by an SCM change Started by an SCM change Started by an SCM change Started by an SCM change Started by an SCM change [EnvInject] - Loading node environment variables. Building remotely on libvirt-debian-8 (libvirt) in workspace <https://ci.centos.org/job/libvirt-go-check/systems=libvirt-debian-8/ws/> [libvirt-go] $ /bin/sh -xe /tmp/jenkins9062441197390380548.sh + export TEST_ARGS=-tags api + go test -tags api Missing enum 'VIR_FROM_FIREWALLD' --- FAIL: TestAPICoverage (0.36s) panic: Missing symbols found [recovered] panic: Missing symbols found goroutine 5 [running]: panic(0x5b56c0, 0xc4200a8380) /usr/lib/go-1.7/src/runtime/panic.go:500 +0x1a1 testing.tRunner.func1(0xc420078180) /usr/lib/go-1.7/src/testing/testing.go:579 +0x25d panic(0x5b56c0, 0xc4200a8380) /usr/lib/go-1.7/src/runtime/panic.go:458 +0x243 _<https://ci.centos.org/job/libvirt-go-check/systems=libvirt-debian-8/ws/.TestAPICoverage(0xc420078180)> <https://ci.centos.org/job/libvirt-go-check/systems=libvirt-debian-8/ws/api_test.go>:501 +0x5ff testing.tRunner(0xc420078180, 0x608e08) /usr/lib/go-1.7/src/testing/testing.go:610 +0x81 created by testing.(*T).Run /usr/lib/go-1.7/src/testing/testing.go:646 +0x2ec exit status 2 FAIL _<https://ci.centos.org/job/libvirt-go-check/systems=libvirt-debian-8/ws/> 0.458s Build step 'Execute shell' marked build as failure

See <https://ci.centos.org/job/libvirt-go-check/systems=libvirt-debian-8/219/display/redirect> ------------------------------------------ Started by upstream project "libvirt-go-check" build number 219 originally caused by: Started by upstream project "libvirt-go-build" build number 223 originally caused by: Started by upstream project "libvirt-build" build number 282 originally caused by: Started by an SCM change [EnvInject] - Loading node environment variables. Building remotely on libvirt-debian-8 (libvirt) in workspace <https://ci.centos.org/job/libvirt-go-check/systems=libvirt-debian-8/ws/> [libvirt-go] $ /bin/sh -xe /tmp/jenkins4946376194019182332.sh + export TEST_ARGS=-tags api + go test -tags api Missing enum 'VIR_FROM_FIREWALLD' --- FAIL: TestAPICoverage (0.21s) panic: Missing symbols found [recovered] panic: Missing symbols found goroutine 18 [running]: panic(0x5b56c0, 0xc4204304c0) /usr/lib/go-1.7/src/runtime/panic.go:500 +0x1a1 testing.tRunner.func1(0xc42008a180) /usr/lib/go-1.7/src/testing/testing.go:579 +0x25d panic(0x5b56c0, 0xc4204304c0) /usr/lib/go-1.7/src/runtime/panic.go:458 +0x243 _<https://ci.centos.org/job/libvirt-go-check/systems=libvirt-debian-8/ws/.TestAPICoverage(0xc42008a180)> <https://ci.centos.org/job/libvirt-go-check/systems=libvirt-debian-8/ws/api_test.go>:501 +0x5ff testing.tRunner(0xc42008a180, 0x608e08) /usr/lib/go-1.7/src/testing/testing.go:610 +0x81 created by testing.(*T).Run /usr/lib/go-1.7/src/testing/testing.go:646 +0x2ec exit status 2 FAIL _<https://ci.centos.org/job/libvirt-go-check/systems=libvirt-debian-8/ws/> 0.242s Build step 'Execute shell' marked build as failure

See <https://ci.centos.org/job/libvirt-go-check/systems=libvirt-debian-8/220/display/redirect> ------------------------------------------ Started by upstream project "libvirt-go-check" build number 220 originally caused by: Started by upstream project "libvirt-go-build" build number 224 originally caused by: Started by upstream project "libvirt-build" build number 284 originally caused by: Started by an SCM change [EnvInject] - Loading node environment variables. Building remotely on libvirt-debian-8 (libvirt) in workspace <https://ci.centos.org/job/libvirt-go-check/systems=libvirt-debian-8/ws/> [libvirt-go] $ /bin/sh -xe /tmp/jenkins1504944667544120790.sh + export TEST_ARGS=-tags api + go test -tags api Missing enum 'VIR_FROM_FIREWALLD' --- FAIL: TestAPICoverage (0.35s) panic: Missing symbols found [recovered] panic: Missing symbols found goroutine 5 [running]: panic(0x5b56c0, 0xc420250540) /usr/lib/go-1.7/src/runtime/panic.go:500 +0x1a1 testing.tRunner.func1(0xc420078180) /usr/lib/go-1.7/src/testing/testing.go:579 +0x25d panic(0x5b56c0, 0xc420250540) /usr/lib/go-1.7/src/runtime/panic.go:458 +0x243 _<https://ci.centos.org/job/libvirt-go-check/systems=libvirt-debian-8/ws/.TestAPICoverage(0xc420078180)> <https://ci.centos.org/job/libvirt-go-check/systems=libvirt-debian-8/ws/api_test.go>:501 +0x5ff testing.tRunner(0xc420078180, 0x608e08) /usr/lib/go-1.7/src/testing/testing.go:610 +0x81 created by testing.(*T).Run /usr/lib/go-1.7/src/testing/testing.go:646 +0x2ec exit status 2 FAIL _<https://ci.centos.org/job/libvirt-go-check/systems=libvirt-debian-8/ws/> 0.458s Build step 'Execute shell' marked build as failure

participants (1)
-
ci@centos.org