[Libvirt-ci] Build failed in Jenkins: libvirt-go-xml-check » libvirt-freebsd-11 #271

See <https://ci.centos.org/job/libvirt-go-xml-check/systems=libvirt-freebsd-11/271/display/redirect> ------------------------------------------ Started by upstream project "libvirt-go-xml-check" build number 271 originally caused by: Started by upstream project "libvirt-go-xml-build" build number 271 originally caused by: Started by upstream project "libvirt-build" build number 333 originally caused by: Started by an SCM change [EnvInject] - Loading node environment variables. Building remotely on libvirt-freebsd-11 (libvirt) in workspace <https://ci.centos.org/job/libvirt-go-xml-check/systems=libvirt-freebsd-11/ws/> [libvirt-go-xml] $ /bin/sh -xe /tmp/jenkins7820210270750742829.sh + export 'TEST_ARGS=-tags xmlroundtrip' + go test -tags xmlroundtrip --- FAIL: TestRoundTrip (19.76s) xml_test.go:400: testdata/libvirt/tests/bhyvexml2argvdata/bhyvexml2argv-msrs.xml: /domain[0]/features[0]/msrs[0]: element in expected XML missing in actual XML FAIL exit status 1 FAIL _/usr<https://ci.centos.org/job/libvirt-go-xml-check/systems=libvirt-freebsd-11/ws/> 19.879s Build step 'Execute shell' marked build as failure

See <https://ci.centos.org/job/libvirt-go-xml-check/systems=libvirt-freebsd-11/272/display/redirect> ------------------------------------------ Started by upstream project "libvirt-go-xml-check" build number 272 originally caused by: Started by upstream project "libvirt-go-xml-build" build number 272 originally caused by: Started by upstream project "libvirt-build" build number 334 originally caused by: Started by an SCM change [EnvInject] - Loading node environment variables. Building remotely on libvirt-freebsd-11 (libvirt) in workspace <https://ci.centos.org/job/libvirt-go-xml-check/systems=libvirt-freebsd-11/ws/> [libvirt-go-xml] $ /bin/sh -xe /tmp/jenkins8218654292729356724.sh + export 'TEST_ARGS=-tags xmlroundtrip' + go test -tags xmlroundtrip --- FAIL: TestRoundTrip (3.61s) xml_test.go:400: testdata/libvirt/tests/bhyvexml2argvdata/bhyvexml2argv-msrs.xml: /domain[0]/features[0]/msrs[0]: element in expected XML missing in actual XML FAIL exit status 1 FAIL _/usr<https://ci.centos.org/job/libvirt-go-xml-check/systems=libvirt-freebsd-11/ws/> 3.720s Build step 'Execute shell' marked build as failure

See <https://ci.centos.org/job/libvirt-go-xml-check/systems=libvirt-freebsd-11/273/display/redirect> ------------------------------------------ Started by upstream project "libvirt-go-xml-check" build number 273 originally caused by: Started by upstream project "libvirt-go-xml-build" build number 273 originally caused by: Started by upstream project "libvirt-build" build number 335 originally caused by: Started by an SCM change [EnvInject] - Loading node environment variables. Building remotely on libvirt-freebsd-11 (libvirt) in workspace <https://ci.centos.org/job/libvirt-go-xml-check/systems=libvirt-freebsd-11/ws/> [libvirt-go-xml] $ /bin/sh -xe /tmp/jenkins589763400064805809.sh + export 'TEST_ARGS=-tags xmlroundtrip' + go test -tags xmlroundtrip --- FAIL: TestRoundTrip (19.19s) xml_test.go:400: testdata/libvirt/tests/bhyvexml2argvdata/bhyvexml2argv-msrs.xml: /domain[0]/features[0]/msrs[0]: element in expected XML missing in actual XML FAIL exit status 1 FAIL _/usr<https://ci.centos.org/job/libvirt-go-xml-check/systems=libvirt-freebsd-11/ws/> 19.247s Build step 'Execute shell' marked build as failure

participants (1)
-
ci@centos.org