[Libvirt-ci] Build failed in Jenkins: libvirt-go-check » libvirt-centos-7 #905

See <https://ci.centos.org/job/libvirt-go-check/systems=libvirt-centos-7/905/display/redirect> ------------------------------------------ Started by upstream project "libvirt-go-check" build number 905 originally caused by: Started by upstream project "libvirt-go-build" build number 919 originally caused by: Started by upstream project "libvirt-build" build number 1088 originally caused by: Started by an SCM change Running as SYSTEM [EnvInject] - Loading node environment variables. Building remotely on libvirt-centos-7 (libvirt) in workspace <https://ci.centos.org/job/libvirt-go-check/systems=libvirt-centos-7/ws/> [libvirt-go] $ /bin/sh -xe /tmp/jenkins15282259380322993837.sh + export 'TEST_ARGS=-tags api' + TEST_ARGS='-tags api' + go test -tags api Missing enum 'VIR_DOMAIN_STATS_MEMORY' --- FAIL: TestAPICoverage (1.71s) panic: Missing symbols found [recovered] panic: Missing symbols found goroutine 7 [running]: testing.tRunner.func1(0xc0000a4100) /usr/lib/golang/src/testing/testing.go:874 +0x3a3 panic(0x5de640, 0x65b590) /usr/lib/golang/src/runtime/panic.go:679 +0x1b2 _<https://ci.centos.org/job/libvirt-go-check/systems=libvirt-centos-7/ws/.TestAPICoverage(0xc0000a4100)> <https://ci.centos.org/job/libvirt-go-check/systems=libvirt-centos-7/ws/api_test.go>:503 +0x551 testing.tRunner(0xc0000a4100, 0x6344f0) /usr/lib/golang/src/testing/testing.go:909 +0xc9 created by testing.(*T).Run /usr/lib/golang/src/testing/testing.go:960 +0x350 exit status 2 FAIL _<https://ci.centos.org/job/libvirt-go-check/systems=libvirt-centos-7/ws/> 2.238s Build step 'Execute shell' marked build as failure

See <https://ci.centos.org/job/libvirt-go-check/systems=libvirt-centos-7/906/display/redirect> ------------------------------------------ Started by upstream project "libvirt-go-check" build number 906 originally caused by: Started by upstream project "libvirt-go-build" build number 920 originally caused by: Started by upstream project "libvirt-build" build number 1093 originally caused by: Started by an SCM change Running as SYSTEM [EnvInject] - Loading node environment variables. Building remotely on libvirt-centos-7 (libvirt) in workspace <https://ci.centos.org/job/libvirt-go-check/systems=libvirt-centos-7/ws/> [libvirt-go] $ /bin/sh -xe /tmp/jenkins13525083444169610085.sh + export 'TEST_ARGS=-tags api' + TEST_ARGS='-tags api' + go test -tags api Missing enum 'VIR_DOMAIN_STATS_MEMORY' --- FAIL: TestAPICoverage (0.33s) panic: Missing symbols found [recovered] panic: Missing symbols found goroutine 7 [running]: testing.tRunner.func1(0xc0000a4100) /usr/lib/golang/src/testing/testing.go:874 +0x3a3 panic(0x5de640, 0x65b590) /usr/lib/golang/src/runtime/panic.go:679 +0x1b2 _<https://ci.centos.org/job/libvirt-go-check/systems=libvirt-centos-7/ws/.TestAPICoverage(0xc0000a4100)> <https://ci.centos.org/job/libvirt-go-check/systems=libvirt-centos-7/ws/api_test.go>:503 +0x551 testing.tRunner(0xc0000a4100, 0x6344f0) /usr/lib/golang/src/testing/testing.go:909 +0xc9 created by testing.(*T).Run /usr/lib/golang/src/testing/testing.go:960 +0x350 exit status 2 FAIL _<https://ci.centos.org/job/libvirt-go-check/systems=libvirt-centos-7/ws/> 0.673s Build step 'Execute shell' marked build as failure

See <https://ci.centos.org/job/libvirt-go-check/systems=libvirt-centos-7/907/display/redirect> ------------------------------------------ Started by upstream project "libvirt-go-check" build number 907 originally caused by: Started by upstream project "libvirt-go-build" build number 921 originally caused by: Started by upstream project "libvirt-build" build number 1094 originally caused by: Started by an SCM change Running as SYSTEM [EnvInject] - Loading node environment variables. Building remotely on libvirt-centos-7 (libvirt) in workspace <https://ci.centos.org/job/libvirt-go-check/systems=libvirt-centos-7/ws/> [libvirt-go] $ /bin/sh -xe /tmp/jenkins5036138288858650486.sh + export 'TEST_ARGS=-tags api' + TEST_ARGS='-tags api' + go test -tags api Missing enum 'VIR_DOMAIN_STATS_MEMORY' --- FAIL: TestAPICoverage (0.69s) panic: Missing symbols found [recovered] panic: Missing symbols found goroutine 7 [running]: testing.tRunner.func1(0xc0000a4100) /usr/lib/golang/src/testing/testing.go:874 +0x3a3 panic(0x5de640, 0x65b590) /usr/lib/golang/src/runtime/panic.go:679 +0x1b2 _<https://ci.centos.org/job/libvirt-go-check/systems=libvirt-centos-7/ws/.TestAPICoverage(0xc0000a4100)> <https://ci.centos.org/job/libvirt-go-check/systems=libvirt-centos-7/ws/api_test.go>:503 +0x551 testing.tRunner(0xc0000a4100, 0x6344f0) /usr/lib/golang/src/testing/testing.go:909 +0xc9 created by testing.(*T).Run /usr/lib/golang/src/testing/testing.go:960 +0x350 exit status 2 FAIL _<https://ci.centos.org/job/libvirt-go-check/systems=libvirt-centos-7/ws/> 0.916s Build step 'Execute shell' marked build as failure

See <https://ci.centos.org/job/libvirt-go-check/systems=libvirt-centos-7/908/display/redirect> ------------------------------------------ Started by upstream project "libvirt-go-check" build number 908 originally caused by: Started by upstream project "libvirt-go-build" build number 922 originally caused by: Started by upstream project "libvirt-build" build number 1095 originally caused by: Started by an SCM change Running as SYSTEM [EnvInject] - Loading node environment variables. Building remotely on libvirt-centos-7 (libvirt) in workspace <https://ci.centos.org/job/libvirt-go-check/systems=libvirt-centos-7/ws/> [libvirt-go] $ /bin/sh -xe /tmp/jenkins15312747407690306878.sh + export 'TEST_ARGS=-tags api' + TEST_ARGS='-tags api' + go test -tags api Missing enum 'VIR_DOMAIN_STATS_MEMORY' --- FAIL: TestAPICoverage (0.94s) panic: Missing symbols found [recovered] panic: Missing symbols found goroutine 20 [running]: testing.tRunner.func1(0xc0000ba100) /usr/lib/golang/src/testing/testing.go:874 +0x3a3 panic(0x5de640, 0x65b590) /usr/lib/golang/src/runtime/panic.go:679 +0x1b2 _<https://ci.centos.org/job/libvirt-go-check/systems=libvirt-centos-7/ws/.TestAPICoverage(0xc0000ba100)> <https://ci.centos.org/job/libvirt-go-check/systems=libvirt-centos-7/ws/api_test.go>:503 +0x551 testing.tRunner(0xc0000ba100, 0x6344f0) /usr/lib/golang/src/testing/testing.go:909 +0xc9 created by testing.(*T).Run /usr/lib/golang/src/testing/testing.go:960 +0x350 exit status 2 FAIL _<https://ci.centos.org/job/libvirt-go-check/systems=libvirt-centos-7/ws/> 1.261s Build step 'Execute shell' marked build as failure

See <https://ci.centos.org/job/libvirt-go-check/systems=libvirt-centos-7/909/display/redirect> ------------------------------------------ Started by upstream project "libvirt-go-check" build number 909 originally caused by: Started by upstream project "libvirt-go-build" build number 923 originally caused by: Started by upstream project "libvirt-build" build number 1096 originally caused by: Started by an SCM change Running as SYSTEM [EnvInject] - Loading node environment variables. Building remotely on libvirt-centos-7 (libvirt) in workspace <https://ci.centos.org/job/libvirt-go-check/systems=libvirt-centos-7/ws/> [libvirt-go] $ /bin/sh -xe /tmp/jenkins9021619322834830171.sh + export 'TEST_ARGS=-tags api' + TEST_ARGS='-tags api' + go test -tags api Missing enum 'VIR_DOMAIN_STATS_MEMORY' --- FAIL: TestAPICoverage (0.63s) panic: Missing symbols found [recovered] panic: Missing symbols found goroutine 7 [running]: testing.tRunner.func1(0xc0000a4100) /usr/lib/golang/src/testing/testing.go:874 +0x3a3 panic(0x5de640, 0x65b590) /usr/lib/golang/src/runtime/panic.go:679 +0x1b2 _<https://ci.centos.org/job/libvirt-go-check/systems=libvirt-centos-7/ws/.TestAPICoverage(0xc0000a4100)> <https://ci.centos.org/job/libvirt-go-check/systems=libvirt-centos-7/ws/api_test.go>:503 +0x551 testing.tRunner(0xc0000a4100, 0x6344f0) /usr/lib/golang/src/testing/testing.go:909 +0xc9 created by testing.(*T).Run /usr/lib/golang/src/testing/testing.go:960 +0x350 exit status 2 FAIL _<https://ci.centos.org/job/libvirt-go-check/systems=libvirt-centos-7/ws/> 0.919s Build step 'Execute shell' marked build as failure

See <https://ci.centos.org/job/libvirt-go-check/systems=libvirt-centos-7/910/display/redirect> ------------------------------------------ Started by upstream project "libvirt-go-check" build number 910 originally caused by: Started by upstream project "libvirt-go-build" build number 924 originally caused by: Started by upstream project "libvirt-build" build number 1097 originally caused by: Started by an SCM change Started by an SCM change Started by an SCM change Running as SYSTEM [EnvInject] - Loading node environment variables. Building remotely on libvirt-centos-7 (libvirt) in workspace <https://ci.centos.org/job/libvirt-go-check/systems=libvirt-centos-7/ws/> [libvirt-go] $ /bin/sh -xe /tmp/jenkins3307257662697892386.sh + export 'TEST_ARGS=-tags api' + TEST_ARGS='-tags api' + go test -tags api Missing enum 'VIR_DOMAIN_STATS_MEMORY' --- FAIL: TestAPICoverage (0.63s) panic: Missing symbols found [recovered] panic: Missing symbols found goroutine 20 [running]: testing.tRunner.func1(0xc0000ba100) /usr/lib/golang/src/testing/testing.go:874 +0x3a3 panic(0x5de640, 0x65b590) /usr/lib/golang/src/runtime/panic.go:679 +0x1b2 _<https://ci.centos.org/job/libvirt-go-check/systems=libvirt-centos-7/ws/.TestAPICoverage(0xc0000ba100)> <https://ci.centos.org/job/libvirt-go-check/systems=libvirt-centos-7/ws/api_test.go>:503 +0x551 testing.tRunner(0xc0000ba100, 0x6344f0) /usr/lib/golang/src/testing/testing.go:909 +0xc9 created by testing.(*T).Run /usr/lib/golang/src/testing/testing.go:960 +0x350 exit status 2 FAIL _<https://ci.centos.org/job/libvirt-go-check/systems=libvirt-centos-7/ws/> 0.762s Build step 'Execute shell' marked build as failure

See <https://ci.centos.org/job/libvirt-go-check/systems=libvirt-centos-7/911/display/redirect> ------------------------------------------ Started by upstream project "libvirt-go-check" build number 911 originally caused by: Started by upstream project "libvirt-go-build" build number 925 originally caused by: Started by upstream project "libvirt-build" build number 1098 originally caused by: Started by an SCM change Started by an SCM change Started by an SCM change Running as SYSTEM [EnvInject] - Loading node environment variables. Building remotely on libvirt-centos-7 (libvirt) in workspace <https://ci.centos.org/job/libvirt-go-check/systems=libvirt-centos-7/ws/> [libvirt-go] $ /bin/sh -xe /tmp/jenkins13153663511570610151.sh + export 'TEST_ARGS=-tags api' + TEST_ARGS='-tags api' + go test -tags api Missing enum 'VIR_DOMAIN_STATS_MEMORY' --- FAIL: TestAPICoverage (1.76s) panic: Missing symbols found [recovered] panic: Missing symbols found goroutine 7 [running]: testing.tRunner.func1(0xc0000a4100) /usr/lib/golang/src/testing/testing.go:874 +0x3a3 panic(0x5de640, 0x65b590) /usr/lib/golang/src/runtime/panic.go:679 +0x1b2 _<https://ci.centos.org/job/libvirt-go-check/systems=libvirt-centos-7/ws/.TestAPICoverage(0xc0000a4100)> <https://ci.centos.org/job/libvirt-go-check/systems=libvirt-centos-7/ws/api_test.go>:503 +0x551 testing.tRunner(0xc0000a4100, 0x6344f0) /usr/lib/golang/src/testing/testing.go:909 +0xc9 created by testing.(*T).Run /usr/lib/golang/src/testing/testing.go:960 +0x350 exit status 2 FAIL _<https://ci.centos.org/job/libvirt-go-check/systems=libvirt-centos-7/ws/> 1.983s Build step 'Execute shell' marked build as failure

See <https://ci.centos.org/job/libvirt-go-check/systems=libvirt-centos-7/912/display/redirect> ------------------------------------------ Started by upstream project "libvirt-go-check" build number 912 originally caused by: Started by upstream project "libvirt-go-build" build number 926 originally caused by: Started by upstream project "libvirt-build" build number 1099 originally caused by: Started by user Libvirt Running as SYSTEM [EnvInject] - Loading node environment variables. Building remotely on libvirt-centos-7 (libvirt) in workspace <https://ci.centos.org/job/libvirt-go-check/systems=libvirt-centos-7/ws/> [libvirt-go] $ /bin/sh -xe /tmp/jenkins2498168210505825341.sh + export 'TEST_ARGS=-tags api' + TEST_ARGS='-tags api' + go test -tags api Missing enum 'VIR_DOMAIN_STATS_MEMORY' --- FAIL: TestAPICoverage (0.91s) panic: Missing symbols found [recovered] panic: Missing symbols found goroutine 7 [running]: testing.tRunner.func1(0xc0000a4100) /usr/lib/golang/src/testing/testing.go:874 +0x3a3 panic(0x5de640, 0x65b590) /usr/lib/golang/src/runtime/panic.go:679 +0x1b2 _<https://ci.centos.org/job/libvirt-go-check/systems=libvirt-centos-7/ws/.TestAPICoverage(0xc0000a4100)> <https://ci.centos.org/job/libvirt-go-check/systems=libvirt-centos-7/ws/api_test.go>:503 +0x551 testing.tRunner(0xc0000a4100, 0x6344f0) /usr/lib/golang/src/testing/testing.go:909 +0xc9 created by testing.(*T).Run /usr/lib/golang/src/testing/testing.go:960 +0x350 exit status 2 FAIL _<https://ci.centos.org/job/libvirt-go-check/systems=libvirt-centos-7/ws/> 1.304s Build step 'Execute shell' marked build as failure

participants (1)
-
ci@centos.org