Build failed in Jenkins: libvirt-go-xml-check » libvirt-fedora-30 #973

See <https://ci.centos.org/job/libvirt-go-xml-check/systems=libvirt-fedora-30/973/display/redirect> ------------------------------------------ Started by upstream project "libvirt-go-xml-check" build number 973 originally caused by: Started by upstream project "libvirt-go-xml-build" build number 976 originally caused by: Started by upstream project "libvirt-build" build number 1142 originally caused by: Started by an SCM change Running as SYSTEM [EnvInject] - Loading node environment variables. Building remotely on libvirt-fedora-30 (libvirt) in workspace <https://ci.centos.org/job/libvirt-go-xml-check/systems=libvirt-fedora-30/ws/> [libvirt-go-xml] $ /bin/sh -xe /tmp/jenkins7629761787415494404.sh + export 'TEST_ARGS=-tags xmlroundtrip' + TEST_ARGS='-tags xmlroundtrip' + go test -tags xmlroundtrip --- FAIL: TestRoundTrip (44.15s) xml_test.go:374: testdata/libvirt/tests/qemuxml2argvdata/net-virtio-teaming-network.xml: /domain[0]/devices[0]/interface[0]/teaming[0]: element in expected XML missing in actual XML FAIL exit status 1 FAIL _<https://ci.centos.org/job/libvirt-go-xml-check/systems=libvirt-fedora-30/ws/> 44.368s Build step 'Execute shell' marked build as failure

See <https://ci.centos.org/job/libvirt-go-xml-check/systems=libvirt-fedora-30/974/display/redirect> ------------------------------------------ Started by upstream project "libvirt-go-xml-check" build number 974 originally caused by: Started by upstream project "libvirt-go-xml-build" build number 977 originally caused by: Started by upstream project "libvirt-build" build number 1143 originally caused by: Started by an SCM change Running as SYSTEM [EnvInject] - Loading node environment variables. Building remotely on libvirt-fedora-30 (libvirt) in workspace <https://ci.centos.org/job/libvirt-go-xml-check/systems=libvirt-fedora-30/ws/> [libvirt-go-xml] $ /bin/sh -xe /tmp/jenkins2083489563561449004.sh + export 'TEST_ARGS=-tags xmlroundtrip' + TEST_ARGS='-tags xmlroundtrip' + go test -tags xmlroundtrip --- FAIL: TestRoundTrip (39.04s) xml_test.go:374: testdata/libvirt/tests/qemuxml2argvdata/net-virtio-teaming-network.xml: /domain[0]/devices[0]/interface[0]/teaming[0]: element in expected XML missing in actual XML FAIL exit status 1 FAIL _<https://ci.centos.org/job/libvirt-go-xml-check/systems=libvirt-fedora-30/ws/> 39.196s Build step 'Execute shell' marked build as failure

See <https://ci.centos.org/job/libvirt-go-xml-check/systems=libvirt-fedora-30/975/display/redirect> ------------------------------------------ Started by upstream project "libvirt-go-xml-check" build number 975 originally caused by: Started by upstream project "libvirt-go-xml-build" build number 978 originally caused by: Started by upstream project "libvirt-build" build number 1144 originally caused by: Started by an SCM change Running as SYSTEM [EnvInject] - Loading node environment variables. Building remotely on libvirt-fedora-30 (libvirt) in workspace <https://ci.centos.org/job/libvirt-go-xml-check/systems=libvirt-fedora-30/ws/> [libvirt-go-xml] $ /bin/sh -xe /tmp/jenkins17126545665476133394.sh + export 'TEST_ARGS=-tags xmlroundtrip' + TEST_ARGS='-tags xmlroundtrip' + go test -tags xmlroundtrip --- FAIL: TestRoundTrip (38.62s) xml_test.go:374: testdata/libvirt/tests/qemuxml2argvdata/net-virtio-teaming-network.xml: /domain[0]/devices[0]/interface[0]/teaming[0]: element in expected XML missing in actual XML FAIL exit status 1 FAIL _<https://ci.centos.org/job/libvirt-go-xml-check/systems=libvirt-fedora-30/ws/> 38.832s Build step 'Execute shell' marked build as failure

See <https://ci.centos.org/job/libvirt-go-xml-check/systems=libvirt-fedora-30/976/display/redirect> ------------------------------------------ Started by upstream project "libvirt-go-xml-check" build number 976 originally caused by: Started by upstream project "libvirt-go-xml-build" build number 979 originally caused by: Started by upstream project "libvirt-build" build number 1145 originally caused by: Started by an SCM change Running as SYSTEM [EnvInject] - Loading node environment variables. Building remotely on libvirt-fedora-30 (libvirt) in workspace <https://ci.centos.org/job/libvirt-go-xml-check/systems=libvirt-fedora-30/ws/> [libvirt-go-xml] $ /bin/sh -xe /tmp/jenkins2735458754190661645.sh + export 'TEST_ARGS=-tags xmlroundtrip' + TEST_ARGS='-tags xmlroundtrip' + go test -tags xmlroundtrip --- FAIL: TestRoundTrip (39.47s) xml_test.go:374: testdata/libvirt/tests/qemuxml2argvdata/net-virtio-teaming-network.xml: /domain[0]/devices[0]/interface[0]/teaming[0]: element in expected XML missing in actual XML FAIL exit status 1 FAIL _<https://ci.centos.org/job/libvirt-go-xml-check/systems=libvirt-fedora-30/ws/> 39.616s Build step 'Execute shell' marked build as failure

See <https://ci.centos.org/job/libvirt-go-xml-check/systems=libvirt-fedora-30/977/display/redirect> ------------------------------------------ Started by upstream project "libvirt-go-xml-check" build number 977 originally caused by: Started by upstream project "libvirt-go-xml-build" build number 980 originally caused by: Started by an SCM change Running as SYSTEM [EnvInject] - Loading node environment variables. Building remotely on libvirt-fedora-30 (libvirt) in workspace <https://ci.centos.org/job/libvirt-go-xml-check/systems=libvirt-fedora-30/ws/> [libvirt-go-xml] $ /bin/sh -xe /tmp/jenkins6252969846010559580.sh + export 'TEST_ARGS=-tags xmlroundtrip' + TEST_ARGS='-tags xmlroundtrip' + go test -tags xmlroundtrip --- FAIL: TestRoundTrip (4.98s) xml_test.go:374: testdata/libvirt/tests/qemuxml2argvdata/net-virtio-teaming-network.xml: /domain[0]/devices[0]/interface[0]/teaming[0]: element in expected XML missing in actual XML FAIL exit status 1 FAIL _<https://ci.centos.org/job/libvirt-go-xml-check/systems=libvirt-fedora-30/ws/> 5.026s Build step 'Execute shell' marked build as failure

See <https://ci.centos.org/job/libvirt-go-xml-check/systems=libvirt-fedora-30/978/display/redirect> ------------------------------------------ Started by upstream project "libvirt-go-xml-check" build number 978 originally caused by: Started by upstream project "libvirt-go-xml-build" build number 981 originally caused by: Started by upstream project "libvirt-build" build number 1146 originally caused by: Started by an SCM change Running as SYSTEM [EnvInject] - Loading node environment variables. Building remotely on libvirt-fedora-30 (libvirt) in workspace <https://ci.centos.org/job/libvirt-go-xml-check/systems=libvirt-fedora-30/ws/> [libvirt-go-xml] $ /bin/sh -xe /tmp/jenkins15307319964624921164.sh + export 'TEST_ARGS=-tags xmlroundtrip' + TEST_ARGS='-tags xmlroundtrip' + go test -tags xmlroundtrip --- FAIL: TestRoundTrip (12.48s) xml_test.go:374: testdata/libvirt/tests/qemuxml2argvdata/net-virtio-teaming-network.xml: /domain[0]/devices[0]/interface[0]/teaming[0]: element in expected XML missing in actual XML FAIL exit status 1 FAIL _<https://ci.centos.org/job/libvirt-go-xml-check/systems=libvirt-fedora-30/ws/> 12.604s Build step 'Execute shell' marked build as failure

See <https://ci.centos.org/job/libvirt-go-xml-check/systems=libvirt-fedora-30/979/display/redirect> ------------------------------------------ Started by upstream project "libvirt-go-xml-check" build number 979 originally caused by: Started by upstream project "libvirt-go-xml-build" build number 982 originally caused by: Started by upstream project "libvirt-build" build number 1147 originally caused by: Started by an SCM change Running as SYSTEM [EnvInject] - Loading node environment variables. Building remotely on libvirt-fedora-30 (libvirt) in workspace <https://ci.centos.org/job/libvirt-go-xml-check/systems=libvirt-fedora-30/ws/> [libvirt-go-xml] $ /bin/sh -xe /tmp/jenkins14489795278453045384.sh + export 'TEST_ARGS=-tags xmlroundtrip' + TEST_ARGS='-tags xmlroundtrip' + go test -tags xmlroundtrip --- FAIL: TestRoundTrip (45.21s) xml_test.go:374: testdata/libvirt/tests/qemuxml2argvdata/net-virtio-teaming-network.xml: /domain[0]/devices[0]/interface[0]/teaming[0]: element in expected XML missing in actual XML FAIL exit status 1 FAIL _<https://ci.centos.org/job/libvirt-go-xml-check/systems=libvirt-fedora-30/ws/> 45.448s Build step 'Execute shell' marked build as failure

See <https://ci.centos.org/job/libvirt-go-xml-check/systems=libvirt-fedora-30/980/display/redirect> ------------------------------------------ Started by upstream project "libvirt-go-xml-check" build number 980 originally caused by: Started by upstream project "libvirt-go-xml-build" build number 983 originally caused by: Started by upstream project "libvirt-build" build number 1148 originally caused by: Started by an SCM change Running as SYSTEM [EnvInject] - Loading node environment variables. Building remotely on libvirt-fedora-30 (libvirt) in workspace <https://ci.centos.org/job/libvirt-go-xml-check/systems=libvirt-fedora-30/ws/> [libvirt-go-xml] $ /bin/sh -xe /tmp/jenkins17192332762959413202.sh + export 'TEST_ARGS=-tags xmlroundtrip' + TEST_ARGS='-tags xmlroundtrip' + go test -tags xmlroundtrip --- FAIL: TestRoundTrip (33.26s) xml_test.go:374: testdata/libvirt/tests/qemuxml2argvdata/net-virtio-teaming-network.xml: /domain[0]/devices[0]/interface[0]/teaming[0]: element in expected XML missing in actual XML FAIL exit status 1 FAIL _<https://ci.centos.org/job/libvirt-go-xml-check/systems=libvirt-fedora-30/ws/> 33.408s Build step 'Execute shell' marked build as failure

See <https://ci.centos.org/job/libvirt-go-xml-check/systems=libvirt-fedora-30/981/display/redirect> ------------------------------------------ Started by upstream project "libvirt-go-xml-check" build number 981 originally caused by: Started by upstream project "libvirt-go-xml-build" build number 984 originally caused by: Started by upstream project "libvirt-build" build number 1149 originally caused by: Started by an SCM change Running as SYSTEM [EnvInject] - Loading node environment variables. Building remotely on libvirt-fedora-30 (libvirt) in workspace <https://ci.centos.org/job/libvirt-go-xml-check/systems=libvirt-fedora-30/ws/> [libvirt-go-xml] $ /bin/sh -xe /tmp/jenkins9460455140392614858.sh + export 'TEST_ARGS=-tags xmlroundtrip' + TEST_ARGS='-tags xmlroundtrip' + go test -tags xmlroundtrip --- FAIL: TestRoundTrip (12.75s) xml_test.go:374: testdata/libvirt/tests/qemuxml2argvdata/net-virtio-teaming-network.xml: /domain[0]/devices[0]/interface[0]/teaming[0]: element in expected XML missing in actual XML FAIL exit status 1 FAIL _<https://ci.centos.org/job/libvirt-go-xml-check/systems=libvirt-fedora-30/ws/> 12.832s Build step 'Execute shell' marked build as failure

See <https://ci.centos.org/job/libvirt-go-xml-check/systems=libvirt-fedora-30/982/display/redirect> ------------------------------------------ Started by upstream project "libvirt-go-xml-check" build number 982 originally caused by: Started by upstream project "libvirt-go-xml-build" build number 985 originally caused by: Started by upstream project "libvirt-build" build number 1151 originally caused by: Started by an SCM change Running as SYSTEM [EnvInject] - Loading node environment variables. Building remotely on libvirt-fedora-30 (libvirt) in workspace <https://ci.centos.org/job/libvirt-go-xml-check/systems=libvirt-fedora-30/ws/> [libvirt-go-xml] $ /bin/sh -xe /tmp/jenkins4569352004102542947.sh + export 'TEST_ARGS=-tags xmlroundtrip' + TEST_ARGS='-tags xmlroundtrip' + go test -tags xmlroundtrip --- FAIL: TestRoundTrip (36.67s) xml_test.go:374: testdata/libvirt/tests/qemuxml2argvdata/net-virtio-teaming-network.xml: /domain[0]/devices[0]/interface[0]/teaming[0]: element in expected XML missing in actual XML FAIL exit status 1 FAIL _<https://ci.centos.org/job/libvirt-go-xml-check/systems=libvirt-fedora-30/ws/> 36.762s Build step 'Execute shell' marked build as failure

See <https://ci.centos.org/job/libvirt-go-xml-check/systems=libvirt-fedora-30/983/display/redirect> ------------------------------------------ Started by upstream project "libvirt-go-xml-check" build number 983 originally caused by: Started by upstream project "libvirt-go-xml-build" build number 986 originally caused by: Started by upstream project "libvirt-build" build number 1152 originally caused by: Started by an SCM change Running as SYSTEM [EnvInject] - Loading node environment variables. Building remotely on libvirt-fedora-30 (libvirt) in workspace <https://ci.centos.org/job/libvirt-go-xml-check/systems=libvirt-fedora-30/ws/> [libvirt-go-xml] $ /bin/sh -xe /tmp/jenkins6578048494816576805.sh + export 'TEST_ARGS=-tags xmlroundtrip' + TEST_ARGS='-tags xmlroundtrip' + go test -tags xmlroundtrip --- FAIL: TestRoundTrip (44.38s) xml_test.go:374: testdata/libvirt/tests/qemuxml2argvdata/net-virtio-teaming-network.xml: /domain[0]/devices[0]/interface[0]/teaming[0]: element in expected XML missing in actual XML FAIL exit status 1 FAIL _<https://ci.centos.org/job/libvirt-go-xml-check/systems=libvirt-fedora-30/ws/> 44.499s Build step 'Execute shell' marked build as failure

See <https://ci.centos.org/job/libvirt-go-xml-check/systems=libvirt-fedora-30/984/display/redirect> ------------------------------------------ Started by upstream project "libvirt-go-xml-check" build number 984 originally caused by: Started by upstream project "libvirt-go-xml-build" build number 987 originally caused by: Started by upstream project "libvirt-build" build number 1153 originally caused by: Started by an SCM change Running as SYSTEM [EnvInject] - Loading node environment variables. Building remotely on libvirt-fedora-30 (libvirt) in workspace <https://ci.centos.org/job/libvirt-go-xml-check/systems=libvirt-fedora-30/ws/> [libvirt-go-xml] $ /bin/sh -xe /tmp/jenkins12012157379673567093.sh + export 'TEST_ARGS=-tags xmlroundtrip' + TEST_ARGS='-tags xmlroundtrip' + go test -tags xmlroundtrip --- FAIL: TestRoundTrip (23.41s) xml_test.go:374: testdata/libvirt/tests/qemuxml2argvdata/net-virtio-teaming-network.xml: /domain[0]/devices[0]/interface[0]/teaming[0]: element in expected XML missing in actual XML FAIL exit status 1 FAIL _<https://ci.centos.org/job/libvirt-go-xml-check/systems=libvirt-fedora-30/ws/> 23.577s Build step 'Execute shell' marked build as failure

See <https://ci.centos.org/job/libvirt-go-xml-check/systems=libvirt-fedora-30/985/display/redirect> ------------------------------------------ Started by upstream project "libvirt-go-xml-check" build number 985 originally caused by: Started by upstream project "libvirt-go-xml-build" build number 988 originally caused by: Started by upstream project "libvirt-build" build number 1154 originally caused by: Started by an SCM change Running as SYSTEM [EnvInject] - Loading node environment variables. Building remotely on libvirt-fedora-30 (libvirt) in workspace <https://ci.centos.org/job/libvirt-go-xml-check/systems=libvirt-fedora-30/ws/> [libvirt-go-xml] $ /bin/sh -xe /tmp/jenkins10860107969867688388.sh + export 'TEST_ARGS=-tags xmlroundtrip' + TEST_ARGS='-tags xmlroundtrip' + go test -tags xmlroundtrip --- FAIL: TestRoundTrip (30.16s) xml_test.go:374: testdata/libvirt/tests/qemuxml2argvdata/net-virtio-teaming-network.xml: /domain[0]/devices[0]/interface[0]/teaming[0]: element in expected XML missing in actual XML FAIL exit status 1 FAIL _<https://ci.centos.org/job/libvirt-go-xml-check/systems=libvirt-fedora-30/ws/> 30.405s Build step 'Execute shell' marked build as failure

See <https://ci.centos.org/job/libvirt-go-xml-check/systems=libvirt-fedora-30/986/display/redirect> ------------------------------------------ Started by upstream project "libvirt-go-xml-check" build number 986 originally caused by: Started by upstream project "libvirt-go-xml-build" build number 989 originally caused by: Started by upstream project "libvirt-build" build number 1155 originally caused by: Started by an SCM change Running as SYSTEM [EnvInject] - Loading node environment variables. Building remotely on libvirt-fedora-30 (libvirt) in workspace <https://ci.centos.org/job/libvirt-go-xml-check/systems=libvirt-fedora-30/ws/> [libvirt-go-xml] $ /bin/sh -xe /tmp/jenkins6915576597928716695.sh + export 'TEST_ARGS=-tags xmlroundtrip' + TEST_ARGS='-tags xmlroundtrip' + go test -tags xmlroundtrip --- FAIL: TestRoundTrip (13.98s) xml_test.go:374: testdata/libvirt/tests/qemuxml2argvdata/net-virtio-teaming-network.xml: /domain[0]/devices[0]/interface[0]/teaming[0]: element in expected XML missing in actual XML FAIL exit status 1 FAIL _<https://ci.centos.org/job/libvirt-go-xml-check/systems=libvirt-fedora-30/ws/> 14.090s Build step 'Execute shell' marked build as failure

See <https://ci.centos.org/job/libvirt-go-xml-check/systems=libvirt-fedora-30/987/display/redirect> ------------------------------------------ Started by upstream project "libvirt-go-xml-check" build number 987 originally caused by: Started by upstream project "libvirt-go-xml-build" build number 990 originally caused by: Started by upstream project "libvirt-build" build number 1156 originally caused by: Started by an SCM change Started by an SCM change Started by an SCM change Started by an SCM change Running as SYSTEM [EnvInject] - Loading node environment variables. Building remotely on libvirt-fedora-30 (libvirt) in workspace <https://ci.centos.org/job/libvirt-go-xml-check/systems=libvirt-fedora-30/ws/> [libvirt-go-xml] $ /bin/sh -xe /tmp/jenkins7393972164331900739.sh + export 'TEST_ARGS=-tags xmlroundtrip' + TEST_ARGS='-tags xmlroundtrip' + go test -tags xmlroundtrip --- FAIL: TestRoundTrip (15.07s) xml_test.go:374: testdata/libvirt/tests/qemuxml2argvdata/net-virtio-teaming-network.xml: /domain[0]/devices[0]/interface[0]/teaming[0]: element in expected XML missing in actual XML FAIL exit status 1 FAIL _<https://ci.centos.org/job/libvirt-go-xml-check/systems=libvirt-fedora-30/ws/> 15.308s Build step 'Execute shell' marked build as failure

See <https://ci.centos.org/job/libvirt-go-xml-check/systems=libvirt-fedora-30/988/display/redirect> ------------------------------------------ Started by upstream project "libvirt-go-xml-check" build number 988 originally caused by: Started by upstream project "libvirt-go-xml-build" build number 991 originally caused by: Started by upstream project "libvirt-build" build number 1157 originally caused by: Started by an SCM change Running as SYSTEM [EnvInject] - Loading node environment variables. Building remotely on libvirt-fedora-30 (libvirt) in workspace <https://ci.centos.org/job/libvirt-go-xml-check/systems=libvirt-fedora-30/ws/> [libvirt-go-xml] $ /bin/sh -xe /tmp/jenkins8228964593102404082.sh + export 'TEST_ARGS=-tags xmlroundtrip' + TEST_ARGS='-tags xmlroundtrip' + go test -tags xmlroundtrip --- FAIL: TestRoundTrip (38.08s) xml_test.go:374: testdata/libvirt/tests/qemuxml2argvdata/net-virtio-teaming-network.xml: /domain[0]/devices[0]/interface[0]/teaming[0]: element in expected XML missing in actual XML FAIL exit status 1 FAIL _<https://ci.centos.org/job/libvirt-go-xml-check/systems=libvirt-fedora-30/ws/> 38.239s Build step 'Execute shell' marked build as failure

See <https://ci.centos.org/job/libvirt-go-xml-check/systems=libvirt-fedora-30/989/display/redirect> ------------------------------------------ Started by upstream project "libvirt-go-xml-check" build number 989 originally caused by: Started by upstream project "libvirt-go-xml-build" build number 992 originally caused by: Started by upstream project "libvirt-build" build number 1158 originally caused by: Started by an SCM change Running as SYSTEM [EnvInject] - Loading node environment variables. Building remotely on libvirt-fedora-30 (libvirt) in workspace <https://ci.centos.org/job/libvirt-go-xml-check/systems=libvirt-fedora-30/ws/> [libvirt-go-xml] $ /bin/sh -xe /tmp/jenkins14721416228497647533.sh + export 'TEST_ARGS=-tags xmlroundtrip' + TEST_ARGS='-tags xmlroundtrip' + go test -tags xmlroundtrip --- FAIL: TestRoundTrip (28.05s) xml_test.go:374: testdata/libvirt/tests/qemuxml2argvdata/net-virtio-teaming-network.xml: /domain[0]/devices[0]/interface[0]/teaming[0]: element in expected XML missing in actual XML FAIL exit status 1 FAIL _<https://ci.centos.org/job/libvirt-go-xml-check/systems=libvirt-fedora-30/ws/> 28.191s Build step 'Execute shell' marked build as failure

See <https://ci.centos.org/job/libvirt-go-xml-check/systems=libvirt-fedora-30/990/display/redirect> ------------------------------------------ Started by upstream project "libvirt-go-xml-check" build number 990 originally caused by: Started by upstream project "libvirt-go-xml-build" build number 993 originally caused by: Started by upstream project "libvirt-build" build number 1159 originally caused by: Started by an SCM change Started by an SCM change Started by an SCM change Started by an SCM change Started by an SCM change Started by an SCM change Started by an SCM change Running as SYSTEM [EnvInject] - Loading node environment variables. Building remotely on libvirt-fedora-30 (libvirt) in workspace <https://ci.centos.org/job/libvirt-go-xml-check/systems=libvirt-fedora-30/ws/> [libvirt-go-xml] $ /bin/sh -xe /tmp/jenkins7502427988109115273.sh + export 'TEST_ARGS=-tags xmlroundtrip' + TEST_ARGS='-tags xmlroundtrip' + go test -tags xmlroundtrip --- FAIL: TestRoundTrip (38.06s) xml_test.go:374: testdata/libvirt/tests/qemuxml2argvdata/net-virtio-teaming-network.xml: /domain[0]/devices[0]/interface[0]/teaming[0]: element in expected XML missing in actual XML FAIL exit status 1 FAIL _<https://ci.centos.org/job/libvirt-go-xml-check/systems=libvirt-fedora-30/ws/> 38.100s Build step 'Execute shell' marked build as failure

See <https://ci.centos.org/job/libvirt-go-xml-check/systems=libvirt-fedora-30/991/display/redirect> ------------------------------------------ Started by upstream project "libvirt-go-xml-check" build number 991 originally caused by: Started by upstream project "libvirt-go-xml-build" build number 994 originally caused by: Started by upstream project "libvirt-build" build number 1160 originally caused by: Started by an SCM change Running as SYSTEM [EnvInject] - Loading node environment variables. Building remotely on libvirt-fedora-30 (libvirt) in workspace <https://ci.centos.org/job/libvirt-go-xml-check/systems=libvirt-fedora-30/ws/> [libvirt-go-xml] $ /bin/sh -xe /tmp/jenkins16597711703467009369.sh + export 'TEST_ARGS=-tags xmlroundtrip' + TEST_ARGS='-tags xmlroundtrip' + go test -tags xmlroundtrip --- FAIL: TestRoundTrip (19.55s) xml_test.go:374: testdata/libvirt/tests/qemuxml2argvdata/net-virtio-teaming-network.xml: /domain[0]/devices[0]/interface[0]/teaming[0]: element in expected XML missing in actual XML FAIL exit status 1 FAIL _<https://ci.centos.org/job/libvirt-go-xml-check/systems=libvirt-fedora-30/ws/> 19.635s Build step 'Execute shell' marked build as failure

See <https://ci.centos.org/job/libvirt-go-xml-check/systems=libvirt-fedora-30/992/display/redirect> ------------------------------------------ Started by upstream project "libvirt-go-xml-check" build number 992 originally caused by: Started by upstream project "libvirt-go-xml-build" build number 995 originally caused by: Started by upstream project "libvirt-build" build number 1161 originally caused by: Started by an SCM change Started by an SCM change Started by an SCM change Running as SYSTEM [EnvInject] - Loading node environment variables. Building remotely on libvirt-fedora-30 (libvirt) in workspace <https://ci.centos.org/job/libvirt-go-xml-check/systems=libvirt-fedora-30/ws/> [libvirt-go-xml] $ /bin/sh -xe /tmp/jenkins7730640712201421947.sh + export 'TEST_ARGS=-tags xmlroundtrip' + TEST_ARGS='-tags xmlroundtrip' + go test -tags xmlroundtrip --- FAIL: TestRoundTrip (17.66s) xml_test.go:374: testdata/libvirt/tests/qemuxml2argvdata/net-virtio-teaming-network.xml: /domain[0]/devices[0]/interface[0]/teaming[0]: element in expected XML missing in actual XML FAIL exit status 1 FAIL _<https://ci.centos.org/job/libvirt-go-xml-check/systems=libvirt-fedora-30/ws/> 17.742s Build step 'Execute shell' marked build as failure

See <https://ci.centos.org/job/libvirt-go-xml-check/systems=libvirt-fedora-30/993/display/redirect> ------------------------------------------ Started by upstream project "libvirt-go-xml-check" build number 993 originally caused by: Started by upstream project "libvirt-go-xml-build" build number 996 originally caused by: Started by upstream project "libvirt-build" build number 1162 originally caused by: Started by an SCM change Running as SYSTEM [EnvInject] - Loading node environment variables. Building remotely on libvirt-fedora-30 (libvirt) in workspace <https://ci.centos.org/job/libvirt-go-xml-check/systems=libvirt-fedora-30/ws/> [libvirt-go-xml] $ /bin/sh -xe /tmp/jenkins14502441579748324204.sh + export 'TEST_ARGS=-tags xmlroundtrip' + TEST_ARGS='-tags xmlroundtrip' + go test -tags xmlroundtrip --- FAIL: TestRoundTrip (32.03s) xml_test.go:374: testdata/libvirt/tests/qemuxml2argvdata/net-virtio-teaming-network.xml: /domain[0]/devices[0]/interface[0]/teaming[0]: element in expected XML missing in actual XML FAIL exit status 1 FAIL _<https://ci.centos.org/job/libvirt-go-xml-check/systems=libvirt-fedora-30/ws/> 32.097s Build step 'Execute shell' marked build as failure

See <https://ci.centos.org/job/libvirt-go-xml-check/systems=libvirt-fedora-30/994/display/redirect> ------------------------------------------ Started by upstream project "libvirt-go-xml-check" build number 994 originally caused by: Started by upstream project "libvirt-go-xml-build" build number 997 originally caused by: Started by upstream project "libvirt-build" build number 1163 originally caused by: Started by an SCM change Running as SYSTEM [EnvInject] - Loading node environment variables. Building remotely on libvirt-fedora-30 (libvirt) in workspace <https://ci.centos.org/job/libvirt-go-xml-check/systems=libvirt-fedora-30/ws/> [libvirt-go-xml] $ /bin/sh -xe /tmp/jenkins654544054761488116.sh + export 'TEST_ARGS=-tags xmlroundtrip' + TEST_ARGS='-tags xmlroundtrip' + go test -tags xmlroundtrip --- FAIL: TestRoundTrip (22.91s) xml_test.go:374: testdata/libvirt/tests/qemuxml2argvdata/net-virtio-teaming-network.xml: /domain[0]/devices[0]/interface[0]/teaming[0]: element in expected XML missing in actual XML FAIL exit status 1 FAIL _<https://ci.centos.org/job/libvirt-go-xml-check/systems=libvirt-fedora-30/ws/> 22.999s Build step 'Execute shell' marked build as failure

See <https://ci.centos.org/job/libvirt-go-xml-check/systems=libvirt-fedora-30/995/display/redirect> ------------------------------------------ Started by upstream project "libvirt-go-xml-check" build number 995 originally caused by: Started by upstream project "libvirt-go-xml-build" build number 998 originally caused by: Started by upstream project "libvirt-build" build number 1164 originally caused by: Started by an SCM change Running as SYSTEM [EnvInject] - Loading node environment variables. Building remotely on libvirt-fedora-30 (libvirt) in workspace <https://ci.centos.org/job/libvirt-go-xml-check/systems=libvirt-fedora-30/ws/> [libvirt-go-xml] $ /bin/sh -xe /tmp/jenkins1576278175771067045.sh + export 'TEST_ARGS=-tags xmlroundtrip' + TEST_ARGS='-tags xmlroundtrip' + go test -tags xmlroundtrip --- FAIL: TestRoundTrip (39.03s) xml_test.go:374: testdata/libvirt/tests/qemuxml2argvdata/net-virtio-teaming-network.xml: /domain[0]/devices[0]/interface[0]/teaming[0]: element in expected XML missing in actual XML FAIL exit status 1 FAIL _<https://ci.centos.org/job/libvirt-go-xml-check/systems=libvirt-fedora-30/ws/> 39.166s Build step 'Execute shell' marked build as failure

See <https://ci.centos.org/job/libvirt-go-xml-check/systems=libvirt-fedora-30/996/display/redirect> ------------------------------------------ Started by upstream project "libvirt-go-xml-check" build number 996 originally caused by: Started by upstream project "libvirt-go-xml-build" build number 999 originally caused by: Started by upstream project "libvirt-build" build number 1165 originally caused by: Started by an SCM change Running as SYSTEM [EnvInject] - Loading node environment variables. Building remotely on libvirt-fedora-30 (libvirt) in workspace <https://ci.centos.org/job/libvirt-go-xml-check/systems=libvirt-fedora-30/ws/> [libvirt-go-xml] $ /bin/sh -xe /tmp/jenkins10596952417981342313.sh + export 'TEST_ARGS=-tags xmlroundtrip' + TEST_ARGS='-tags xmlroundtrip' + go test -tags xmlroundtrip --- FAIL: TestRoundTrip (28.86s) xml_test.go:374: testdata/libvirt/tests/qemuxml2argvdata/net-virtio-teaming-network.xml: /domain[0]/devices[0]/interface[0]/teaming[0]: element in expected XML missing in actual XML FAIL exit status 1 FAIL _<https://ci.centos.org/job/libvirt-go-xml-check/systems=libvirt-fedora-30/ws/> 29.018s Build step 'Execute shell' marked build as failure

See <https://ci.centos.org/job/libvirt-go-xml-check/systems=libvirt-fedora-30/997/display/redirect> ------------------------------------------ Started by upstream project "libvirt-go-xml-check" build number 997 originally caused by: Started by upstream project "libvirt-go-xml-build" build number 1000 originally caused by: Started by upstream project "libvirt-build" build number 1166 originally caused by: Started by an SCM change Running as SYSTEM [EnvInject] - Loading node environment variables. Building remotely on libvirt-fedora-30 (libvirt) in workspace <https://ci.centos.org/job/libvirt-go-xml-check/systems=libvirt-fedora-30/ws/> [libvirt-go-xml] $ /bin/sh -xe /tmp/jenkins5981741782863677560.sh + export 'TEST_ARGS=-tags xmlroundtrip' + TEST_ARGS='-tags xmlroundtrip' + go test -tags xmlroundtrip --- FAIL: TestRoundTrip (23.94s) xml_test.go:374: testdata/libvirt/tests/qemuxml2argvdata/net-virtio-teaming-network.xml: /domain[0]/devices[0]/interface[0]/teaming[0]: element in expected XML missing in actual XML FAIL exit status 1 FAIL _<https://ci.centos.org/job/libvirt-go-xml-check/systems=libvirt-fedora-30/ws/> 24.091s Build step 'Execute shell' marked build as failure

See <https://ci.centos.org/job/libvirt-go-xml-check/systems=libvirt-fedora-30/998/display/redirect> ------------------------------------------ Started by upstream project "libvirt-go-xml-check" build number 998 originally caused by: Started by upstream project "libvirt-go-xml-build" build number 1001 originally caused by: Started by upstream project "libvirt-build" build number 1167 originally caused by: Started by an SCM change Running as SYSTEM [EnvInject] - Loading node environment variables. Building remotely on libvirt-fedora-30 (libvirt) in workspace <https://ci.centos.org/job/libvirt-go-xml-check/systems=libvirt-fedora-30/ws/> [libvirt-go-xml] $ /bin/sh -xe /tmp/jenkins7548839594282579159.sh + export 'TEST_ARGS=-tags xmlroundtrip' + TEST_ARGS='-tags xmlroundtrip' + go test -tags xmlroundtrip --- FAIL: TestRoundTrip (17.71s) xml_test.go:374: testdata/libvirt/tests/qemuxml2argvdata/net-virtio-teaming-network.xml: /domain[0]/devices[0]/interface[0]/teaming[0]: element in expected XML missing in actual XML FAIL exit status 1 FAIL _<https://ci.centos.org/job/libvirt-go-xml-check/systems=libvirt-fedora-30/ws/> 17.860s Build step 'Execute shell' marked build as failure

See <https://ci.centos.org/job/libvirt-go-xml-check/systems=libvirt-fedora-30/999/display/redirect> ------------------------------------------ Started by upstream project "libvirt-go-xml-check" build number 999 originally caused by: Started by upstream project "libvirt-go-xml-build" build number 1002 originally caused by: Started by upstream project "libvirt-build" build number 1168 originally caused by: Started by an SCM change Running as SYSTEM [EnvInject] - Loading node environment variables. Building remotely on libvirt-fedora-30 (libvirt) in workspace <https://ci.centos.org/job/libvirt-go-xml-check/systems=libvirt-fedora-30/ws/> [libvirt-go-xml] $ /bin/sh -xe /tmp/jenkins11471566678946924710.sh + export 'TEST_ARGS=-tags xmlroundtrip' + TEST_ARGS='-tags xmlroundtrip' + go test -tags xmlroundtrip --- FAIL: TestRoundTrip (19.62s) xml_test.go:374: testdata/libvirt/tests/qemuxml2argvdata/net-virtio-teaming-network.xml: /domain[0]/devices[0]/interface[0]/teaming[0]: element in expected XML missing in actual XML FAIL exit status 1 FAIL _<https://ci.centos.org/job/libvirt-go-xml-check/systems=libvirt-fedora-30/ws/> 19.713s Build step 'Execute shell' marked build as failure

See <https://ci.centos.org/job/libvirt-go-xml-check/systems=libvirt-fedora-30/1000/display/redirect> ------------------------------------------ Started by upstream project "libvirt-go-xml-check" build number 1000 originally caused by: Started by upstream project "libvirt-go-xml-build" build number 1003 originally caused by: Started by upstream project "libvirt-build" build number 1169 originally caused by: Started by an SCM change Started by an SCM change Started by an SCM change Running as SYSTEM [EnvInject] - Loading node environment variables. Building remotely on libvirt-fedora-30 (libvirt) in workspace <https://ci.centos.org/job/libvirt-go-xml-check/systems=libvirt-fedora-30/ws/> [libvirt-go-xml] $ /bin/sh -xe /tmp/jenkins5328648641813439988.sh + export 'TEST_ARGS=-tags xmlroundtrip' + TEST_ARGS='-tags xmlroundtrip' + go test -tags xmlroundtrip --- FAIL: TestRoundTrip (16.39s) xml_test.go:374: testdata/libvirt/tests/qemuxml2argvdata/net-virtio-teaming-network.xml: /domain[0]/devices[0]/interface[0]/teaming[0]: element in expected XML missing in actual XML FAIL exit status 1 FAIL _<https://ci.centos.org/job/libvirt-go-xml-check/systems=libvirt-fedora-30/ws/> 16.538s Build step 'Execute shell' marked build as failure

See <https://ci.centos.org/job/libvirt-go-xml-check/systems=libvirt-fedora-30/1001/display/redirect> ------------------------------------------ Started by upstream project "libvirt-go-xml-check" build number 1001 originally caused by: Started by upstream project "libvirt-go-xml-build" build number 1004 originally caused by: Started by upstream project "libvirt-build" build number 1170 originally caused by: Started by an SCM change Running as SYSTEM [EnvInject] - Loading node environment variables. Building remotely on libvirt-fedora-30 (libvirt) in workspace <https://ci.centos.org/job/libvirt-go-xml-check/systems=libvirt-fedora-30/ws/> [libvirt-go-xml] $ /bin/sh -xe /tmp/jenkins16332763707834713147.sh + export 'TEST_ARGS=-tags xmlroundtrip' + TEST_ARGS='-tags xmlroundtrip' + go test -tags xmlroundtrip --- FAIL: TestRoundTrip (44.05s) xml_test.go:374: testdata/libvirt/tests/qemuxml2argvdata/net-virtio-teaming-network.xml: /domain[0]/devices[0]/interface[0]/teaming[0]: element in expected XML missing in actual XML FAIL exit status 1 FAIL _<https://ci.centos.org/job/libvirt-go-xml-check/systems=libvirt-fedora-30/ws/> 44.183s Build step 'Execute shell' marked build as failure

participants (1)
-
ci@centos.org