[Libvirt-ci] Build failed in Jenkins: libvirt-go-xml-master-check » libvirt-debian-8 #405

See <https://ci.centos.org/job/libvirt-go-xml-master-check/systems=libvirt-debian-8/405/display/redirect> ------------------------------------------ Started by upstream project "libvirt-go-xml-master-check" build number 405 originally caused by: Started by upstream project "libvirt-go-xml-master-build" build number 413 originally caused by: Started by upstream project "libvirt-master-build" build number 1463 originally caused by: Started by an SCM change [EnvInject] - Loading node environment variables. Building remotely on libvirt-debian-8 (libvirt) in workspace <https://ci.centos.org/job/libvirt-go-xml-master-check/systems=libvirt-debian-8/ws/> [libvirt-go-xml-master] $ /bin/sh -xe /tmp/jenkins3602450376468122363.sh + export TEST_ARGS=-tags xmlroundtrip + go test -tags xmlroundtrip --- FAIL: TestRoundTrip (11.09 seconds) xml_test.go:383: testdata/libvirt/tests/domaincapsschemadata/basic.xml: /domainCapabilities[0]/features[0]/genid[0]: element in expected XML missing in actual XML FAIL exit status 1 FAIL _<https://ci.centos.org/job/libvirt-go-xml-master-check/systems=libvirt-debian-8/ws/> 11.807s Build step 'Execute shell' marked build as failure

See <https://ci.centos.org/job/libvirt-go-xml-master-check/systems=libvirt-debian-8/406/display/redirect> ------------------------------------------ Started by upstream project "libvirt-go-xml-master-check" build number 406 originally caused by: Started by upstream project "libvirt-go-xml-master-build" build number 414 originally caused by: Started by upstream project "libvirt-master-build" build number 1464 originally caused by: Started by an SCM change [EnvInject] - Loading node environment variables. Building remotely on libvirt-debian-8 (libvirt) in workspace <https://ci.centos.org/job/libvirt-go-xml-master-check/systems=libvirt-debian-8/ws/> [libvirt-go-xml-master] $ /bin/sh -xe /tmp/jenkins2754952168583172778.sh + export TEST_ARGS=-tags xmlroundtrip + go test -tags xmlroundtrip --- FAIL: TestRoundTrip (2.39 seconds) xml_test.go:383: testdata/libvirt/tests/capabilityschemadata/caps-test2.xml: /capabilities[0]/host[0]/cpu[0]/microcode[0]: element in expected XML missing in actual XML FAIL exit status 1 FAIL _<https://ci.centos.org/job/libvirt-go-xml-master-check/systems=libvirt-debian-8/ws/> 2.490s Build step 'Execute shell' marked build as failure

See <https://ci.centos.org/job/libvirt-go-xml-master-check/systems=libvirt-debian-8/407/display/redirect> ------------------------------------------ Started by upstream project "libvirt-go-xml-master-check" build number 407 originally caused by: Started by upstream project "libvirt-go-xml-master-build" build number 415 originally caused by: Started by upstream project "libvirt-master-build" build number 1465 originally caused by: Started by an SCM change [EnvInject] - Loading node environment variables. Building remotely on libvirt-debian-8 (libvirt) in workspace <https://ci.centos.org/job/libvirt-go-xml-master-check/systems=libvirt-debian-8/ws/> [libvirt-go-xml-master] $ /bin/sh -xe /tmp/jenkins5065296378852575034.sh + export TEST_ARGS=-tags xmlroundtrip + go test -tags xmlroundtrip --- FAIL: TestRoundTrip (7.71 seconds) xml_test.go:383: testdata/libvirt/tests/capabilityschemadata/caps-test2.xml: /capabilities[0]/host[0]/cpu[0]/microcode[0]: element in expected XML missing in actual XML FAIL exit status 1 FAIL _<https://ci.centos.org/job/libvirt-go-xml-master-check/systems=libvirt-debian-8/ws/> 7.888s Build step 'Execute shell' marked build as failure

See <https://ci.centos.org/job/libvirt-go-xml-master-check/systems=libvirt-debian-8/408/display/redirect> ------------------------------------------ Started by upstream project "libvirt-go-xml-master-check" build number 408 originally caused by: Started by upstream project "libvirt-go-xml-master-build" build number 416 originally caused by: Started by upstream project "libvirt-master-build" build number 1466 originally caused by: Started by an SCM change [EnvInject] - Loading node environment variables. Building remotely on libvirt-debian-8 (libvirt) in workspace <https://ci.centos.org/job/libvirt-go-xml-master-check/systems=libvirt-debian-8/ws/> [libvirt-go-xml-master] $ /bin/sh -xe /tmp/jenkins8106412275010087730.sh + export TEST_ARGS=-tags xmlroundtrip + go test -tags xmlroundtrip --- FAIL: TestRoundTrip (8.97 seconds) xml_test.go:383: testdata/libvirt/tests/capabilityschemadata/caps-test2.xml: /capabilities[0]/host[0]/cpu[0]/microcode[0]: element in expected XML missing in actual XML FAIL exit status 1 FAIL _<https://ci.centos.org/job/libvirt-go-xml-master-check/systems=libvirt-debian-8/ws/> 9.180s Build step 'Execute shell' marked build as failure

See <https://ci.centos.org/job/libvirt-go-xml-master-check/systems=libvirt-debian-8/409/display/redirect> ------------------------------------------ Started by upstream project "libvirt-go-xml-master-check" build number 409 originally caused by: Started by upstream project "libvirt-go-xml-master-build" build number 417 originally caused by: Started by upstream project "libvirt-master-build" build number 1467 originally caused by: Started by an SCM change Started by an SCM change [EnvInject] - Loading node environment variables. Building remotely on libvirt-debian-8 (libvirt) in workspace <https://ci.centos.org/job/libvirt-go-xml-master-check/systems=libvirt-debian-8/ws/> [libvirt-go-xml-master] $ /bin/sh -xe /tmp/jenkins4094262480715813535.sh + export TEST_ARGS=-tags xmlroundtrip + go test -tags xmlroundtrip --- FAIL: TestRoundTrip (5.10 seconds) xml_test.go:383: testdata/libvirt/tests/capabilityschemadata/caps-test2.xml: /capabilities[0]/host[0]/cpu[0]/microcode[0]: element in expected XML missing in actual XML FAIL exit status 1 FAIL _<https://ci.centos.org/job/libvirt-go-xml-master-check/systems=libvirt-debian-8/ws/> 5.410s Build step 'Execute shell' marked build as failure

See <https://ci.centos.org/job/libvirt-go-xml-master-check/systems=libvirt-debian-8/410/display/redirect> ------------------------------------------ Started by upstream project "libvirt-go-xml-master-check" build number 410 originally caused by: Started by upstream project "libvirt-go-xml-master-build" build number 418 originally caused by: Started by upstream project "libvirt-master-build" build number 1468 originally caused by: Started by an SCM change [EnvInject] - Loading node environment variables. Building remotely on libvirt-debian-8 (libvirt) in workspace <https://ci.centos.org/job/libvirt-go-xml-master-check/systems=libvirt-debian-8/ws/> [libvirt-go-xml-master] $ /bin/sh -xe /tmp/jenkins7409441897476019009.sh + export TEST_ARGS=-tags xmlroundtrip + go test -tags xmlroundtrip --- FAIL: TestRoundTrip (8.23 seconds) xml_test.go:383: testdata/libvirt/tests/capabilityschemadata/caps-test2.xml: /capabilities[0]/host[0]/cpu[0]/microcode[0]: element in expected XML missing in actual XML FAIL exit status 1 FAIL _<https://ci.centos.org/job/libvirt-go-xml-master-check/systems=libvirt-debian-8/ws/> 8.486s Build step 'Execute shell' marked build as failure

See <https://ci.centos.org/job/libvirt-go-xml-master-check/systems=libvirt-debian-8/411/display/redirect> ------------------------------------------ Started by upstream project "libvirt-go-xml-master-check" build number 411 originally caused by: Started by upstream project "libvirt-go-xml-master-build" build number 419 originally caused by: Started by upstream project "libvirt-master-build" build number 1469 originally caused by: Started by an SCM change [EnvInject] - Loading node environment variables. Building remotely on libvirt-debian-8 (libvirt) in workspace <https://ci.centos.org/job/libvirt-go-xml-master-check/systems=libvirt-debian-8/ws/> [libvirt-go-xml-master] $ /bin/sh -xe /tmp/jenkins4146206109340859392.sh + export TEST_ARGS=-tags xmlroundtrip + go test -tags xmlroundtrip --- FAIL: TestRoundTrip (5.88 seconds) xml_test.go:383: testdata/libvirt/tests/capabilityschemadata/caps-test2.xml: /capabilities[0]/host[0]/cpu[0]/microcode[0]: element in expected XML missing in actual XML FAIL exit status 1 FAIL _<https://ci.centos.org/job/libvirt-go-xml-master-check/systems=libvirt-debian-8/ws/> 6.075s Build step 'Execute shell' marked build as failure

See <https://ci.centos.org/job/libvirt-go-xml-master-check/systems=libvirt-debian-8/412/display/redirect> ------------------------------------------ Started by upstream project "libvirt-go-xml-master-check" build number 412 originally caused by: Started by upstream project "libvirt-go-xml-master-build" build number 420 originally caused by: Started by upstream project "libvirt-master-build" build number 1470 originally caused by: Started by an SCM change [EnvInject] - Loading node environment variables. Building remotely on libvirt-debian-8 (libvirt) in workspace <https://ci.centos.org/job/libvirt-go-xml-master-check/systems=libvirt-debian-8/ws/> [libvirt-go-xml-master] $ /bin/sh -xe /tmp/jenkins1039373151147614180.sh + export TEST_ARGS=-tags xmlroundtrip + go test -tags xmlroundtrip --- FAIL: TestRoundTrip (8.20 seconds) xml_test.go:383: testdata/libvirt/tests/capabilityschemadata/caps-test2.xml: /capabilities[0]/host[0]/cpu[0]/microcode[0]: element in expected XML missing in actual XML FAIL exit status 1 FAIL _<https://ci.centos.org/job/libvirt-go-xml-master-check/systems=libvirt-debian-8/ws/> 8.461s Build step 'Execute shell' marked build as failure

See <https://ci.centos.org/job/libvirt-go-xml-master-check/systems=libvirt-debian-8/413/display/redirect> ------------------------------------------ Started by upstream project "libvirt-go-xml-master-check" build number 413 originally caused by: Started by upstream project "libvirt-go-xml-master-build" build number 421 originally caused by: Started by upstream project "libvirt-master-build" build number 1471 originally caused by: Started by an SCM change Started by an SCM change [EnvInject] - Loading node environment variables. Building remotely on libvirt-debian-8 (libvirt) in workspace <https://ci.centos.org/job/libvirt-go-xml-master-check/systems=libvirt-debian-8/ws/> [libvirt-go-xml-master] $ /bin/sh -xe /tmp/jenkins8855567873717829854.sh + export TEST_ARGS=-tags xmlroundtrip + go test -tags xmlroundtrip --- FAIL: TestRoundTrip (3.29 seconds) xml_test.go:383: testdata/libvirt/tests/capabilityschemadata/caps-test2.xml: /capabilities[0]/host[0]/cpu[0]/microcode[0]: element in expected XML missing in actual XML FAIL exit status 1 FAIL _<https://ci.centos.org/job/libvirt-go-xml-master-check/systems=libvirt-debian-8/ws/> 3.596s Build step 'Execute shell' marked build as failure

See <https://ci.centos.org/job/libvirt-go-xml-master-check/systems=libvirt-debian-8/414/display/redirect> ------------------------------------------ Started by upstream project "libvirt-go-xml-master-check" build number 414 originally caused by: Started by upstream project "libvirt-go-xml-master-build" build number 422 originally caused by: Started by upstream project "libvirt-master-build" build number 1472 originally caused by: Started by an SCM change [EnvInject] - Loading node environment variables. Building remotely on libvirt-debian-8 (libvirt) in workspace <https://ci.centos.org/job/libvirt-go-xml-master-check/systems=libvirt-debian-8/ws/> [libvirt-go-xml-master] $ /bin/sh -xe /tmp/jenkins7693470218001430094.sh + export TEST_ARGS=-tags xmlroundtrip + go test -tags xmlroundtrip --- FAIL: TestRoundTrip (9.36 seconds) xml_test.go:383: testdata/libvirt/tests/capabilityschemadata/caps-test2.xml: /capabilities[0]/host[0]/cpu[0]/microcode[0]: element in expected XML missing in actual XML FAIL exit status 1 FAIL _<https://ci.centos.org/job/libvirt-go-xml-master-check/systems=libvirt-debian-8/ws/> 9.662s Build step 'Execute shell' marked build as failure

See <https://ci.centos.org/job/libvirt-go-xml-master-check/systems=libvirt-debian-8/415/display/redirect> ------------------------------------------ Started by upstream project "libvirt-go-xml-master-check" build number 415 originally caused by: Started by upstream project "libvirt-go-xml-master-build" build number 423 originally caused by: Started by upstream project "libvirt-master-build" build number 1473 originally caused by: Started by an SCM change [EnvInject] - Loading node environment variables. Building remotely on libvirt-debian-8 (libvirt) in workspace <https://ci.centos.org/job/libvirt-go-xml-master-check/systems=libvirt-debian-8/ws/> [libvirt-go-xml-master] $ /bin/sh -xe /tmp/jenkins3250320488932685784.sh + export TEST_ARGS=-tags xmlroundtrip + go test -tags xmlroundtrip --- FAIL: TestRoundTrip (5.89 seconds) xml_test.go:383: testdata/libvirt/tests/capabilityschemadata/caps-test2.xml: /capabilities[0]/host[0]/cpu[0]/microcode[0]: element in expected XML missing in actual XML FAIL exit status 1 FAIL _<https://ci.centos.org/job/libvirt-go-xml-master-check/systems=libvirt-debian-8/ws/> 6.095s Build step 'Execute shell' marked build as failure

See <https://ci.centos.org/job/libvirt-go-xml-master-check/systems=libvirt-debian-8/416/display/redirect> ------------------------------------------ Started by upstream project "libvirt-go-xml-master-check" build number 416 originally caused by: Started by upstream project "libvirt-go-xml-master-build" build number 424 originally caused by: Started by upstream project "libvirt-master-build" build number 1474 originally caused by: Started by an SCM change Started by an SCM change Started by an SCM change [EnvInject] - Loading node environment variables. Building remotely on libvirt-debian-8 (libvirt) in workspace <https://ci.centos.org/job/libvirt-go-xml-master-check/systems=libvirt-debian-8/ws/> [libvirt-go-xml-master] $ /bin/sh -xe /tmp/jenkins7745797045747167966.sh + export TEST_ARGS=-tags xmlroundtrip + go test -tags xmlroundtrip --- FAIL: TestRoundTrip (3.65 seconds) xml_test.go:383: testdata/libvirt/tests/capabilityschemadata/caps-test2.xml: /capabilities[0]/host[0]/cpu[0]/microcode[0]: element in expected XML missing in actual XML FAIL exit status 1 FAIL _<https://ci.centos.org/job/libvirt-go-xml-master-check/systems=libvirt-debian-8/ws/> 4.108s Build step 'Execute shell' marked build as failure

See <https://ci.centos.org/job/libvirt-go-xml-master-check/systems=libvirt-debian-8/417/display/redirect> ------------------------------------------ Started by upstream project "libvirt-go-xml-master-check" build number 417 originally caused by: Started by upstream project "libvirt-go-xml-master-build" build number 425 originally caused by: Started by upstream project "libvirt-master-build" build number 1475 originally caused by: Started by an SCM change [EnvInject] - Loading node environment variables. Building remotely on libvirt-debian-8 (libvirt) in workspace <https://ci.centos.org/job/libvirt-go-xml-master-check/systems=libvirt-debian-8/ws/> [libvirt-go-xml-master] $ /bin/sh -xe /tmp/jenkins6389489192106655197.sh + export TEST_ARGS=-tags xmlroundtrip + go test -tags xmlroundtrip --- FAIL: TestRoundTrip (6.66 seconds) xml_test.go:383: testdata/libvirt/tests/capabilityschemadata/caps-test2.xml: /capabilities[0]/host[0]/cpu[0]/microcode[0]: element in expected XML missing in actual XML FAIL exit status 1 FAIL _<https://ci.centos.org/job/libvirt-go-xml-master-check/systems=libvirt-debian-8/ws/> 6.910s Build step 'Execute shell' marked build as failure

See <https://ci.centos.org/job/libvirt-go-xml-master-check/systems=libvirt-debian-8/418/display/redirect> ------------------------------------------ Started by upstream project "libvirt-go-xml-master-check" build number 418 originally caused by: Started by upstream project "libvirt-go-xml-master-build" build number 426 originally caused by: Started by upstream project "libvirt-master-build" build number 1476 originally caused by: Started by an SCM change [EnvInject] - Loading node environment variables. Building remotely on libvirt-debian-8 (libvirt) in workspace <https://ci.centos.org/job/libvirt-go-xml-master-check/systems=libvirt-debian-8/ws/> [libvirt-go-xml-master] $ /bin/sh -xe /tmp/jenkins4270759416090992431.sh + export TEST_ARGS=-tags xmlroundtrip + go test -tags xmlroundtrip --- FAIL: TestRoundTrip (6.83 seconds) xml_test.go:383: testdata/libvirt/tests/capabilityschemadata/caps-test2.xml: /capabilities[0]/host[0]/cpu[0]/microcode[0]: element in expected XML missing in actual XML FAIL exit status 1 FAIL _<https://ci.centos.org/job/libvirt-go-xml-master-check/systems=libvirt-debian-8/ws/> 7.141s Build step 'Execute shell' marked build as failure

See <https://ci.centos.org/job/libvirt-go-xml-master-check/systems=libvirt-debian-8/419/display/redirect> ------------------------------------------ Started by upstream project "libvirt-go-xml-master-check" build number 419 originally caused by: Started by upstream project "libvirt-go-xml-master-build" build number 427 originally caused by: Started by upstream project "libvirt-master-build" build number 1477 originally caused by: Started by an SCM change Started by an SCM change Started by an SCM change [EnvInject] - Loading node environment variables. Building remotely on libvirt-debian-8 (libvirt) in workspace <https://ci.centos.org/job/libvirt-go-xml-master-check/systems=libvirt-debian-8/ws/> [libvirt-go-xml-master] $ /bin/sh -xe /tmp/jenkins8542537961290195496.sh + export TEST_ARGS=-tags xmlroundtrip + go test -tags xmlroundtrip --- FAIL: TestRoundTrip (6.02 seconds) xml_test.go:383: testdata/libvirt/tests/capabilityschemadata/caps-test2.xml: /capabilities[0]/host[0]/cpu[0]/microcode[0]: element in expected XML missing in actual XML FAIL exit status 1 FAIL _<https://ci.centos.org/job/libvirt-go-xml-master-check/systems=libvirt-debian-8/ws/> 6.269s Build step 'Execute shell' marked build as failure

See <https://ci.centos.org/job/libvirt-go-xml-master-check/systems=libvirt-debian-8/420/display/redirect> ------------------------------------------ Started by upstream project "libvirt-go-xml-master-check" build number 420 originally caused by: Started by upstream project "libvirt-go-xml-master-build" build number 428 originally caused by: Started by upstream project "libvirt-master-build" build number 1478 originally caused by: Started by an SCM change [EnvInject] - Loading node environment variables. Building remotely on libvirt-debian-8 (libvirt) in workspace <https://ci.centos.org/job/libvirt-go-xml-master-check/systems=libvirt-debian-8/ws/> [libvirt-go-xml-master] $ /bin/sh -xe /tmp/jenkins9080216955294114744.sh + export TEST_ARGS=-tags xmlroundtrip + go test -tags xmlroundtrip --- FAIL: TestRoundTrip (5.49 seconds) xml_test.go:383: testdata/libvirt/tests/capabilityschemadata/caps-test2.xml: /capabilities[0]/host[0]/cpu[0]/microcode[0]: element in expected XML missing in actual XML FAIL exit status 1 FAIL _<https://ci.centos.org/job/libvirt-go-xml-master-check/systems=libvirt-debian-8/ws/> 5.756s Build step 'Execute shell' marked build as failure

See <https://ci.centos.org/job/libvirt-go-xml-master-check/systems=libvirt-debian-8/421/display/redirect> ------------------------------------------ Started by upstream project "libvirt-go-xml-master-check" build number 421 originally caused by: Started by upstream project "libvirt-go-xml-master-build" build number 429 originally caused by: Started by upstream project "libvirt-master-build" build number 1479 originally caused by: Started by an SCM change [EnvInject] - Loading node environment variables. Building remotely on libvirt-debian-8 (libvirt) in workspace <https://ci.centos.org/job/libvirt-go-xml-master-check/systems=libvirt-debian-8/ws/> [libvirt-go-xml-master] $ /bin/sh -xe /tmp/jenkins3764222895622009548.sh + export TEST_ARGS=-tags xmlroundtrip + go test -tags xmlroundtrip --- FAIL: TestRoundTrip (4.80 seconds) xml_test.go:383: testdata/libvirt/tests/capabilityschemadata/caps-test2.xml: /capabilities[0]/host[0]/cpu[0]/microcode[0]: element in expected XML missing in actual XML FAIL exit status 1 FAIL _<https://ci.centos.org/job/libvirt-go-xml-master-check/systems=libvirt-debian-8/ws/> 5.112s Build step 'Execute shell' marked build as failure

See <https://ci.centos.org/job/libvirt-go-xml-master-check/systems=libvirt-debian-8/422/display/redirect> ------------------------------------------ Started by upstream project "libvirt-go-xml-master-check" build number 422 originally caused by: Started by upstream project "libvirt-go-xml-master-build" build number 430 originally caused by: Started by upstream project "libvirt-master-build" build number 1480 originally caused by: Started by an SCM change [EnvInject] - Loading node environment variables. Building remotely on libvirt-debian-8 (libvirt) in workspace <https://ci.centos.org/job/libvirt-go-xml-master-check/systems=libvirt-debian-8/ws/> [libvirt-go-xml-master] $ /bin/sh -xe /tmp/jenkins7932198867921343990.sh + export TEST_ARGS=-tags xmlroundtrip + go test -tags xmlroundtrip --- FAIL: TestRoundTrip (7.97 seconds) xml_test.go:383: testdata/libvirt/tests/capabilityschemadata/caps-test2.xml: /capabilities[0]/host[0]/cpu[0]/microcode[0]: element in expected XML missing in actual XML FAIL exit status 1 FAIL _<https://ci.centos.org/job/libvirt-go-xml-master-check/systems=libvirt-debian-8/ws/> 8.287s Build step 'Execute shell' marked build as failure

See <https://ci.centos.org/job/libvirt-go-xml-master-check/systems=libvirt-debian-8/423/display/redirect> ------------------------------------------ Started by upstream project "libvirt-go-xml-master-check" build number 423 originally caused by: Started by upstream project "libvirt-go-xml-master-build" build number 431 originally caused by: Started by upstream project "libvirt-master-build" build number 1481 originally caused by: Started by an SCM change Started by an SCM change [EnvInject] - Loading node environment variables. Building remotely on libvirt-debian-8 (libvirt) in workspace <https://ci.centos.org/job/libvirt-go-xml-master-check/systems=libvirt-debian-8/ws/> [libvirt-go-xml-master] $ /bin/sh -xe /tmp/jenkins2828977911178622434.sh + export TEST_ARGS=-tags xmlroundtrip + go test -tags xmlroundtrip --- FAIL: TestRoundTrip (1.87 seconds) xml_test.go:383: testdata/libvirt/tests/capabilityschemadata/caps-test2.xml: /capabilities[0]/host[0]/cpu[0]/microcode[0]: element in expected XML missing in actual XML FAIL exit status 1 FAIL _<https://ci.centos.org/job/libvirt-go-xml-master-check/systems=libvirt-debian-8/ws/> 1.992s Build step 'Execute shell' marked build as failure

participants (1)
-
ci@centos.org