Build failed in Jenkins: libvirt-go-xml-check » libvirt-centos-7 #959

See <https://ci.centos.org/job/libvirt-go-xml-check/systems=libvirt-centos-7/959/display/redirect> ------------------------------------------ Started by upstream project "libvirt-go-xml-check" build number 959 originally caused by: Started by upstream project "libvirt-go-xml-build" build number 962 originally caused by: Started by upstream project "libvirt-build" build number 1127 originally caused by: Started by an SCM change Started by an SCM change Running as SYSTEM [EnvInject] - Loading node environment variables. Building remotely on libvirt-centos-7 (libvirt) in workspace <https://ci.centos.org/job/libvirt-go-xml-check/systems=libvirt-centos-7/ws/> [libvirt-go-xml] $ /bin/sh -xe /tmp/jenkins16483074235436069053.sh + export 'TEST_ARGS=-tags xmlroundtrip' + TEST_ARGS='-tags xmlroundtrip' + go test -tags xmlroundtrip --- FAIL: TestRoundTrip (62.72s) xml_test.go:374: testdata/libvirt/tests/qemuxml2argvdata/virtio-rng-builtin.xml: /domain[0]/devices[0]/rng[0]/backend[0]: element in expected XML missing in actual XML FAIL exit status 1 FAIL _<https://ci.centos.org/job/libvirt-go-xml-check/systems=libvirt-centos-7/ws/> 62.776s Build step 'Execute shell' marked build as failure

See <https://ci.centos.org/job/libvirt-go-xml-check/systems=libvirt-centos-7/960/display/redirect> ------------------------------------------ Started by upstream project "libvirt-go-xml-check" build number 960 originally caused by: Started by upstream project "libvirt-go-xml-build" build number 963 originally caused by: Started by upstream project "libvirt-build" build number 1128 originally caused by: Started by an SCM change Running as SYSTEM [EnvInject] - Loading node environment variables. Building remotely on libvirt-centos-7 (libvirt) in workspace <https://ci.centos.org/job/libvirt-go-xml-check/systems=libvirt-centos-7/ws/> [libvirt-go-xml] $ /bin/sh -xe /tmp/jenkins14331730919105106697.sh + export 'TEST_ARGS=-tags xmlroundtrip' + TEST_ARGS='-tags xmlroundtrip' + go test -tags xmlroundtrip --- FAIL: TestRoundTrip (23.46s) xml_test.go:374: testdata/libvirt/tests/qemuxml2argvdata/virtio-rng-builtin.xml: /domain[0]/devices[0]/rng[0]/backend[0]: element in expected XML missing in actual XML FAIL exit status 1 FAIL _<https://ci.centos.org/job/libvirt-go-xml-check/systems=libvirt-centos-7/ws/> 23.553s Build step 'Execute shell' marked build as failure

See <https://ci.centos.org/job/libvirt-go-xml-check/systems=libvirt-centos-7/961/display/redirect> ------------------------------------------ Started by upstream project "libvirt-go-xml-check" build number 961 originally caused by: Started by upstream project "libvirt-go-xml-build" build number 964 originally caused by: Started by upstream project "libvirt-build" build number 1131 originally caused by: Started by an SCM change Running as SYSTEM [EnvInject] - Loading node environment variables. Building remotely on libvirt-centos-7 (libvirt) in workspace <https://ci.centos.org/job/libvirt-go-xml-check/systems=libvirt-centos-7/ws/> [libvirt-go-xml] $ /bin/sh -xe /tmp/jenkins13085111963687841466.sh + export 'TEST_ARGS=-tags xmlroundtrip' + TEST_ARGS='-tags xmlroundtrip' + go test -tags xmlroundtrip --- FAIL: TestRoundTrip (62.40s) xml_test.go:374: testdata/libvirt/tests/qemuxml2argvdata/virtio-rng-builtin.xml: /domain[0]/devices[0]/rng[0]/backend[0]: element in expected XML missing in actual XML FAIL exit status 1 FAIL _<https://ci.centos.org/job/libvirt-go-xml-check/systems=libvirt-centos-7/ws/> 62.593s Build step 'Execute shell' marked build as failure

See <https://ci.centos.org/job/libvirt-go-xml-check/systems=libvirt-centos-7/962/display/redirect> ------------------------------------------ Started by upstream project "libvirt-go-xml-check" build number 962 originally caused by: Started by upstream project "libvirt-go-xml-build" build number 965 originally caused by: Started by upstream project "libvirt-build" build number 1132 originally caused by: Started by an SCM change Started by an SCM change Started by an SCM change Started by an SCM change Running as SYSTEM [EnvInject] - Loading node environment variables. Building remotely on libvirt-centos-7 (libvirt) in workspace <https://ci.centos.org/job/libvirt-go-xml-check/systems=libvirt-centos-7/ws/> [libvirt-go-xml] $ /bin/sh -xe /tmp/jenkins2928918581935905229.sh + export 'TEST_ARGS=-tags xmlroundtrip' + TEST_ARGS='-tags xmlroundtrip' + go test -tags xmlroundtrip --- FAIL: TestRoundTrip (43.50s) xml_test.go:374: testdata/libvirt/tests/qemuxml2argvdata/virtio-rng-builtin.xml: /domain[0]/devices[0]/rng[0]/backend[0]: element in expected XML missing in actual XML FAIL exit status 1 FAIL _<https://ci.centos.org/job/libvirt-go-xml-check/systems=libvirt-centos-7/ws/> 43.539s Build step 'Execute shell' marked build as failure

See <https://ci.centos.org/job/libvirt-go-xml-check/systems=libvirt-centos-7/963/display/redirect> ------------------------------------------ Started by upstream project "libvirt-go-xml-check" build number 963 originally caused by: Started by upstream project "libvirt-go-xml-build" build number 966 originally caused by: Started by upstream project "libvirt-build" build number 1133 originally caused by: Started by an SCM change Running as SYSTEM [EnvInject] - Loading node environment variables. Building remotely on libvirt-centos-7 (libvirt) in workspace <https://ci.centos.org/job/libvirt-go-xml-check/systems=libvirt-centos-7/ws/> [libvirt-go-xml] $ /bin/sh -xe /tmp/jenkins4821290830071820959.sh + export 'TEST_ARGS=-tags xmlroundtrip' + TEST_ARGS='-tags xmlroundtrip' + go test -tags xmlroundtrip --- FAIL: TestRoundTrip (41.92s) xml_test.go:374: testdata/libvirt/tests/qemuxml2argvdata/virtio-rng-builtin.xml: /domain[0]/devices[0]/rng[0]/backend[0]: element in expected XML missing in actual XML FAIL exit status 1 FAIL _<https://ci.centos.org/job/libvirt-go-xml-check/systems=libvirt-centos-7/ws/> 42.029s Build step 'Execute shell' marked build as failure

participants (1)
-
ci@centos.org