[Libvirt-ci] Build failed in Jenkins: libvirt-go-xml-check » libvirt-debian-9 #304

See <https://ci.centos.org/job/libvirt-go-xml-check/systems=libvirt-debian-9/304/display/redirect> ------------------------------------------ Started by upstream project "libvirt-go-xml-check" build number 304 originally caused by: Started by upstream project "libvirt-go-xml-build" build number 304 originally caused by: Started by upstream project "libvirt-build" build number 370 originally caused by: Started by an SCM change Started by an SCM change Started by an SCM change Started by an SCM change [EnvInject] - Loading node environment variables. Building remotely on libvirt-debian-9 (libvirt) in workspace <https://ci.centos.org/job/libvirt-go-xml-check/systems=libvirt-debian-9/ws/> [libvirt-go-xml] $ /bin/sh -xe /tmp/jenkins5899591582501068300.sh + export TEST_ARGS=-tags xmlroundtrip + go test -tags xmlroundtrip --- FAIL: TestRoundTrip (8.16s) xml_test.go:400: testdata/libvirt/tests/qemuxml2argvdata/aarch64-virt-graphics.xml: /domain[0]/devices[0]/channel[0]/source[0]: element in expected XML missing in actual XML FAIL exit status 1 FAIL _<https://ci.centos.org/job/libvirt-go-xml-check/systems=libvirt-debian-9/ws/> 8.192s Build step 'Execute shell' marked build as failure

See <https://ci.centos.org/job/libvirt-go-xml-check/systems=libvirt-debian-9/305/display/redirect> ------------------------------------------ Started by upstream project "libvirt-go-xml-check" build number 305 originally caused by: Started by upstream project "libvirt-go-xml-build" build number 305 originally caused by: Started by upstream project "libvirt-build" build number 371 originally caused by: Started by an SCM change [EnvInject] - Loading node environment variables. Building remotely on libvirt-debian-9 (libvirt) in workspace <https://ci.centos.org/job/libvirt-go-xml-check/systems=libvirt-debian-9/ws/> [libvirt-go-xml] $ /bin/sh -xe /tmp/jenkins7283304441830740032.sh + export TEST_ARGS=-tags xmlroundtrip + go test -tags xmlroundtrip --- FAIL: TestRoundTrip (17.38s) xml_test.go:400: testdata/libvirt/tests/qemuxml2argvdata/aarch64-virt-graphics.xml: /domain[0]/devices[0]/channel[0]/source[0]: element in expected XML missing in actual XML FAIL exit status 1 FAIL _<https://ci.centos.org/job/libvirt-go-xml-check/systems=libvirt-debian-9/ws/> 17.471s Build step 'Execute shell' marked build as failure

See <https://ci.centos.org/job/libvirt-go-xml-check/systems=libvirt-debian-9/306/display/redirect> ------------------------------------------ Started by upstream project "libvirt-go-xml-check" build number 306 originally caused by: Started by upstream project "libvirt-go-xml-build" build number 306 originally caused by: Started by upstream project "libvirt-build" build number 372 originally caused by: Started by an SCM change [EnvInject] - Loading node environment variables. Building remotely on libvirt-debian-9 (libvirt) in workspace <https://ci.centos.org/job/libvirt-go-xml-check/systems=libvirt-debian-9/ws/> [libvirt-go-xml] $ /bin/sh -xe /tmp/jenkins3940449132720642269.sh + export TEST_ARGS=-tags xmlroundtrip + go test -tags xmlroundtrip --- FAIL: TestRoundTrip (22.94s) xml_test.go:400: testdata/libvirt/tests/qemuxml2argvdata/aarch64-virt-graphics.xml: /domain[0]/devices[0]/channel[0]/source[0]: element in expected XML missing in actual XML FAIL exit status 1 FAIL _<https://ci.centos.org/job/libvirt-go-xml-check/systems=libvirt-debian-9/ws/> 23.133s Build step 'Execute shell' marked build as failure

See <https://ci.centos.org/job/libvirt-go-xml-check/systems=libvirt-debian-9/307/display/redirect> ------------------------------------------ Started by upstream project "libvirt-go-xml-check" build number 307 originally caused by: Started by upstream project "libvirt-go-xml-build" build number 307 originally caused by: Started by upstream project "libvirt-build" build number 373 originally caused by: Started by an SCM change [EnvInject] - Loading node environment variables. Building remotely on libvirt-debian-9 (libvirt) in workspace <https://ci.centos.org/job/libvirt-go-xml-check/systems=libvirt-debian-9/ws/> [libvirt-go-xml] $ /bin/sh -xe /tmp/jenkins5877196087348019330.sh + export TEST_ARGS=-tags xmlroundtrip + go test -tags xmlroundtrip --- FAIL: TestRoundTrip (6.42s) xml_test.go:400: testdata/libvirt/tests/qemuxml2argvdata/aarch64-virt-graphics.xml: /domain[0]/devices[0]/channel[0]/source[0]: element in expected XML missing in actual XML FAIL exit status 1 FAIL _<https://ci.centos.org/job/libvirt-go-xml-check/systems=libvirt-debian-9/ws/> 6.467s Build step 'Execute shell' marked build as failure

See <https://ci.centos.org/job/libvirt-go-xml-check/systems=libvirt-debian-9/308/display/redirect> ------------------------------------------ Started by upstream project "libvirt-go-xml-check" build number 308 originally caused by: Started by upstream project "libvirt-go-xml-build" build number 308 originally caused by: Started by upstream project "libvirt-build" build number 374 originally caused by: Started by an SCM change Started by an SCM change Started by an SCM change Started by an SCM change [EnvInject] - Loading node environment variables. Building remotely on libvirt-debian-9 (libvirt) in workspace <https://ci.centos.org/job/libvirt-go-xml-check/systems=libvirt-debian-9/ws/> [libvirt-go-xml] $ /bin/sh -xe /tmp/jenkins1945473687692081527.sh + export TEST_ARGS=-tags xmlroundtrip + go test -tags xmlroundtrip --- FAIL: TestRoundTrip (18.08s) xml_test.go:400: testdata/libvirt/tests/qemuxml2argvdata/aarch64-os-firmware-efi.xml: /domain[0]/os[0]/@firmware: attribute 'efi' in expected XML missing in actual XML FAIL exit status 1 FAIL _<https://ci.centos.org/job/libvirt-go-xml-check/systems=libvirt-debian-9/ws/> 18.178s Build step 'Execute shell' marked build as failure

See <https://ci.centos.org/job/libvirt-go-xml-check/systems=libvirt-debian-9/309/display/redirect> ------------------------------------------ Started by upstream project "libvirt-go-xml-check" build number 309 originally caused by: Started by upstream project "libvirt-go-xml-build" build number 309 originally caused by: Started by upstream project "libvirt-build" build number 375 originally caused by: Started by an SCM change Started by an SCM change Started by an SCM change Started by an SCM change Started by an SCM change Started by an SCM change [EnvInject] - Loading node environment variables. Building remotely on libvirt-debian-9 (libvirt) in workspace <https://ci.centos.org/job/libvirt-go-xml-check/systems=libvirt-debian-9/ws/> [libvirt-go-xml] $ /bin/sh -xe /tmp/jenkins2409521086617454665.sh + export TEST_ARGS=-tags xmlroundtrip + go test -tags xmlroundtrip --- FAIL: TestRoundTrip (6.77s) xml_test.go:400: testdata/libvirt/tests/qemuxml2argvdata/aarch64-os-firmware-efi.xml: /domain[0]/os[0]/@firmware: attribute 'efi' in expected XML missing in actual XML FAIL exit status 1 FAIL _<https://ci.centos.org/job/libvirt-go-xml-check/systems=libvirt-debian-9/ws/> 6.866s Build step 'Execute shell' marked build as failure

See <https://ci.centos.org/job/libvirt-go-xml-check/systems=libvirt-debian-9/310/display/redirect> ------------------------------------------ Started by upstream project "libvirt-go-xml-check" build number 310 originally caused by: Started by upstream project "libvirt-go-xml-build" build number 310 originally caused by: Started by an SCM change [EnvInject] - Loading node environment variables. Building remotely on libvirt-debian-9 (libvirt) in workspace <https://ci.centos.org/job/libvirt-go-xml-check/systems=libvirt-debian-9/ws/> [libvirt-go-xml] $ /bin/sh -xe /tmp/jenkins6038003888229399522.sh + export TEST_ARGS=-tags xmlroundtrip + go test -tags xmlroundtrip --- FAIL: TestRoundTrip (8.96s) xml_test.go:400: testdata/libvirt/tests/qemuxml2argvdata/aarch64-virt-graphics.xml: /domain[0]/devices[0]/channel[0]/source[0]: element in expected XML missing in actual XML FAIL exit status 1 FAIL _<https://ci.centos.org/job/libvirt-go-xml-check/systems=libvirt-debian-9/ws/> 9.025s Build step 'Execute shell' marked build as failure

See <https://ci.centos.org/job/libvirt-go-xml-check/systems=libvirt-debian-9/311/display/redirect> ------------------------------------------ Started by upstream project "libvirt-go-xml-check" build number 311 originally caused by: Started by upstream project "libvirt-go-xml-build" build number 311 originally caused by: Started by an SCM change [EnvInject] - Loading node environment variables. Building remotely on libvirt-debian-9 (libvirt) in workspace <https://ci.centos.org/job/libvirt-go-xml-check/systems=libvirt-debian-9/ws/> [libvirt-go-xml] $ /bin/sh -xe /tmp/jenkins1327024999964421034.sh + export TEST_ARGS=-tags xmlroundtrip + go test -tags xmlroundtrip --- FAIL: TestRoundTrip (16.95s) xml_test.go:400: testdata/libvirt/tests/qemuxml2argvdata/aarch64-virt-graphics.xml: /domain[0]/devices[0]/channel[0]/source[0]: element in expected XML missing in actual XML FAIL exit status 1 FAIL _<https://ci.centos.org/job/libvirt-go-xml-check/systems=libvirt-debian-9/ws/> 17.085s Build step 'Execute shell' marked build as failure

See <https://ci.centos.org/job/libvirt-go-xml-check/systems=libvirt-debian-9/312/display/redirect> ------------------------------------------ Started by upstream project "libvirt-go-xml-check" build number 312 originally caused by: Started by upstream project "libvirt-go-xml-build" build number 312 originally caused by: Started by upstream project "libvirt-build" build number 377 originally caused by: Started by an SCM change [EnvInject] - Loading node environment variables. Building remotely on libvirt-debian-9 (libvirt) in workspace <https://ci.centos.org/job/libvirt-go-xml-check/systems=libvirt-debian-9/ws/> [libvirt-go-xml] $ /bin/sh -xe /tmp/jenkins7409388163614835271.sh + export TEST_ARGS=-tags xmlroundtrip + go test -tags xmlroundtrip --- FAIL: TestRoundTrip (3.92s) xml_test.go:400: testdata/libvirt/tests/qemuxml2argvdata/aarch64-virt-graphics.xml: /domain[0]/devices[0]/channel[0]/source[0]: element in expected XML missing in actual XML FAIL exit status 1 FAIL _<https://ci.centos.org/job/libvirt-go-xml-check/systems=libvirt-debian-9/ws/> 3.993s Build step 'Execute shell' marked build as failure

participants (1)
-
ci@centos.org