[Libvirt-ci] Build failed in Jenkins: libvirt-go-check » libvirt-freebsd-11 #231

See <https://ci.centos.org/job/libvirt-go-check/systems=libvirt-freebsd-11/231/display/redirect> ------------------------------------------ Started by upstream project "libvirt-go-check" build number 231 originally caused by: Started by upstream project "libvirt-go-build" build number 235 originally caused by: Started by upstream project "libvirt-build" build number 295 originally caused by: Started by an SCM change Started by an SCM change Started by an SCM change Started by an SCM change [EnvInject] - Loading node environment variables. Building remotely on libvirt-freebsd-11 (libvirt) in workspace <https://ci.centos.org/job/libvirt-go-check/systems=libvirt-freebsd-11/ws/> [libvirt-go] $ /bin/sh -xe /tmp/jenkins2469575304751655999.sh + export 'TEST_ARGS=-tags api' + go test -tags api Missing macro 'VIR_MIGRATE_PARAM_BANDWIDTH_POSTCOPY' Missing enum 'VIR_DOMAIN_MIGRATE_MAX_SPEED_POSTCOPY' --- FAIL: TestAPICoverage (0.36s) panic: Missing symbols found [recovered] panic: Missing symbols found goroutine 5 [running]: testing.tRunner.func1(0xc0000aa100) /usr/local/go/src/testing/testing.go:792 +0x387 panic(0x5cc620, 0x638e40) /usr/local/go/src/runtime/panic.go:513 +0x1b9 _/usr<https://ci.centos.org/job/libvirt-go-check/systems=libvirt-freebsd-11/ws/.TestAPICoverage(0xc0000aa100)> /usr<https://ci.centos.org/job/libvirt-go-check/systems=libvirt-freebsd-11/ws/api_test.go>:501 +0x554 testing.tRunner(0xc0000aa100, 0x61a460) /usr/local/go/src/testing/testing.go:827 +0xbf created by testing.(*T).Run /usr/local/go/src/testing/testing.go:878 +0x35c exit status 2 FAIL _/usr<https://ci.centos.org/job/libvirt-go-check/systems=libvirt-freebsd-11/ws/> 0.458s Build step 'Execute shell' marked build as failure

See <https://ci.centos.org/job/libvirt-go-check/systems=libvirt-freebsd-11/232/display/redirect> ------------------------------------------ Started by upstream project "libvirt-go-check" build number 232 originally caused by: Started by upstream project "libvirt-go-build" build number 236 originally caused by: Started by upstream project "libvirt-build" build number 296 originally caused by: Started by an SCM change [EnvInject] - Loading node environment variables. Building remotely on libvirt-freebsd-11 (libvirt) in workspace <https://ci.centos.org/job/libvirt-go-check/systems=libvirt-freebsd-11/ws/> [libvirt-go] $ /bin/sh -xe /tmp/jenkins5021007496265873458.sh + export 'TEST_ARGS=-tags api' + go test -tags api Missing macro 'VIR_MIGRATE_PARAM_BANDWIDTH_POSTCOPY' Missing enum 'VIR_DOMAIN_MIGRATE_MAX_SPEED_POSTCOPY' --- FAIL: TestAPICoverage (0.76s) panic: Missing symbols found [recovered] panic: Missing symbols found goroutine 18 [running]: testing.tRunner.func1(0xc0000bc100) /usr/local/go/src/testing/testing.go:792 +0x387 panic(0x5cc620, 0x638e40) /usr/local/go/src/runtime/panic.go:513 +0x1b9 _/usr<https://ci.centos.org/job/libvirt-go-check/systems=libvirt-freebsd-11/ws/.TestAPICoverage(0xc0000bc100)> /usr<https://ci.centos.org/job/libvirt-go-check/systems=libvirt-freebsd-11/ws/api_test.go>:501 +0x554 testing.tRunner(0xc0000bc100, 0x61a460) /usr/local/go/src/testing/testing.go:827 +0xbf created by testing.(*T).Run /usr/local/go/src/testing/testing.go:878 +0x35c exit status 2 FAIL _/usr<https://ci.centos.org/job/libvirt-go-check/systems=libvirt-freebsd-11/ws/> 1.196s Build step 'Execute shell' marked build as failure

See <https://ci.centos.org/job/libvirt-go-check/systems=libvirt-freebsd-11/233/display/redirect> ------------------------------------------ Started by upstream project "libvirt-go-check" build number 233 originally caused by: Started by upstream project "libvirt-go-build" build number 237 originally caused by: Started by upstream project "libvirt-build" build number 297 originally caused by: Started by an SCM change [EnvInject] - Loading node environment variables. Building remotely on libvirt-freebsd-11 (libvirt) in workspace <https://ci.centos.org/job/libvirt-go-check/systems=libvirt-freebsd-11/ws/> [libvirt-go] $ /bin/sh -xe /tmp/jenkins2265423791572662815.sh + export 'TEST_ARGS=-tags api' + go test -tags api Missing macro 'VIR_MIGRATE_PARAM_BANDWIDTH_POSTCOPY' Missing enum 'VIR_DOMAIN_MIGRATE_MAX_SPEED_POSTCOPY' --- FAIL: TestAPICoverage (0.37s) panic: Missing symbols found [recovered] panic: Missing symbols found goroutine 20 [running]: testing.tRunner.func1(0xc0000c2100) /usr/local/go/src/testing/testing.go:792 +0x387 panic(0x5cc620, 0x638e40) /usr/local/go/src/runtime/panic.go:513 +0x1b9 _/usr<https://ci.centos.org/job/libvirt-go-check/systems=libvirt-freebsd-11/ws/.TestAPICoverage(0xc0000c2100)> /usr<https://ci.centos.org/job/libvirt-go-check/systems=libvirt-freebsd-11/ws/api_test.go>:501 +0x554 testing.tRunner(0xc0000c2100, 0x61a460) /usr/local/go/src/testing/testing.go:827 +0xbf created by testing.(*T).Run /usr/local/go/src/testing/testing.go:878 +0x35c exit status 2 FAIL _/usr<https://ci.centos.org/job/libvirt-go-check/systems=libvirt-freebsd-11/ws/> 0.517s Build step 'Execute shell' marked build as failure

See <https://ci.centos.org/job/libvirt-go-check/systems=libvirt-freebsd-11/234/display/redirect> ------------------------------------------ Started by upstream project "libvirt-go-check" build number 234 originally caused by: Started by upstream project "libvirt-go-build" build number 238 originally caused by: Started by upstream project "libvirt-build" build number 298 originally caused by: Started by an SCM change Started by an SCM change Started by an SCM change Started by an SCM change Started by an SCM change Started by an SCM change [EnvInject] - Loading node environment variables. Building remotely on libvirt-freebsd-11 (libvirt) in workspace <https://ci.centos.org/job/libvirt-go-check/systems=libvirt-freebsd-11/ws/> [libvirt-go] $ /bin/sh -xe /tmp/jenkins2932133416258818299.sh + export 'TEST_ARGS=-tags api' + go test -tags api Missing macro 'VIR_MIGRATE_PARAM_BANDWIDTH_POSTCOPY' Missing enum 'VIR_DOMAIN_MIGRATE_MAX_SPEED_POSTCOPY' --- FAIL: TestAPICoverage (0.68s) panic: Missing symbols found [recovered] panic: Missing symbols found goroutine 5 [running]: testing.tRunner.func1(0xc0000b2100) /usr/local/go/src/testing/testing.go:792 +0x387 panic(0x5cc620, 0x638e40) /usr/local/go/src/runtime/panic.go:513 +0x1b9 _/usr<https://ci.centos.org/job/libvirt-go-check/systems=libvirt-freebsd-11/ws/.TestAPICoverage(0xc0000b2100)> /usr<https://ci.centos.org/job/libvirt-go-check/systems=libvirt-freebsd-11/ws/api_test.go>:501 +0x554 testing.tRunner(0xc0000b2100, 0x61a460) /usr/local/go/src/testing/testing.go:827 +0xbf created by testing.(*T).Run /usr/local/go/src/testing/testing.go:878 +0x35c exit status 2 FAIL _/usr<https://ci.centos.org/job/libvirt-go-check/systems=libvirt-freebsd-11/ws/> 1.182s Build step 'Execute shell' marked build as failure

See <https://ci.centos.org/job/libvirt-go-check/systems=libvirt-freebsd-11/235/display/redirect> ------------------------------------------ Started by upstream project "libvirt-go-check" build number 235 originally caused by: Started by upstream project "libvirt-go-build" build number 239 originally caused by: Started by upstream project "libvirt-build" build number 299 originally caused by: Started by an SCM change Started by an SCM change Started by an SCM change Started by an SCM change Started by an SCM change [EnvInject] - Loading node environment variables. Building remotely on libvirt-freebsd-11 (libvirt) in workspace <https://ci.centos.org/job/libvirt-go-check/systems=libvirt-freebsd-11/ws/> [libvirt-go] $ /bin/sh -xe /tmp/jenkins8327686304778674395.sh + export 'TEST_ARGS=-tags api' + go test -tags api Missing macro 'VIR_MIGRATE_PARAM_BANDWIDTH_POSTCOPY' Missing enum 'VIR_DOMAIN_MIGRATE_MAX_SPEED_POSTCOPY' --- FAIL: TestAPICoverage (0.28s) panic: Missing symbols found [recovered] panic: Missing symbols found goroutine 19 [running]: testing.tRunner.func1(0xc0000c6100) /usr/local/go/src/testing/testing.go:792 +0x387 panic(0x5cc620, 0x638e40) /usr/local/go/src/runtime/panic.go:513 +0x1b9 _/usr<https://ci.centos.org/job/libvirt-go-check/systems=libvirt-freebsd-11/ws/.TestAPICoverage(0xc0000c6100)> /usr<https://ci.centos.org/job/libvirt-go-check/systems=libvirt-freebsd-11/ws/api_test.go>:501 +0x554 testing.tRunner(0xc0000c6100, 0x61a460) /usr/local/go/src/testing/testing.go:827 +0xbf created by testing.(*T).Run /usr/local/go/src/testing/testing.go:878 +0x35c exit status 2 FAIL _/usr<https://ci.centos.org/job/libvirt-go-check/systems=libvirt-freebsd-11/ws/> 0.517s Build step 'Execute shell' marked build as failure

See <https://ci.centos.org/job/libvirt-go-check/systems=libvirt-freebsd-11/236/display/redirect> ------------------------------------------ Started by upstream project "libvirt-go-check" build number 236 originally caused by: Started by upstream project "libvirt-go-build" build number 240 originally caused by: Started by upstream project "libvirt-build" build number 300 originally caused by: Started by an SCM change Started by an SCM change Started by an SCM change Started by an SCM change Started by an SCM change Started by an SCM change Started by an SCM change [EnvInject] - Loading node environment variables. Building remotely on libvirt-freebsd-11 (libvirt) in workspace <https://ci.centos.org/job/libvirt-go-check/systems=libvirt-freebsd-11/ws/> [libvirt-go] $ /bin/sh -xe /tmp/jenkins61628797536081636.sh + export 'TEST_ARGS=-tags api' + go test -tags api Missing macro 'VIR_MIGRATE_PARAM_BANDWIDTH_POSTCOPY' Missing enum 'VIR_DOMAIN_MIGRATE_MAX_SPEED_POSTCOPY' --- FAIL: TestAPICoverage (1.02s) panic: Missing symbols found [recovered] panic: Missing symbols found goroutine 19 [running]: testing.tRunner.func1(0xc0000be100) /usr/local/go/src/testing/testing.go:792 +0x387 panic(0x5cc620, 0x638e40) /usr/local/go/src/runtime/panic.go:513 +0x1b9 _/usr<https://ci.centos.org/job/libvirt-go-check/systems=libvirt-freebsd-11/ws/.TestAPICoverage(0xc0000be100)> /usr<https://ci.centos.org/job/libvirt-go-check/systems=libvirt-freebsd-11/ws/api_test.go>:501 +0x554 testing.tRunner(0xc0000be100, 0x61a460) /usr/local/go/src/testing/testing.go:827 +0xbf created by testing.(*T).Run /usr/local/go/src/testing/testing.go:878 +0x35c exit status 2 FAIL _/usr<https://ci.centos.org/job/libvirt-go-check/systems=libvirt-freebsd-11/ws/> 1.588s Build step 'Execute shell' marked build as failure

participants (1)
-
ci@centos.org