[Libvirt-ci] Build failed in Jenkins: libvirt-go-check » libvirt-freebsd-11 #329

See <https://ci.centos.org/job/libvirt-go-check/systems=libvirt-freebsd-11/329/display/redirect> ------------------------------------------ Started by upstream project "libvirt-go-check" build number 329 originally caused by: Started by upstream project "libvirt-go-build" build number 335 originally caused by: Started by upstream project "libvirt-build" build number 424 originally caused by: Started by an SCM change Started by an SCM change Started by an SCM change Started by an SCM change Started by an SCM change Started by an SCM change Started by an SCM change Started by an SCM change Started by an SCM change [EnvInject] - Loading node environment variables. Building remotely on libvirt-freebsd-11 (libvirt) in workspace <https://ci.centos.org/job/libvirt-go-check/systems=libvirt-freebsd-11/ws/> [libvirt-go] $ /bin/sh -xe /tmp/jenkins8823353294860625040.sh + export 'TEST_ARGS=-tags api' + go test -tags api Missing enum 'VIR_ERR_INVALID_DOMAIN_CHECKPOINT' Missing enum 'VIR_ERR_NO_DOMAIN_BACKUP' Missing enum 'VIR_ERR_NO_DOMAIN_CHECKPOINT' Missing enum 'VIR_FROM_DOMAIN_CHECKPOINT' --- FAIL: TestAPICoverage (0.71s) panic: Missing symbols found [recovered] panic: Missing symbols found goroutine 19 [running]: testing.tRunner.func1(0xc0000c8100) /usr/local/go/src/testing/testing.go:830 +0x392 panic(0x5d0a80, 0x645e40) /usr/local/go/src/runtime/panic.go:522 +0x1b5 _/usr<https://ci.centos.org/job/libvirt-go-check/systems=libvirt-freebsd-11/ws/.TestAPICoverage(0xc0000c8100)> /usr<https://ci.centos.org/job/libvirt-go-check/systems=libvirt-freebsd-11/ws/api_test.go>:501 +0x551 testing.tRunner(0xc0000c8100, 0x6204d8) /usr/local/go/src/testing/testing.go:865 +0xc0 created by testing.(*T).Run /usr/local/go/src/testing/testing.go:916 +0x35a exit status 2 FAIL _/usr<https://ci.centos.org/job/libvirt-go-check/systems=libvirt-freebsd-11/ws/> 1.554s Build step 'Execute shell' marked build as failure

See <https://ci.centos.org/job/libvirt-go-check/systems=libvirt-freebsd-11/330/display/redirect> ------------------------------------------ Started by upstream project "libvirt-go-check" build number 330 originally caused by: Started by upstream project "libvirt-go-build" build number 336 originally caused by: Started by upstream project "libvirt-build" build number 426 originally caused by: Started by an SCM change Started by an SCM change [EnvInject] - Loading node environment variables. Building remotely on libvirt-freebsd-11 (libvirt) in workspace <https://ci.centos.org/job/libvirt-go-check/systems=libvirt-freebsd-11/ws/> [libvirt-go] $ /bin/sh -xe /tmp/jenkins4098533473499535674.sh + export 'TEST_ARGS=-tags api' + go test -tags api Missing macro 'VIR_MIGRATE_PARAM_PARALLEL_CONNECTIONS' Missing enum 'VIR_ERR_INVALID_DOMAIN_CHECKPOINT' Missing enum 'VIR_ERR_NO_DOMAIN_BACKUP' Missing enum 'VIR_ERR_NO_DOMAIN_CHECKPOINT' Missing enum 'VIR_FROM_DOMAIN_CHECKPOINT' Missing enum 'VIR_MIGRATE_PARALLEL' --- FAIL: TestAPICoverage (0.42s) panic: Missing symbols found [recovered] panic: Missing symbols found goroutine 4 [running]: testing.tRunner.func1(0xc0000b2100) /usr/local/go/src/testing/testing.go:830 +0x392 panic(0x5d0a80, 0x645e40) /usr/local/go/src/runtime/panic.go:522 +0x1b5 _/usr<https://ci.centos.org/job/libvirt-go-check/systems=libvirt-freebsd-11/ws/.TestAPICoverage(0xc0000b2100)> /usr<https://ci.centos.org/job/libvirt-go-check/systems=libvirt-freebsd-11/ws/api_test.go>:501 +0x551 testing.tRunner(0xc0000b2100, 0x6204d8) /usr/local/go/src/testing/testing.go:865 +0xc0 created by testing.(*T).Run /usr/local/go/src/testing/testing.go:916 +0x35a exit status 2 FAIL _/usr<https://ci.centos.org/job/libvirt-go-check/systems=libvirt-freebsd-11/ws/> 0.551s Build step 'Execute shell' marked build as failure

See <https://ci.centos.org/job/libvirt-go-check/systems=libvirt-freebsd-11/331/display/redirect> ------------------------------------------ Started by upstream project "libvirt-go-check" build number 331 originally caused by: Started by upstream project "libvirt-go-build" build number 337 originally caused by: Started by upstream project "libvirt-build" build number 428 originally caused by: Started by an SCM change [EnvInject] - Loading node environment variables. Building remotely on libvirt-freebsd-11 (libvirt) in workspace <https://ci.centos.org/job/libvirt-go-check/systems=libvirt-freebsd-11/ws/> [libvirt-go] $ /bin/sh -xe /tmp/jenkins4019545600254745461.sh + export 'TEST_ARGS=-tags api' + go test -tags api Missing macro 'VIR_MIGRATE_PARAM_PARALLEL_CONNECTIONS' Missing enum 'VIR_ERR_INVALID_DOMAIN_CHECKPOINT' Missing enum 'VIR_ERR_NO_DOMAIN_BACKUP' Missing enum 'VIR_ERR_NO_DOMAIN_CHECKPOINT' Missing enum 'VIR_FROM_DOMAIN_CHECKPOINT' Missing enum 'VIR_MIGRATE_PARALLEL' --- FAIL: TestAPICoverage (0.81s) panic: Missing symbols found [recovered] panic: Missing symbols found goroutine 4 [running]: testing.tRunner.func1(0xc0000b2100) /usr/local/go/src/testing/testing.go:830 +0x392 panic(0x5d0a80, 0x645e40) /usr/local/go/src/runtime/panic.go:522 +0x1b5 _/usr<https://ci.centos.org/job/libvirt-go-check/systems=libvirt-freebsd-11/ws/.TestAPICoverage(0xc0000b2100)> /usr<https://ci.centos.org/job/libvirt-go-check/systems=libvirt-freebsd-11/ws/api_test.go>:501 +0x551 testing.tRunner(0xc0000b2100, 0x6204d8) /usr/local/go/src/testing/testing.go:865 +0xc0 created by testing.(*T).Run /usr/local/go/src/testing/testing.go:916 +0x35a exit status 2 FAIL _/usr<https://ci.centos.org/job/libvirt-go-check/systems=libvirt-freebsd-11/ws/> 1.313s Build step 'Execute shell' marked build as failure

See <https://ci.centos.org/job/libvirt-go-check/systems=libvirt-freebsd-11/332/display/redirect> ------------------------------------------ Started by upstream project "libvirt-go-check" build number 332 originally caused by: Started by upstream project "libvirt-go-build" build number 338 originally caused by: Started by upstream project "libvirt-build" build number 429 originally caused by: Started by an SCM change [EnvInject] - Loading node environment variables. Building remotely on libvirt-freebsd-11 (libvirt) in workspace <https://ci.centos.org/job/libvirt-go-check/systems=libvirt-freebsd-11/ws/> [libvirt-go] $ /bin/sh -xe /tmp/jenkins5420865994021163540.sh + export 'TEST_ARGS=-tags api' + go test -tags api Missing macro 'VIR_MIGRATE_PARAM_PARALLEL_CONNECTIONS' Missing enum 'VIR_ERR_INVALID_DOMAIN_CHECKPOINT' Missing enum 'VIR_ERR_NO_DOMAIN_BACKUP' Missing enum 'VIR_ERR_NO_DOMAIN_CHECKPOINT' Missing enum 'VIR_FROM_DOMAIN_CHECKPOINT' Missing enum 'VIR_MIGRATE_PARALLEL' --- FAIL: TestAPICoverage (0.41s) panic: Missing symbols found [recovered] panic: Missing symbols found goroutine 19 [running]: testing.tRunner.func1(0xc0000c8100) /usr/local/go/src/testing/testing.go:830 +0x392 panic(0x5d0a80, 0x645e40) /usr/local/go/src/runtime/panic.go:522 +0x1b5 _/usr<https://ci.centos.org/job/libvirt-go-check/systems=libvirt-freebsd-11/ws/.TestAPICoverage(0xc0000c8100)> /usr<https://ci.centos.org/job/libvirt-go-check/systems=libvirt-freebsd-11/ws/api_test.go>:501 +0x551 testing.tRunner(0xc0000c8100, 0x6204d8) /usr/local/go/src/testing/testing.go:865 +0xc0 created by testing.(*T).Run /usr/local/go/src/testing/testing.go:916 +0x35a exit status 2 FAIL _/usr<https://ci.centos.org/job/libvirt-go-check/systems=libvirt-freebsd-11/ws/> 0.494s Build step 'Execute shell' marked build as failure

See <https://ci.centos.org/job/libvirt-go-check/systems=libvirt-freebsd-11/333/display/redirect> ------------------------------------------ Started by upstream project "libvirt-go-check" build number 333 originally caused by: Started by upstream project "libvirt-go-build" build number 339 originally caused by: Started by upstream project "libvirt-build" build number 430 originally caused by: Started by an SCM change [EnvInject] - Loading node environment variables. Building remotely on libvirt-freebsd-11 (libvirt) in workspace <https://ci.centos.org/job/libvirt-go-check/systems=libvirt-freebsd-11/ws/> [libvirt-go] $ /bin/sh -xe /tmp/jenkins7394129427236043015.sh + export 'TEST_ARGS=-tags api' + go test -tags api Missing macro 'VIR_MIGRATE_PARAM_PARALLEL_CONNECTIONS' Missing enum 'VIR_ERR_INVALID_DOMAIN_CHECKPOINT' Missing enum 'VIR_ERR_NO_DOMAIN_BACKUP' Missing enum 'VIR_ERR_NO_DOMAIN_CHECKPOINT' Missing enum 'VIR_FROM_DOMAIN_CHECKPOINT' Missing enum 'VIR_MIGRATE_PARALLEL' --- FAIL: TestAPICoverage (0.44s) panic: Missing symbols found [recovered] panic: Missing symbols found goroutine 5 [running]: testing.tRunner.func1(0xc0000ac100) /usr/local/go/src/testing/testing.go:830 +0x392 panic(0x5d0a80, 0x645e40) /usr/local/go/src/runtime/panic.go:522 +0x1b5 _/usr<https://ci.centos.org/job/libvirt-go-check/systems=libvirt-freebsd-11/ws/.TestAPICoverage(0xc0000ac100)> /usr<https://ci.centos.org/job/libvirt-go-check/systems=libvirt-freebsd-11/ws/api_test.go>:501 +0x551 testing.tRunner(0xc0000ac100, 0x6204d8) /usr/local/go/src/testing/testing.go:865 +0xc0 created by testing.(*T).Run /usr/local/go/src/testing/testing.go:916 +0x35a exit status 2 FAIL _/usr<https://ci.centos.org/job/libvirt-go-check/systems=libvirt-freebsd-11/ws/> 0.864s Build step 'Execute shell' marked build as failure

participants (1)
-
ci@centos.org