libvirt | Pipeline #165281027 has failed for master | e5c00317

Your pipeline has failed. Project: libvirt ( https://gitlab.com/libvirt/libvirt ) Branch: master ( https://gitlab.com/libvirt/libvirt/-/commits/master ) Commit: e5c00317 ( https://gitlab.com/libvirt/libvirt/-/commit/e5c00317def944bb675e143d55542d7e... ) Commit Message: wireshark: fix compilation errors With meson i... Commit Author: Pavel Hrdina ( https://gitlab.com/phrdina ) Pipeline #165281027 ( https://gitlab.com/libvirt/libvirt/-/pipelines/165281027 ) triggered by Pavel Hrdina ( https://gitlab.com/phrdina ) had 14 failed builds. Job #633332935 ( https://gitlab.com/libvirt/libvirt/-/jobs/633332935/raw ) Stage: builds Name: x64-freebsd-12-build Job #633332936 ( https://gitlab.com/libvirt/libvirt/-/jobs/633332936/raw ) Stage: builds Name: x64-macos-1015-build Trace: PYTHON: "/usr/local/bin/python3" MAKE: "/usr/local/bin/gmake" build_task: install_script: - brew install augeas autoconf automake bash bash-completion ccache cpanminus cppi curl dbus dnsmasq docutils flake8 gdb gettext git glib gnutls gpatch libiscsi libpcap libssh libssh2 libtool libxml2 libxslt lsof make meson ncurses ninja perl pkg-config python3 qemu readline rpcgen screen scrub vim xz yajl clone_script: - git clone --depth 100 "$CI_REPOSITORY_URL" . - git fetch origin "$CI_COMMIT_REF_NAME" - git reset --hard "$CI_COMMIT_SHA" build_script: - mkdir build - cd build - ../autogen.sh --prefix=$(pwd)/install-root - $MAKE -j3 - $MAKE -j3 install - $MAKE -j3 dist [32;1m$ cirrus-run ci/cirrus/$NAME.yml[0;m Build created: https://cirrus-ci.com/build/4838006613868544 ............................................................ ............................................................ ............................................................ ............................................................ ............................................................ ............................................................ ............................................................ ........................................ Build failed: https://cirrus-ci.com/build/4838006613868544 section_end:1594390868:step_script [0K[31;1mERROR: Job failed: exit code 1 [0;m Job #633332924 ( https://gitlab.com/libvirt/libvirt/-/jobs/633332924/raw ) Stage: builds Name: x64-fedora-32 Trace: /usr/bin/make distdir-am make[4]: Entering directory '/builds/libvirt/libvirt/build/src' make[4]: Leaving directory '/builds/libvirt/libvirt/build/src' make[3]: Leaving directory '/builds/libvirt/libvirt/build/src' (cd tools && /usr/bin/make top_distdir=../libvirt-6.6.0 distdir=../libvirt-6.6.0/tools \ am__remove_distdir=: am__skip_length_check=: am__skip_mode_fix=: distdir) make[3]: Entering directory '/builds/libvirt/libvirt/build/tools' GEN libvirt-guests.sh GEN libvirt-guests.service /usr/bin/make distdir-am make[4]: Entering directory '/builds/libvirt/libvirt/build/tools' GEN wireshark/src/libvirt/protocol.h make[4]: Leaving directory '/builds/libvirt/libvirt/build/tools' make[3]: Leaving directory '/builds/libvirt/libvirt/build/tools' (cd docs && /usr/bin/make top_distdir=../libvirt-6.6.0 distdir=../libvirt-6.6.0/docs \ am__remove_distdir=: am__skip_length_check=: am__skip_mode_fix=: distdir) make[3]: Entering directory '/builds/libvirt/libvirt/build/docs' /usr/bin/make distdir-am make[4]: Entering directory '/builds/libvirt/libvirt/build/docs' make[4]: *** No rule to make target 'libvirt-daemon-arch.fig', needed by 'distdir-am'. Stop. make[4]: Leaving directory '/builds/libvirt/libvirt/build/docs' make[3]: *** [Makefile:1209: distdir] Error 2 make[3]: Leaving directory '/builds/libvirt/libvirt/build/docs' make[2]: *** [Makefile:912: distdir-am] Error 1 make[2]: Leaving directory '/builds/libvirt/libvirt/build' make[1]: *** [Makefile:906: distdir] Error 2 make[1]: Leaving directory '/builds/libvirt/libvirt/build' make: *** [Makefile:1010: dist] Error 2 section_end:1594390494:step_script [0K[31;1mERROR: Job failed: exit code 1 [0;m Job #633332925 ( https://gitlab.com/libvirt/libvirt/-/jobs/633332925/raw ) Stage: builds Name: x64-fedora-rawhide Trace: /usr/bin/make distdir-am make[4]: Entering directory '/builds/libvirt/libvirt/build/src' make[4]: Leaving directory '/builds/libvirt/libvirt/build/src' make[3]: Leaving directory '/builds/libvirt/libvirt/build/src' (cd tools && /usr/bin/make top_distdir=../libvirt-6.6.0 distdir=../libvirt-6.6.0/tools \ am__remove_distdir=: am__skip_length_check=: am__skip_mode_fix=: distdir) make[3]: Entering directory '/builds/libvirt/libvirt/build/tools' GEN libvirt-guests.sh GEN libvirt-guests.service /usr/bin/make distdir-am make[4]: Entering directory '/builds/libvirt/libvirt/build/tools' GEN wireshark/src/libvirt/protocol.h make[4]: Leaving directory '/builds/libvirt/libvirt/build/tools' make[3]: Leaving directory '/builds/libvirt/libvirt/build/tools' (cd docs && /usr/bin/make top_distdir=../libvirt-6.6.0 distdir=../libvirt-6.6.0/docs \ am__remove_distdir=: am__skip_length_check=: am__skip_mode_fix=: distdir) make[3]: Entering directory '/builds/libvirt/libvirt/build/docs' /usr/bin/make distdir-am make[4]: Entering directory '/builds/libvirt/libvirt/build/docs' make[4]: *** No rule to make target 'libvirt-daemon-arch.fig', needed by 'distdir-am'. Stop. make[4]: Leaving directory '/builds/libvirt/libvirt/build/docs' make[3]: *** [Makefile:1209: distdir] Error 2 make[3]: Leaving directory '/builds/libvirt/libvirt/build/docs' make[2]: *** [Makefile:912: distdir-am] Error 1 make[2]: Leaving directory '/builds/libvirt/libvirt/build' make[1]: *** [Makefile:906: distdir] Error 2 make[1]: Leaving directory '/builds/libvirt/libvirt/build' make: *** [Makefile:1014: dist] Error 2 section_end:1594390493:step_script [0K[31;1mERROR: Job failed: exit code 1 [0;m Job #633332921 ( https://gitlab.com/libvirt/libvirt/-/jobs/633332921/raw ) Stage: builds Name: x64-fedora-31 Trace: /usr/bin/make distdir-am make[4]: Entering directory '/builds/libvirt/libvirt/build/src' make[4]: Leaving directory '/builds/libvirt/libvirt/build/src' make[3]: Leaving directory '/builds/libvirt/libvirt/build/src' (cd tools && /usr/bin/make top_distdir=../libvirt-6.6.0 distdir=../libvirt-6.6.0/tools \ am__remove_distdir=: am__skip_length_check=: am__skip_mode_fix=: distdir) make[3]: Entering directory '/builds/libvirt/libvirt/build/tools' GEN libvirt-guests.sh GEN libvirt-guests.service /usr/bin/make distdir-am make[4]: Entering directory '/builds/libvirt/libvirt/build/tools' GEN wireshark/src/libvirt/protocol.h make[4]: Leaving directory '/builds/libvirt/libvirt/build/tools' make[3]: Leaving directory '/builds/libvirt/libvirt/build/tools' (cd docs && /usr/bin/make top_distdir=../libvirt-6.6.0 distdir=../libvirt-6.6.0/docs \ am__remove_distdir=: am__skip_length_check=: am__skip_mode_fix=: distdir) make[3]: Entering directory '/builds/libvirt/libvirt/build/docs' /usr/bin/make distdir-am make[4]: Entering directory '/builds/libvirt/libvirt/build/docs' make[4]: *** No rule to make target 'libvirt-daemon-arch.fig', needed by 'distdir-am'. Stop. make[4]: Leaving directory '/builds/libvirt/libvirt/build/docs' make[3]: *** [Makefile:1209: distdir] Error 2 make[3]: Leaving directory '/builds/libvirt/libvirt/build/docs' make[2]: *** [Makefile:912: distdir-am] Error 1 make[2]: Leaving directory '/builds/libvirt/libvirt/build' make[1]: *** [Makefile:906: distdir] Error 2 make[1]: Leaving directory '/builds/libvirt/libvirt/build' make: *** [Makefile:1010: dist] Error 2 section_end:1594390492:step_script [0K[31;1mERROR: Job failed: exit code 1 [0;m Job #633332918 ( https://gitlab.com/libvirt/libvirt/-/jobs/633332918/raw ) Stage: builds Name: x64-centos-8 Trace: /usr/bin/make distdir-am make[4]: Entering directory '/builds/libvirt/libvirt/build/src' make[4]: Leaving directory '/builds/libvirt/libvirt/build/src' make[3]: Leaving directory '/builds/libvirt/libvirt/build/src' (cd tools && /usr/bin/make top_distdir=../libvirt-6.6.0 distdir=../libvirt-6.6.0/tools \ am__remove_distdir=: am__skip_length_check=: am__skip_mode_fix=: distdir) make[3]: Entering directory '/builds/libvirt/libvirt/build/tools' GEN libvirt-guests.sh GEN libvirt-guests.service /usr/bin/make distdir-am make[4]: Entering directory '/builds/libvirt/libvirt/build/tools' GEN wireshark/src/libvirt/protocol.h make[4]: Leaving directory '/builds/libvirt/libvirt/build/tools' make[3]: Leaving directory '/builds/libvirt/libvirt/build/tools' (cd docs && /usr/bin/make top_distdir=../libvirt-6.6.0 distdir=../libvirt-6.6.0/docs \ am__remove_distdir=: am__skip_length_check=: am__skip_mode_fix=: distdir) make[3]: Entering directory '/builds/libvirt/libvirt/build/docs' /usr/bin/make distdir-am make[4]: Entering directory '/builds/libvirt/libvirt/build/docs' make[4]: *** No rule to make target 'libvirt-daemon-arch.fig', needed by 'distdir-am'. Stop. make[4]: Leaving directory '/builds/libvirt/libvirt/build/docs' make[3]: *** [Makefile:1209: distdir] Error 2 make[3]: Leaving directory '/builds/libvirt/libvirt/build/docs' make[2]: *** [Makefile:912: distdir-am] Error 1 make[2]: Leaving directory '/builds/libvirt/libvirt/build' make[1]: *** [Makefile:906: distdir] Error 2 make[1]: Leaving directory '/builds/libvirt/libvirt/build' make: *** [Makefile:1010: dist] Error 2 section_end:1594390492:step_script [0K[31;1mERROR: Job failed: exit code 1 [0;m Job #633332919 ( https://gitlab.com/libvirt/libvirt/-/jobs/633332919/raw ) Stage: builds Name: x64-centos-stream Trace: /usr/bin/make distdir-am make[4]: Entering directory '/builds/libvirt/libvirt/build/src' make[4]: Leaving directory '/builds/libvirt/libvirt/build/src' make[3]: Leaving directory '/builds/libvirt/libvirt/build/src' (cd tools && /usr/bin/make top_distdir=../libvirt-6.6.0 distdir=../libvirt-6.6.0/tools \ am__remove_distdir=: am__skip_length_check=: am__skip_mode_fix=: distdir) make[3]: Entering directory '/builds/libvirt/libvirt/build/tools' GEN libvirt-guests.sh GEN libvirt-guests.service /usr/bin/make distdir-am make[4]: Entering directory '/builds/libvirt/libvirt/build/tools' GEN wireshark/src/libvirt/protocol.h make[4]: Leaving directory '/builds/libvirt/libvirt/build/tools' make[3]: Leaving directory '/builds/libvirt/libvirt/build/tools' (cd docs && /usr/bin/make top_distdir=../libvirt-6.6.0 distdir=../libvirt-6.6.0/docs \ am__remove_distdir=: am__skip_length_check=: am__skip_mode_fix=: distdir) make[3]: Entering directory '/builds/libvirt/libvirt/build/docs' /usr/bin/make distdir-am make[4]: Entering directory '/builds/libvirt/libvirt/build/docs' make[4]: *** No rule to make target 'libvirt-daemon-arch.fig', needed by 'distdir-am'. Stop. make[4]: Leaving directory '/builds/libvirt/libvirt/build/docs' make[3]: *** [Makefile:1209: distdir] Error 2 make[3]: Leaving directory '/builds/libvirt/libvirt/build/docs' make[2]: *** [Makefile:912: distdir-am] Error 1 make[2]: Leaving directory '/builds/libvirt/libvirt/build' make[1]: *** [Makefile:906: distdir] Error 2 make[1]: Leaving directory '/builds/libvirt/libvirt/build' make: *** [Makefile:1010: dist] Error 2 section_end:1594390489:step_script [0K[31;1mERROR: Job failed: exit code 1 [0;m Job #633332911 ( https://gitlab.com/libvirt/libvirt/-/jobs/633332911/raw ) Stage: builds Name: x64-debian-10 Trace: /usr/bin/make distdir-am make[4]: Entering directory '/builds/libvirt/libvirt/build/src' make[4]: Leaving directory '/builds/libvirt/libvirt/build/src' make[3]: Leaving directory '/builds/libvirt/libvirt/build/src' (cd tools && /usr/bin/make top_distdir=../libvirt-6.6.0 distdir=../libvirt-6.6.0/tools \ am__remove_distdir=: am__skip_length_check=: am__skip_mode_fix=: distdir) make[3]: Entering directory '/builds/libvirt/libvirt/build/tools' GEN libvirt-guests.sh GEN libvirt-guests.service /usr/bin/make distdir-am make[4]: Entering directory '/builds/libvirt/libvirt/build/tools' GEN wireshark/src/libvirt/protocol.h make[4]: Leaving directory '/builds/libvirt/libvirt/build/tools' make[3]: Leaving directory '/builds/libvirt/libvirt/build/tools' (cd docs && /usr/bin/make top_distdir=../libvirt-6.6.0 distdir=../libvirt-6.6.0/docs \ am__remove_distdir=: am__skip_length_check=: am__skip_mode_fix=: distdir) make[3]: Entering directory '/builds/libvirt/libvirt/build/docs' /usr/bin/make distdir-am make[4]: Entering directory '/builds/libvirt/libvirt/build/docs' make[4]: *** No rule to make target 'libvirt-daemon-arch.fig', needed by 'distdir-am'. Stop. make[4]: Leaving directory '/builds/libvirt/libvirt/build/docs' make[3]: *** [Makefile:1209: distdir] Error 2 make[3]: Leaving directory '/builds/libvirt/libvirt/build/docs' make[2]: *** [Makefile:912: distdir-am] Error 1 make[2]: Leaving directory '/builds/libvirt/libvirt/build' make[1]: *** [Makefile:906: distdir] Error 2 make[1]: Leaving directory '/builds/libvirt/libvirt/build' make: *** [Makefile:1010: dist] Error 2 section_end:1594390487:step_script [0K[31;1mERROR: Job failed: exit code 1 [0;m Job #633332928 ( https://gitlab.com/libvirt/libvirt/-/jobs/633332928/raw ) Stage: builds Name: x64-opensuse-151 Trace: Now type 'make' to compile libvirt [32;1m$ $MAKE distcheck[0;m /usr/bin/make dist-xz am__post_remove_distdir='@:' make[1]: Entering directory '/builds/libvirt/libvirt/build' if test -d "libvirt-6.6.0"; then find "libvirt-6.6.0" -type d ! -perm -200 -exec chmod u+w {} ';' && rm -rf "libvirt-6.6.0" || { sleep 5 && rm -rf "libvirt-6.6.0"; }; else :; fi test -d "libvirt-6.6.0" || mkdir "libvirt-6.6.0" (cd include/libvirt && /usr/bin/make top_distdir=../../libvirt-6.6.0 distdir=../../libvirt-6.6.0/include/libvirt \ am__remove_distdir=: am__skip_length_check=: am__skip_mode_fix=: distdir) make[2]: Entering directory '/builds/libvirt/libvirt/build/include/libvirt' make[2]: Leaving directory '/builds/libvirt/libvirt/build/include/libvirt' (cd src && /usr/bin/make top_distdir=../libvirt-6.6.0 distdir=../libvirt-6.6.0/src \ am__remove_distdir=: am__skip_length_check=: am__skip_mode_fix=: distdir) make[2]: Entering directory '/builds/libvirt/libvirt/build/src' GEN admin/admin_server_dispatch_stubs.h make[2]: Leaving directory '/builds/libvirt/libvirt/build/src' (cd tools && /usr/bin/make top_distdir=../libvirt-6.6.0 distdir=../libvirt-6.6.0/tools \ am__remove_distdir=: am__skip_length_check=: am__skip_mode_fix=: distdir) make[2]: Entering directory '/builds/libvirt/libvirt/build/tools' GEN wireshark/src/libvirt/protocol.h make[2]: Leaving directory '/builds/libvirt/libvirt/build/tools' (cd docs && /usr/bin/make top_distdir=../libvirt-6.6.0 distdir=../libvirt-6.6.0/docs \ am__remove_distdir=: am__skip_length_check=: am__skip_mode_fix=: distdir) make[2]: Entering directory '/builds/libvirt/libvirt/build/docs' make[2]: *** No rule to make target 'libvirt-daemon-arch.fig', needed by 'distdir'. Stop. make[2]: Leaving directory '/builds/libvirt/libvirt/build/docs' make[1]: *** [Makefile:909: distdir] Error 1 make[1]: Leaving directory '/builds/libvirt/libvirt/build' make: *** [Makefile:1007: dist] Error 2 section_end:1594390483:step_script [0K[31;1mERROR: Job failed: exit code 1 [0;m Job #633332914 ( https://gitlab.com/libvirt/libvirt/-/jobs/633332914/raw ) Stage: builds Name: x64-debian-sid Trace: /usr/bin/make distdir-am make[4]: Entering directory '/builds/libvirt/libvirt/build/src' make[4]: Leaving directory '/builds/libvirt/libvirt/build/src' make[3]: Leaving directory '/builds/libvirt/libvirt/build/src' (cd tools && /usr/bin/make top_distdir=../libvirt-6.6.0 distdir=../libvirt-6.6.0/tools \ am__remove_distdir=: am__skip_length_check=: am__skip_mode_fix=: distdir) make[3]: Entering directory '/builds/libvirt/libvirt/build/tools' GEN libvirt-guests.sh GEN libvirt-guests.service /usr/bin/make distdir-am make[4]: Entering directory '/builds/libvirt/libvirt/build/tools' GEN wireshark/src/libvirt/protocol.h make[4]: Leaving directory '/builds/libvirt/libvirt/build/tools' make[3]: Leaving directory '/builds/libvirt/libvirt/build/tools' (cd docs && /usr/bin/make top_distdir=../libvirt-6.6.0 distdir=../libvirt-6.6.0/docs \ am__remove_distdir=: am__skip_length_check=: am__skip_mode_fix=: distdir) make[3]: Entering directory '/builds/libvirt/libvirt/build/docs' /usr/bin/make distdir-am make[4]: Entering directory '/builds/libvirt/libvirt/build/docs' make[4]: *** No rule to make target 'libvirt-daemon-arch.fig', needed by 'distdir-am'. Stop. make[4]: Leaving directory '/builds/libvirt/libvirt/build/docs' make[3]: *** [Makefile:1209: distdir] Error 2 make[3]: Leaving directory '/builds/libvirt/libvirt/build/docs' make[2]: *** [Makefile:912: distdir-am] Error 1 make[2]: Leaving directory '/builds/libvirt/libvirt/build' make[1]: *** [Makefile:906: distdir] Error 2 make[1]: Leaving directory '/builds/libvirt/libvirt/build' make: *** [Makefile:1014: dist] Error 2 section_end:1594390480:step_script [0K[31;1mERROR: Job failed: exit code 1 [0;m Job #633332907 ( https://gitlab.com/libvirt/libvirt/-/jobs/633332907/raw ) Stage: builds Name: x64-debian-9 Trace: /usr/bin/make dist-xz am__post_remove_distdir='@:' make[1]: Entering directory '/builds/libvirt/libvirt/build' if test -d "libvirt-6.6.0"; then find "libvirt-6.6.0" -type d ! -perm -200 -exec chmod u+w {} ';' && rm -rf "libvirt-6.6.0" || { sleep 5 && rm -rf "libvirt-6.6.0"; }; else :; fi test -d "libvirt-6.6.0" || mkdir "libvirt-6.6.0" (cd include/libvirt && /usr/bin/make top_distdir=../../libvirt-6.6.0 distdir=../../libvirt-6.6.0/include/libvirt \ am__remove_distdir=: am__skip_length_check=: am__skip_mode_fix=: distdir) make[2]: Entering directory '/builds/libvirt/libvirt/build/include/libvirt' make[2]: Leaving directory '/builds/libvirt/libvirt/build/include/libvirt' (cd src && /usr/bin/make top_distdir=../libvirt-6.6.0 distdir=../libvirt-6.6.0/src \ am__remove_distdir=: am__skip_length_check=: am__skip_mode_fix=: distdir) make[2]: Entering directory '/builds/libvirt/libvirt/build/src' GEN admin/admin_server_dispatch_stubs.h make[2]: Leaving directory '/builds/libvirt/libvirt/build/src' (cd tools && /usr/bin/make top_distdir=../libvirt-6.6.0 distdir=../libvirt-6.6.0/tools \ am__remove_distdir=: am__skip_length_check=: am__skip_mode_fix=: distdir) make[2]: Entering directory '/builds/libvirt/libvirt/build/tools' GEN wireshark/src/libvirt/protocol.h make[2]: Leaving directory '/builds/libvirt/libvirt/build/tools' (cd docs && /usr/bin/make top_distdir=../libvirt-6.6.0 distdir=../libvirt-6.6.0/docs \ am__remove_distdir=: am__skip_length_check=: am__skip_mode_fix=: distdir) make[2]: Entering directory '/builds/libvirt/libvirt/build/docs' make[2]: *** No rule to make target 'libvirt-daemon-arch.fig', needed by 'distdir'. Stop. make[2]: Leaving directory '/builds/libvirt/libvirt/build/docs' Makefile:906: recipe for target 'distdir' failed make[1]: *** [distdir] Error 1 make[1]: Leaving directory '/builds/libvirt/libvirt/build' Makefile:1007: recipe for target 'dist' failed make: *** [dist] Error 2 section_end:1594390476:step_script [0K[31;1mERROR: Job failed: exit code 1 [0;m Job #633332932 ( https://gitlab.com/libvirt/libvirt/-/jobs/633332932/raw ) Stage: builds Name: x64-ubuntu-2004 Trace: /usr/bin/make distdir-am make[4]: Entering directory '/builds/libvirt/libvirt/build/src' make[4]: Leaving directory '/builds/libvirt/libvirt/build/src' make[3]: Leaving directory '/builds/libvirt/libvirt/build/src' (cd tools && /usr/bin/make top_distdir=../libvirt-6.6.0 distdir=../libvirt-6.6.0/tools \ am__remove_distdir=: am__skip_length_check=: am__skip_mode_fix=: distdir) make[3]: Entering directory '/builds/libvirt/libvirt/build/tools' GEN libvirt-guests.sh GEN libvirt-guests.service /usr/bin/make distdir-am make[4]: Entering directory '/builds/libvirt/libvirt/build/tools' GEN wireshark/src/libvirt/protocol.h make[4]: Leaving directory '/builds/libvirt/libvirt/build/tools' make[3]: Leaving directory '/builds/libvirt/libvirt/build/tools' (cd docs && /usr/bin/make top_distdir=../libvirt-6.6.0 distdir=../libvirt-6.6.0/docs \ am__remove_distdir=: am__skip_length_check=: am__skip_mode_fix=: distdir) make[3]: Entering directory '/builds/libvirt/libvirt/build/docs' /usr/bin/make distdir-am make[4]: Entering directory '/builds/libvirt/libvirt/build/docs' make[4]: *** No rule to make target 'libvirt-daemon-arch.fig', needed by 'distdir-am'. Stop. make[4]: Leaving directory '/builds/libvirt/libvirt/build/docs' make[3]: *** [Makefile:1209: distdir] Error 2 make[3]: Leaving directory '/builds/libvirt/libvirt/build/docs' make[2]: *** [Makefile:912: distdir-am] Error 1 make[2]: Leaving directory '/builds/libvirt/libvirt/build' make[1]: *** [Makefile:906: distdir] Error 2 make[1]: Leaving directory '/builds/libvirt/libvirt/build' make: *** [Makefile:1010: dist] Error 2 section_end:1594390474:step_script [0K[31;1mERROR: Job failed: exit code 1 [0;m Job #633332930 ( https://gitlab.com/libvirt/libvirt/-/jobs/633332930/raw ) Stage: builds Name: x64-ubuntu-1804 Trace: /usr/bin/make dist-xz am__post_remove_distdir='@:' make[1]: Entering directory '/builds/libvirt/libvirt/build' if test -d "libvirt-6.6.0"; then find "libvirt-6.6.0" -type d ! -perm -200 -exec chmod u+w {} ';' && rm -rf "libvirt-6.6.0" || { sleep 5 && rm -rf "libvirt-6.6.0"; }; else :; fi test -d "libvirt-6.6.0" || mkdir "libvirt-6.6.0" (cd include/libvirt && /usr/bin/make top_distdir=../../libvirt-6.6.0 distdir=../../libvirt-6.6.0/include/libvirt \ am__remove_distdir=: am__skip_length_check=: am__skip_mode_fix=: distdir) make[2]: Entering directory '/builds/libvirt/libvirt/build/include/libvirt' make[2]: Leaving directory '/builds/libvirt/libvirt/build/include/libvirt' (cd src && /usr/bin/make top_distdir=../libvirt-6.6.0 distdir=../libvirt-6.6.0/src \ am__remove_distdir=: am__skip_length_check=: am__skip_mode_fix=: distdir) make[2]: Entering directory '/builds/libvirt/libvirt/build/src' GEN admin/admin_server_dispatch_stubs.h make[2]: Leaving directory '/builds/libvirt/libvirt/build/src' (cd tools && /usr/bin/make top_distdir=../libvirt-6.6.0 distdir=../libvirt-6.6.0/tools \ am__remove_distdir=: am__skip_length_check=: am__skip_mode_fix=: distdir) make[2]: Entering directory '/builds/libvirt/libvirt/build/tools' GEN wireshark/src/libvirt/protocol.h make[2]: Leaving directory '/builds/libvirt/libvirt/build/tools' (cd docs && /usr/bin/make top_distdir=../libvirt-6.6.0 distdir=../libvirt-6.6.0/docs \ am__remove_distdir=: am__skip_length_check=: am__skip_mode_fix=: distdir) make[2]: Entering directory '/builds/libvirt/libvirt/build/docs' make[2]: *** No rule to make target 'libvirt-daemon-arch.fig', needed by 'distdir'. Stop. make[2]: Leaving directory '/builds/libvirt/libvirt/build/docs' Makefile:906: recipe for target 'distdir' failed make[1]: *** [distdir] Error 1 make[1]: Leaving directory '/builds/libvirt/libvirt/build' Makefile:1007: recipe for target 'dist' failed make: *** [dist] Error 2 section_end:1594390470:step_script [0K[31;1mERROR: Job failed: exit code 1 [0;m Job #633332915 ( https://gitlab.com/libvirt/libvirt/-/jobs/633332915/raw ) Stage: builds Name: x64-centos-7 Trace: configure: Now type 'make' to compile libvirt [32;1m$ $MAKE distcheck[0;m /usr/bin/make dist-xz am__post_remove_distdir='@:' make[1]: Entering directory `/builds/libvirt/libvirt/build' if test -d "libvirt-6.6.0"; then find "libvirt-6.6.0" -type d ! -perm -200 -exec chmod u+w {} ';' && rm -rf "libvirt-6.6.0" || { sleep 5 && rm -rf "libvirt-6.6.0"; }; else :; fi test -d "libvirt-6.6.0" || mkdir "libvirt-6.6.0" (cd include/libvirt && /usr/bin/make top_distdir=../../libvirt-6.6.0 distdir=../../libvirt-6.6.0/include/libvirt \ am__remove_distdir=: am__skip_length_check=: am__skip_mode_fix=: distdir) make[2]: Entering directory `/builds/libvirt/libvirt/build/include/libvirt' make[2]: Leaving directory `/builds/libvirt/libvirt/build/include/libvirt' (cd src && /usr/bin/make top_distdir=../libvirt-6.6.0 distdir=../libvirt-6.6.0/src \ am__remove_distdir=: am__skip_length_check=: am__skip_mode_fix=: distdir) make[2]: Entering directory `/builds/libvirt/libvirt/build/src' GEN admin/admin_server_dispatch_stubs.h make[2]: Leaving directory `/builds/libvirt/libvirt/build/src' (cd tools && /usr/bin/make top_distdir=../libvirt-6.6.0 distdir=../libvirt-6.6.0/tools \ am__remove_distdir=: am__skip_length_check=: am__skip_mode_fix=: distdir) make[2]: Entering directory `/builds/libvirt/libvirt/build/tools' make[2]: Leaving directory `/builds/libvirt/libvirt/build/tools' (cd docs && /usr/bin/make top_distdir=../libvirt-6.6.0 distdir=../libvirt-6.6.0/docs \ am__remove_distdir=: am__skip_length_check=: am__skip_mode_fix=: distdir) make[2]: Entering directory `/builds/libvirt/libvirt/build/docs' make[2]: *** No rule to make target `libvirt-daemon-arch.fig', needed by `distdir'. Stop. make[2]: Leaving directory `/builds/libvirt/libvirt/build/docs' make[1]: *** [distdir] Error 1 make[1]: Leaving directory `/builds/libvirt/libvirt/build' make: *** [dist] Error 2 section_end:1594390470:step_script [0K[31;1mERROR: Job failed: exit code 1 [0;m -- You're receiving this email because of your account on gitlab.com.
participants (1)
-
GitLab