Build failed in Jenkins: libvirt-go-xml-check » libvirt-freebsd-12 #973

See <https://ci.centos.org/job/libvirt-go-xml-check/systems=libvirt-freebsd-12/973/display/redirect> ------------------------------------------ Started by upstream project "libvirt-go-xml-check" build number 973 originally caused by: Started by upstream project "libvirt-go-xml-build" build number 976 originally caused by: Started by upstream project "libvirt-build" build number 1142 originally caused by: Started by an SCM change Running as SYSTEM [EnvInject] - Loading node environment variables. Building remotely on libvirt-freebsd-12 (libvirt) in workspace <https://ci.centos.org/job/libvirt-go-xml-check/systems=libvirt-freebsd-12/ws/> [libvirt-go-xml] $ /bin/sh -xe /tmp/jenkins15383368374117587613.sh + export 'TEST_ARGS=-tags xmlroundtrip' + go test -tags xmlroundtrip --- FAIL: TestRoundTrip (15.54s) xml_test.go:374: testdata/libvirt/tests/qemuxml2argvdata/net-virtio-teaming-network.xml: /domain[0]/devices[0]/interface[0]/teaming[0]: element in expected XML missing in actual XML FAIL exit status 1 FAIL _/usr<https://ci.centos.org/job/libvirt-go-xml-check/systems=libvirt-freebsd-12/ws/> 15.698s Build step 'Execute shell' marked build as failure

See <https://ci.centos.org/job/libvirt-go-xml-check/systems=libvirt-freebsd-12/974/display/redirect> ------------------------------------------ Started by upstream project "libvirt-go-xml-check" build number 974 originally caused by: Started by upstream project "libvirt-go-xml-build" build number 977 originally caused by: Started by upstream project "libvirt-build" build number 1143 originally caused by: Started by an SCM change Running as SYSTEM [EnvInject] - Loading node environment variables. Building remotely on libvirt-freebsd-12 (libvirt) in workspace <https://ci.centos.org/job/libvirt-go-xml-check/systems=libvirt-freebsd-12/ws/> [libvirt-go-xml] $ /bin/sh -xe /tmp/jenkins9801933137304539371.sh + export 'TEST_ARGS=-tags xmlroundtrip' + go test -tags xmlroundtrip --- FAIL: TestRoundTrip (6.87s) xml_test.go:374: testdata/libvirt/tests/qemuxml2argvdata/net-virtio-teaming-network.xml: /domain[0]/devices[0]/interface[0]/teaming[0]: element in expected XML missing in actual XML FAIL exit status 1 FAIL _/usr<https://ci.centos.org/job/libvirt-go-xml-check/systems=libvirt-freebsd-12/ws/> 6.961s Build step 'Execute shell' marked build as failure

See <https://ci.centos.org/job/libvirt-go-xml-check/systems=libvirt-freebsd-12/975/display/redirect> ------------------------------------------ Started by upstream project "libvirt-go-xml-check" build number 975 originally caused by: Started by upstream project "libvirt-go-xml-build" build number 978 originally caused by: Started by upstream project "libvirt-build" build number 1144 originally caused by: Started by an SCM change Running as SYSTEM [EnvInject] - Loading node environment variables. Building remotely on libvirt-freebsd-12 (libvirt) in workspace <https://ci.centos.org/job/libvirt-go-xml-check/systems=libvirt-freebsd-12/ws/> [libvirt-go-xml] $ /bin/sh -xe /tmp/jenkins11042655724743704603.sh + export 'TEST_ARGS=-tags xmlroundtrip' + go test -tags xmlroundtrip --- FAIL: TestRoundTrip (41.23s) xml_test.go:374: testdata/libvirt/tests/qemuxml2argvdata/net-virtio-teaming-network.xml: /domain[0]/devices[0]/interface[0]/teaming[0]: element in expected XML missing in actual XML FAIL exit status 1 FAIL _/usr<https://ci.centos.org/job/libvirt-go-xml-check/systems=libvirt-freebsd-12/ws/> 41.349s Build step 'Execute shell' marked build as failure

See <https://ci.centos.org/job/libvirt-go-xml-check/systems=libvirt-freebsd-12/976/display/redirect> ------------------------------------------ Started by upstream project "libvirt-go-xml-check" build number 976 originally caused by: Started by upstream project "libvirt-go-xml-build" build number 979 originally caused by: Started by upstream project "libvirt-build" build number 1145 originally caused by: Started by an SCM change Running as SYSTEM [EnvInject] - Loading node environment variables. Building remotely on libvirt-freebsd-12 (libvirt) in workspace <https://ci.centos.org/job/libvirt-go-xml-check/systems=libvirt-freebsd-12/ws/> [libvirt-go-xml] $ /bin/sh -xe /tmp/jenkins11433601415900951655.sh + export 'TEST_ARGS=-tags xmlroundtrip' + go test -tags xmlroundtrip --- FAIL: TestRoundTrip (8.91s) xml_test.go:374: testdata/libvirt/tests/qemuxml2argvdata/net-virtio-teaming-network.xml: /domain[0]/devices[0]/interface[0]/teaming[0]: element in expected XML missing in actual XML FAIL exit status 1 FAIL _/usr<https://ci.centos.org/job/libvirt-go-xml-check/systems=libvirt-freebsd-12/ws/> 9.242s Build step 'Execute shell' marked build as failure

See <https://ci.centos.org/job/libvirt-go-xml-check/systems=libvirt-freebsd-12/977/display/redirect> ------------------------------------------ Started by upstream project "libvirt-go-xml-check" build number 977 originally caused by: Started by upstream project "libvirt-go-xml-build" build number 980 originally caused by: Started by an SCM change Running as SYSTEM [EnvInject] - Loading node environment variables. Building remotely on libvirt-freebsd-12 (libvirt) in workspace <https://ci.centos.org/job/libvirt-go-xml-check/systems=libvirt-freebsd-12/ws/> [libvirt-go-xml] $ /bin/sh -xe /tmp/jenkins4752137943195614876.sh + export 'TEST_ARGS=-tags xmlroundtrip' + go test -tags xmlroundtrip --- FAIL: TestRoundTrip (2.73s) xml_test.go:374: testdata/libvirt/tests/qemuxml2argvdata/net-virtio-teaming-network.xml: /domain[0]/devices[0]/interface[0]/teaming[0]: element in expected XML missing in actual XML FAIL exit status 1 FAIL _/usr<https://ci.centos.org/job/libvirt-go-xml-check/systems=libvirt-freebsd-12/ws/> 2.773s Build step 'Execute shell' marked build as failure

See <https://ci.centos.org/job/libvirt-go-xml-check/systems=libvirt-freebsd-12/978/display/redirect> ------------------------------------------ Started by upstream project "libvirt-go-xml-check" build number 978 originally caused by: Started by upstream project "libvirt-go-xml-build" build number 981 originally caused by: Started by upstream project "libvirt-build" build number 1146 originally caused by: Started by an SCM change Running as SYSTEM [EnvInject] - Loading node environment variables. Building remotely on libvirt-freebsd-12 (libvirt) in workspace <https://ci.centos.org/job/libvirt-go-xml-check/systems=libvirt-freebsd-12/ws/> [libvirt-go-xml] $ /bin/sh -xe /tmp/jenkins13148133247193419644.sh + export 'TEST_ARGS=-tags xmlroundtrip' + go test -tags xmlroundtrip --- FAIL: TestRoundTrip (14.25s) xml_test.go:374: testdata/libvirt/tests/qemuxml2argvdata/net-virtio-teaming-network.xml: /domain[0]/devices[0]/interface[0]/teaming[0]: element in expected XML missing in actual XML FAIL exit status 1 FAIL _/usr<https://ci.centos.org/job/libvirt-go-xml-check/systems=libvirt-freebsd-12/ws/> 14.308s Build step 'Execute shell' marked build as failure

See <https://ci.centos.org/job/libvirt-go-xml-check/systems=libvirt-freebsd-12/979/display/redirect> ------------------------------------------ Started by upstream project "libvirt-go-xml-check" build number 979 originally caused by: Started by upstream project "libvirt-go-xml-build" build number 982 originally caused by: Started by upstream project "libvirt-build" build number 1147 originally caused by: Started by an SCM change Running as SYSTEM [EnvInject] - Loading node environment variables. Building remotely on libvirt-freebsd-12 (libvirt) in workspace <https://ci.centos.org/job/libvirt-go-xml-check/systems=libvirt-freebsd-12/ws/> [libvirt-go-xml] $ /bin/sh -xe /tmp/jenkins15455937892139171456.sh + export 'TEST_ARGS=-tags xmlroundtrip' + go test -tags xmlroundtrip --- FAIL: TestRoundTrip (23.47s) xml_test.go:374: testdata/libvirt/tests/qemuxml2argvdata/net-virtio-teaming-network.xml: /domain[0]/devices[0]/interface[0]/teaming[0]: element in expected XML missing in actual XML FAIL exit status 1 FAIL _/usr<https://ci.centos.org/job/libvirt-go-xml-check/systems=libvirt-freebsd-12/ws/> 23.574s Build step 'Execute shell' marked build as failure

See <https://ci.centos.org/job/libvirt-go-xml-check/systems=libvirt-freebsd-12/980/display/redirect> ------------------------------------------ Started by upstream project "libvirt-go-xml-check" build number 980 originally caused by: Started by upstream project "libvirt-go-xml-build" build number 983 originally caused by: Started by upstream project "libvirt-build" build number 1148 originally caused by: Started by an SCM change Running as SYSTEM [EnvInject] - Loading node environment variables. Building remotely on libvirt-freebsd-12 (libvirt) in workspace <https://ci.centos.org/job/libvirt-go-xml-check/systems=libvirt-freebsd-12/ws/> [libvirt-go-xml] $ /bin/sh -xe /tmp/jenkins7068714048350937516.sh + export 'TEST_ARGS=-tags xmlroundtrip' + go test -tags xmlroundtrip --- FAIL: TestRoundTrip (7.12s) xml_test.go:374: testdata/libvirt/tests/qemuxml2argvdata/net-virtio-teaming-network.xml: /domain[0]/devices[0]/interface[0]/teaming[0]: element in expected XML missing in actual XML FAIL exit status 1 FAIL _/usr<https://ci.centos.org/job/libvirt-go-xml-check/systems=libvirt-freebsd-12/ws/> 7.218s Build step 'Execute shell' marked build as failure

See <https://ci.centos.org/job/libvirt-go-xml-check/systems=libvirt-freebsd-12/981/display/redirect> ------------------------------------------ Started by upstream project "libvirt-go-xml-check" build number 981 originally caused by: Started by upstream project "libvirt-go-xml-build" build number 984 originally caused by: Started by upstream project "libvirt-build" build number 1149 originally caused by: Started by an SCM change Running as SYSTEM [EnvInject] - Loading node environment variables. Building remotely on libvirt-freebsd-12 (libvirt) in workspace <https://ci.centos.org/job/libvirt-go-xml-check/systems=libvirt-freebsd-12/ws/> [libvirt-go-xml] $ /bin/sh -xe /tmp/jenkins15400563709703509178.sh + export 'TEST_ARGS=-tags xmlroundtrip' + go test -tags xmlroundtrip --- FAIL: TestRoundTrip (21.70s) xml_test.go:374: testdata/libvirt/tests/qemuxml2argvdata/net-virtio-teaming-network.xml: /domain[0]/devices[0]/interface[0]/teaming[0]: element in expected XML missing in actual XML FAIL exit status 1 FAIL _/usr<https://ci.centos.org/job/libvirt-go-xml-check/systems=libvirt-freebsd-12/ws/> 21.906s Build step 'Execute shell' marked build as failure

See <https://ci.centos.org/job/libvirt-go-xml-check/systems=libvirt-freebsd-12/982/display/redirect> ------------------------------------------ Started by upstream project "libvirt-go-xml-check" build number 982 originally caused by: Started by upstream project "libvirt-go-xml-build" build number 985 originally caused by: Started by upstream project "libvirt-build" build number 1151 originally caused by: Started by an SCM change Running as SYSTEM [EnvInject] - Loading node environment variables. Building remotely on libvirt-freebsd-12 (libvirt) in workspace <https://ci.centos.org/job/libvirt-go-xml-check/systems=libvirt-freebsd-12/ws/> [libvirt-go-xml] $ /bin/sh -xe /tmp/jenkins11434744483509947772.sh + export 'TEST_ARGS=-tags xmlroundtrip' + go test -tags xmlroundtrip --- FAIL: TestRoundTrip (6.74s) xml_test.go:374: testdata/libvirt/tests/qemuxml2argvdata/net-virtio-teaming-network.xml: /domain[0]/devices[0]/interface[0]/teaming[0]: element in expected XML missing in actual XML FAIL exit status 1 FAIL _/usr<https://ci.centos.org/job/libvirt-go-xml-check/systems=libvirt-freebsd-12/ws/> 6.914s Build step 'Execute shell' marked build as failure

See <https://ci.centos.org/job/libvirt-go-xml-check/systems=libvirt-freebsd-12/983/display/redirect> ------------------------------------------ Started by upstream project "libvirt-go-xml-check" build number 983 originally caused by: Started by upstream project "libvirt-go-xml-build" build number 986 originally caused by: Started by upstream project "libvirt-build" build number 1152 originally caused by: Started by an SCM change Running as SYSTEM [EnvInject] - Loading node environment variables. Building remotely on libvirt-freebsd-12 (libvirt) in workspace <https://ci.centos.org/job/libvirt-go-xml-check/systems=libvirt-freebsd-12/ws/> [libvirt-go-xml] $ /bin/sh -xe /tmp/jenkins6136324478039896614.sh + export 'TEST_ARGS=-tags xmlroundtrip' + go test -tags xmlroundtrip --- FAIL: TestRoundTrip (24.12s) xml_test.go:374: testdata/libvirt/tests/qemuxml2argvdata/net-virtio-teaming-network.xml: /domain[0]/devices[0]/interface[0]/teaming[0]: element in expected XML missing in actual XML FAIL exit status 1 FAIL _/usr<https://ci.centos.org/job/libvirt-go-xml-check/systems=libvirt-freebsd-12/ws/> 24.213s Build step 'Execute shell' marked build as failure

See <https://ci.centos.org/job/libvirt-go-xml-check/systems=libvirt-freebsd-12/984/display/redirect> ------------------------------------------ Started by upstream project "libvirt-go-xml-check" build number 984 originally caused by: Started by upstream project "libvirt-go-xml-build" build number 987 originally caused by: Started by upstream project "libvirt-build" build number 1153 originally caused by: Started by an SCM change Running as SYSTEM [EnvInject] - Loading node environment variables. Building remotely on libvirt-freebsd-12 (libvirt) in workspace <https://ci.centos.org/job/libvirt-go-xml-check/systems=libvirt-freebsd-12/ws/> [libvirt-go-xml] $ /bin/sh -xe /tmp/jenkins1636564278502276351.sh + export 'TEST_ARGS=-tags xmlroundtrip' + go test -tags xmlroundtrip --- FAIL: TestRoundTrip (38.47s) xml_test.go:374: testdata/libvirt/tests/qemuxml2argvdata/net-virtio-teaming-network.xml: /domain[0]/devices[0]/interface[0]/teaming[0]: element in expected XML missing in actual XML FAIL exit status 1 FAIL _/usr<https://ci.centos.org/job/libvirt-go-xml-check/systems=libvirt-freebsd-12/ws/> 38.581s Build step 'Execute shell' marked build as failure

See <https://ci.centos.org/job/libvirt-go-xml-check/systems=libvirt-freebsd-12/985/display/redirect> ------------------------------------------ Started by upstream project "libvirt-go-xml-check" build number 985 originally caused by: Started by upstream project "libvirt-go-xml-build" build number 988 originally caused by: Started by upstream project "libvirt-build" build number 1154 originally caused by: Started by an SCM change Running as SYSTEM [EnvInject] - Loading node environment variables. Building remotely on libvirt-freebsd-12 (libvirt) in workspace <https://ci.centos.org/job/libvirt-go-xml-check/systems=libvirt-freebsd-12/ws/> [libvirt-go-xml] $ /bin/sh -xe /tmp/jenkins309226947721931782.sh + export 'TEST_ARGS=-tags xmlroundtrip' + go test -tags xmlroundtrip --- FAIL: TestRoundTrip (11.13s) xml_test.go:374: testdata/libvirt/tests/qemuxml2argvdata/net-virtio-teaming-network.xml: /domain[0]/devices[0]/interface[0]/teaming[0]: element in expected XML missing in actual XML FAIL exit status 1 FAIL _/usr<https://ci.centos.org/job/libvirt-go-xml-check/systems=libvirt-freebsd-12/ws/> 11.306s Build step 'Execute shell' marked build as failure

See <https://ci.centos.org/job/libvirt-go-xml-check/systems=libvirt-freebsd-12/986/display/redirect> ------------------------------------------ Started by upstream project "libvirt-go-xml-check" build number 986 originally caused by: Started by upstream project "libvirt-go-xml-build" build number 989 originally caused by: Started by upstream project "libvirt-build" build number 1155 originally caused by: Started by an SCM change Running as SYSTEM [EnvInject] - Loading node environment variables. Building remotely on libvirt-freebsd-12 (libvirt) in workspace <https://ci.centos.org/job/libvirt-go-xml-check/systems=libvirt-freebsd-12/ws/> [libvirt-go-xml] $ /bin/sh -xe /tmp/jenkins1728993416788007705.sh + export 'TEST_ARGS=-tags xmlroundtrip' + go test -tags xmlroundtrip --- FAIL: TestRoundTrip (14.16s) xml_test.go:374: testdata/libvirt/tests/qemuxml2argvdata/net-virtio-teaming-network.xml: /domain[0]/devices[0]/interface[0]/teaming[0]: element in expected XML missing in actual XML FAIL exit status 1 FAIL _/usr<https://ci.centos.org/job/libvirt-go-xml-check/systems=libvirt-freebsd-12/ws/> 14.256s Build step 'Execute shell' marked build as failure

See <https://ci.centos.org/job/libvirt-go-xml-check/systems=libvirt-freebsd-12/987/display/redirect> ------------------------------------------ Started by upstream project "libvirt-go-xml-check" build number 987 originally caused by: Started by upstream project "libvirt-go-xml-build" build number 990 originally caused by: Started by upstream project "libvirt-build" build number 1156 originally caused by: Started by an SCM change Started by an SCM change Started by an SCM change Started by an SCM change Running as SYSTEM [EnvInject] - Loading node environment variables. Building remotely on libvirt-freebsd-12 (libvirt) in workspace <https://ci.centos.org/job/libvirt-go-xml-check/systems=libvirt-freebsd-12/ws/> [libvirt-go-xml] $ /bin/sh -xe /tmp/jenkins4547318134264712458.sh + export 'TEST_ARGS=-tags xmlroundtrip' + go test -tags xmlroundtrip --- FAIL: TestRoundTrip (5.75s) xml_test.go:374: testdata/libvirt/tests/qemuxml2argvdata/net-virtio-teaming-network.xml: /domain[0]/devices[0]/interface[0]/teaming[0]: element in expected XML missing in actual XML FAIL exit status 1 FAIL _/usr<https://ci.centos.org/job/libvirt-go-xml-check/systems=libvirt-freebsd-12/ws/> 6.031s Build step 'Execute shell' marked build as failure

See <https://ci.centos.org/job/libvirt-go-xml-check/systems=libvirt-freebsd-12/988/display/redirect> ------------------------------------------ Started by upstream project "libvirt-go-xml-check" build number 988 originally caused by: Started by upstream project "libvirt-go-xml-build" build number 991 originally caused by: Started by upstream project "libvirt-build" build number 1157 originally caused by: Started by an SCM change Running as SYSTEM [EnvInject] - Loading node environment variables. Building remotely on libvirt-freebsd-12 (libvirt) in workspace <https://ci.centos.org/job/libvirt-go-xml-check/systems=libvirt-freebsd-12/ws/> [libvirt-go-xml] $ /bin/sh -xe /tmp/jenkins5885985014711034134.sh + export 'TEST_ARGS=-tags xmlroundtrip' + go test -tags xmlroundtrip --- FAIL: TestRoundTrip (42.99s) xml_test.go:374: testdata/libvirt/tests/qemuxml2argvdata/net-virtio-teaming-network.xml: /domain[0]/devices[0]/interface[0]/teaming[0]: element in expected XML missing in actual XML FAIL exit status 1 FAIL _/usr<https://ci.centos.org/job/libvirt-go-xml-check/systems=libvirt-freebsd-12/ws/> 43.223s Build step 'Execute shell' marked build as failure

See <https://ci.centos.org/job/libvirt-go-xml-check/systems=libvirt-freebsd-12/989/display/redirect> ------------------------------------------ Started by upstream project "libvirt-go-xml-check" build number 989 originally caused by: Started by upstream project "libvirt-go-xml-build" build number 992 originally caused by: Started by upstream project "libvirt-build" build number 1158 originally caused by: Started by an SCM change Running as SYSTEM [EnvInject] - Loading node environment variables. Building remotely on libvirt-freebsd-12 (libvirt) in workspace <https://ci.centos.org/job/libvirt-go-xml-check/systems=libvirt-freebsd-12/ws/> [libvirt-go-xml] $ /bin/sh -xe /tmp/jenkins14069122055786006784.sh + export 'TEST_ARGS=-tags xmlroundtrip' + go test -tags xmlroundtrip --- FAIL: TestRoundTrip (7.10s) xml_test.go:374: testdata/libvirt/tests/qemuxml2argvdata/net-virtio-teaming-network.xml: /domain[0]/devices[0]/interface[0]/teaming[0]: element in expected XML missing in actual XML FAIL exit status 1 FAIL _/usr<https://ci.centos.org/job/libvirt-go-xml-check/systems=libvirt-freebsd-12/ws/> 7.230s Build step 'Execute shell' marked build as failure

See <https://ci.centos.org/job/libvirt-go-xml-check/systems=libvirt-freebsd-12/990/display/redirect> ------------------------------------------ Started by upstream project "libvirt-go-xml-check" build number 990 originally caused by: Started by upstream project "libvirt-go-xml-build" build number 993 originally caused by: Started by upstream project "libvirt-build" build number 1159 originally caused by: Started by an SCM change Started by an SCM change Started by an SCM change Started by an SCM change Started by an SCM change Started by an SCM change Started by an SCM change Running as SYSTEM [EnvInject] - Loading node environment variables. Building remotely on libvirt-freebsd-12 (libvirt) in workspace <https://ci.centos.org/job/libvirt-go-xml-check/systems=libvirt-freebsd-12/ws/> [libvirt-go-xml] $ /bin/sh -xe /tmp/jenkins9812481686387199349.sh + export 'TEST_ARGS=-tags xmlroundtrip' + go test -tags xmlroundtrip --- FAIL: TestRoundTrip (7.34s) xml_test.go:374: testdata/libvirt/tests/qemuxml2argvdata/net-virtio-teaming-network.xml: /domain[0]/devices[0]/interface[0]/teaming[0]: element in expected XML missing in actual XML FAIL exit status 1 FAIL _/usr<https://ci.centos.org/job/libvirt-go-xml-check/systems=libvirt-freebsd-12/ws/> 7.394s Build step 'Execute shell' marked build as failure

See <https://ci.centos.org/job/libvirt-go-xml-check/systems=libvirt-freebsd-12/991/display/redirect> ------------------------------------------ Started by upstream project "libvirt-go-xml-check" build number 991 originally caused by: Started by upstream project "libvirt-go-xml-build" build number 994 originally caused by: Started by upstream project "libvirt-build" build number 1160 originally caused by: Started by an SCM change Running as SYSTEM [EnvInject] - Loading node environment variables. Building remotely on libvirt-freebsd-12 (libvirt) in workspace <https://ci.centos.org/job/libvirt-go-xml-check/systems=libvirt-freebsd-12/ws/> [libvirt-go-xml] $ /bin/sh -xe /tmp/jenkins12168932251287949693.sh + export 'TEST_ARGS=-tags xmlroundtrip' + go test -tags xmlroundtrip --- FAIL: TestRoundTrip (16.07s) xml_test.go:374: testdata/libvirt/tests/qemuxml2argvdata/net-virtio-teaming-network.xml: /domain[0]/devices[0]/interface[0]/teaming[0]: element in expected XML missing in actual XML FAIL exit status 1 FAIL _/usr<https://ci.centos.org/job/libvirt-go-xml-check/systems=libvirt-freebsd-12/ws/> 16.209s Build step 'Execute shell' marked build as failure

See <https://ci.centos.org/job/libvirt-go-xml-check/systems=libvirt-freebsd-12/992/display/redirect> ------------------------------------------ Started by upstream project "libvirt-go-xml-check" build number 992 originally caused by: Started by upstream project "libvirt-go-xml-build" build number 995 originally caused by: Started by upstream project "libvirt-build" build number 1161 originally caused by: Started by an SCM change Started by an SCM change Started by an SCM change Running as SYSTEM [EnvInject] - Loading node environment variables. Building remotely on libvirt-freebsd-12 (libvirt) in workspace <https://ci.centos.org/job/libvirt-go-xml-check/systems=libvirt-freebsd-12/ws/> [libvirt-go-xml] $ /bin/sh -xe /tmp/jenkins699081855935875771.sh + export 'TEST_ARGS=-tags xmlroundtrip' + go test -tags xmlroundtrip --- FAIL: TestRoundTrip (6.76s) xml_test.go:374: testdata/libvirt/tests/qemuxml2argvdata/net-virtio-teaming-network.xml: /domain[0]/devices[0]/interface[0]/teaming[0]: element in expected XML missing in actual XML FAIL exit status 1 FAIL _/usr<https://ci.centos.org/job/libvirt-go-xml-check/systems=libvirt-freebsd-12/ws/> 6.875s Build step 'Execute shell' marked build as failure

See <https://ci.centos.org/job/libvirt-go-xml-check/systems=libvirt-freebsd-12/993/display/redirect> ------------------------------------------ Started by upstream project "libvirt-go-xml-check" build number 993 originally caused by: Started by upstream project "libvirt-go-xml-build" build number 996 originally caused by: Started by upstream project "libvirt-build" build number 1162 originally caused by: Started by an SCM change Running as SYSTEM [EnvInject] - Loading node environment variables. Building remotely on libvirt-freebsd-12 (libvirt) in workspace <https://ci.centos.org/job/libvirt-go-xml-check/systems=libvirt-freebsd-12/ws/> [libvirt-go-xml] $ /bin/sh -xe /tmp/jenkins5654880895702232595.sh + export 'TEST_ARGS=-tags xmlroundtrip' + go test -tags xmlroundtrip --- FAIL: TestRoundTrip (6.86s) xml_test.go:374: testdata/libvirt/tests/qemuxml2argvdata/net-virtio-teaming-network.xml: /domain[0]/devices[0]/interface[0]/teaming[0]: element in expected XML missing in actual XML FAIL exit status 1 FAIL _/usr<https://ci.centos.org/job/libvirt-go-xml-check/systems=libvirt-freebsd-12/ws/> 6.987s Build step 'Execute shell' marked build as failure

See <https://ci.centos.org/job/libvirt-go-xml-check/systems=libvirt-freebsd-12/994/display/redirect> ------------------------------------------ Started by upstream project "libvirt-go-xml-check" build number 994 originally caused by: Started by upstream project "libvirt-go-xml-build" build number 997 originally caused by: Started by upstream project "libvirt-build" build number 1163 originally caused by: Started by an SCM change Running as SYSTEM [EnvInject] - Loading node environment variables. Building remotely on libvirt-freebsd-12 (libvirt) in workspace <https://ci.centos.org/job/libvirt-go-xml-check/systems=libvirt-freebsd-12/ws/> [libvirt-go-xml] $ /bin/sh -xe /tmp/jenkins11914662459530964787.sh + export 'TEST_ARGS=-tags xmlroundtrip' + go test -tags xmlroundtrip --- FAIL: TestRoundTrip (8.39s) xml_test.go:374: testdata/libvirt/tests/qemuxml2argvdata/net-virtio-teaming-network.xml: /domain[0]/devices[0]/interface[0]/teaming[0]: element in expected XML missing in actual XML FAIL exit status 1 FAIL _/usr<https://ci.centos.org/job/libvirt-go-xml-check/systems=libvirt-freebsd-12/ws/> 8.473s Build step 'Execute shell' marked build as failure

See <https://ci.centos.org/job/libvirt-go-xml-check/systems=libvirt-freebsd-12/995/display/redirect> ------------------------------------------ Started by upstream project "libvirt-go-xml-check" build number 995 originally caused by: Started by upstream project "libvirt-go-xml-build" build number 998 originally caused by: Started by upstream project "libvirt-build" build number 1164 originally caused by: Started by an SCM change Running as SYSTEM [EnvInject] - Loading node environment variables. Building remotely on libvirt-freebsd-12 (libvirt) in workspace <https://ci.centos.org/job/libvirt-go-xml-check/systems=libvirt-freebsd-12/ws/> [libvirt-go-xml] $ /bin/sh -xe /tmp/jenkins2464807263795391949.sh + export 'TEST_ARGS=-tags xmlroundtrip' + go test -tags xmlroundtrip --- FAIL: TestRoundTrip (22.18s) xml_test.go:374: testdata/libvirt/tests/qemuxml2argvdata/net-virtio-teaming-network.xml: /domain[0]/devices[0]/interface[0]/teaming[0]: element in expected XML missing in actual XML FAIL exit status 1 FAIL _/usr<https://ci.centos.org/job/libvirt-go-xml-check/systems=libvirt-freebsd-12/ws/> 22.299s Build step 'Execute shell' marked build as failure

See <https://ci.centos.org/job/libvirt-go-xml-check/systems=libvirt-freebsd-12/996/display/redirect> ------------------------------------------ Started by upstream project "libvirt-go-xml-check" build number 996 originally caused by: Started by upstream project "libvirt-go-xml-build" build number 999 originally caused by: Started by upstream project "libvirt-build" build number 1165 originally caused by: Started by an SCM change Running as SYSTEM [EnvInject] - Loading node environment variables. Building remotely on libvirt-freebsd-12 (libvirt) in workspace <https://ci.centos.org/job/libvirt-go-xml-check/systems=libvirt-freebsd-12/ws/> [libvirt-go-xml] $ /bin/sh -xe /tmp/jenkins13630894159123082128.sh + export 'TEST_ARGS=-tags xmlroundtrip' + go test -tags xmlroundtrip --- FAIL: TestRoundTrip (6.78s) xml_test.go:374: testdata/libvirt/tests/qemuxml2argvdata/net-virtio-teaming-network.xml: /domain[0]/devices[0]/interface[0]/teaming[0]: element in expected XML missing in actual XML FAIL exit status 1 FAIL _/usr<https://ci.centos.org/job/libvirt-go-xml-check/systems=libvirt-freebsd-12/ws/> 6.834s Build step 'Execute shell' marked build as failure

See <https://ci.centos.org/job/libvirt-go-xml-check/systems=libvirt-freebsd-12/997/display/redirect> ------------------------------------------ Started by upstream project "libvirt-go-xml-check" build number 997 originally caused by: Started by upstream project "libvirt-go-xml-build" build number 1000 originally caused by: Started by upstream project "libvirt-build" build number 1166 originally caused by: Started by an SCM change Running as SYSTEM [EnvInject] - Loading node environment variables. Building remotely on libvirt-freebsd-12 (libvirt) in workspace <https://ci.centos.org/job/libvirt-go-xml-check/systems=libvirt-freebsd-12/ws/> [libvirt-go-xml] $ /bin/sh -xe /tmp/jenkins3576548654272385215.sh + export 'TEST_ARGS=-tags xmlroundtrip' + go test -tags xmlroundtrip --- FAIL: TestRoundTrip (15.97s) xml_test.go:374: testdata/libvirt/tests/qemuxml2argvdata/net-virtio-teaming-network.xml: /domain[0]/devices[0]/interface[0]/teaming[0]: element in expected XML missing in actual XML FAIL exit status 1 FAIL _/usr<https://ci.centos.org/job/libvirt-go-xml-check/systems=libvirt-freebsd-12/ws/> 16.116s Build step 'Execute shell' marked build as failure

See <https://ci.centos.org/job/libvirt-go-xml-check/systems=libvirt-freebsd-12/998/display/redirect> ------------------------------------------ Started by upstream project "libvirt-go-xml-check" build number 998 originally caused by: Started by upstream project "libvirt-go-xml-build" build number 1001 originally caused by: Started by upstream project "libvirt-build" build number 1167 originally caused by: Started by an SCM change Running as SYSTEM [EnvInject] - Loading node environment variables. Building remotely on libvirt-freebsd-12 (libvirt) in workspace <https://ci.centos.org/job/libvirt-go-xml-check/systems=libvirt-freebsd-12/ws/> [libvirt-go-xml] $ /bin/sh -xe /tmp/jenkins15225331788364042649.sh + export 'TEST_ARGS=-tags xmlroundtrip' + go test -tags xmlroundtrip --- FAIL: TestRoundTrip (18.56s) xml_test.go:374: testdata/libvirt/tests/qemuxml2argvdata/net-virtio-teaming-network.xml: /domain[0]/devices[0]/interface[0]/teaming[0]: element in expected XML missing in actual XML FAIL exit status 1 FAIL _/usr<https://ci.centos.org/job/libvirt-go-xml-check/systems=libvirt-freebsd-12/ws/> 18.821s Build step 'Execute shell' marked build as failure

See <https://ci.centos.org/job/libvirt-go-xml-check/systems=libvirt-freebsd-12/999/display/redirect> ------------------------------------------ Started by upstream project "libvirt-go-xml-check" build number 999 originally caused by: Started by upstream project "libvirt-go-xml-build" build number 1002 originally caused by: Started by upstream project "libvirt-build" build number 1168 originally caused by: Started by an SCM change Running as SYSTEM [EnvInject] - Loading node environment variables. Building remotely on libvirt-freebsd-12 (libvirt) in workspace <https://ci.centos.org/job/libvirt-go-xml-check/systems=libvirt-freebsd-12/ws/> [libvirt-go-xml] $ /bin/sh -xe /tmp/jenkins17894746321898081741.sh + export 'TEST_ARGS=-tags xmlroundtrip' + go test -tags xmlroundtrip --- FAIL: TestRoundTrip (20.97s) xml_test.go:374: testdata/libvirt/tests/qemuxml2argvdata/net-virtio-teaming-network.xml: /domain[0]/devices[0]/interface[0]/teaming[0]: element in expected XML missing in actual XML FAIL exit status 1 FAIL _/usr<https://ci.centos.org/job/libvirt-go-xml-check/systems=libvirt-freebsd-12/ws/> 21.075s Build step 'Execute shell' marked build as failure

See <https://ci.centos.org/job/libvirt-go-xml-check/systems=libvirt-freebsd-12/1000/display/redirect> ------------------------------------------ Started by upstream project "libvirt-go-xml-check" build number 1000 originally caused by: Started by upstream project "libvirt-go-xml-build" build number 1003 originally caused by: Started by upstream project "libvirt-build" build number 1169 originally caused by: Started by an SCM change Started by an SCM change Started by an SCM change Running as SYSTEM [EnvInject] - Loading node environment variables. Building remotely on libvirt-freebsd-12 (libvirt) in workspace <https://ci.centos.org/job/libvirt-go-xml-check/systems=libvirt-freebsd-12/ws/> [libvirt-go-xml] $ /bin/sh -xe /tmp/jenkins2423414012933811813.sh + export 'TEST_ARGS=-tags xmlroundtrip' + go test -tags xmlroundtrip --- FAIL: TestRoundTrip (6.30s) xml_test.go:374: testdata/libvirt/tests/qemuxml2argvdata/net-virtio-teaming-network.xml: /domain[0]/devices[0]/interface[0]/teaming[0]: element in expected XML missing in actual XML FAIL exit status 1 FAIL _/usr<https://ci.centos.org/job/libvirt-go-xml-check/systems=libvirt-freebsd-12/ws/> 6.377s Build step 'Execute shell' marked build as failure

See <https://ci.centos.org/job/libvirt-go-xml-check/systems=libvirt-freebsd-12/1001/display/redirect> ------------------------------------------ Started by upstream project "libvirt-go-xml-check" build number 1001 originally caused by: Started by upstream project "libvirt-go-xml-build" build number 1004 originally caused by: Started by upstream project "libvirt-build" build number 1170 originally caused by: Started by an SCM change Running as SYSTEM [EnvInject] - Loading node environment variables. Building remotely on libvirt-freebsd-12 (libvirt) in workspace <https://ci.centos.org/job/libvirt-go-xml-check/systems=libvirt-freebsd-12/ws/> [libvirt-go-xml] $ /bin/sh -xe /tmp/jenkins3844672181574205653.sh + export 'TEST_ARGS=-tags xmlroundtrip' + go test -tags xmlroundtrip --- FAIL: TestRoundTrip (12.75s) xml_test.go:374: testdata/libvirt/tests/qemuxml2argvdata/net-virtio-teaming-network.xml: /domain[0]/devices[0]/interface[0]/teaming[0]: element in expected XML missing in actual XML FAIL exit status 1 FAIL _/usr<https://ci.centos.org/job/libvirt-go-xml-check/systems=libvirt-freebsd-12/ws/> 12.859s Build step 'Execute shell' marked build as failure

participants (1)
-
ci@centos.org