[Libvirt-ci] Build failed in Jenkins: libvirt-go-xml-check » libvirt-fedora-30 #491

See <https://ci.centos.org/job/libvirt-go-xml-check/systems=libvirt-fedora-30/491/display/redirect> ------------------------------------------ Started by upstream project "libvirt-go-xml-check" build number 491 originally caused by: Started by upstream project "libvirt-go-xml-build" build number 493 originally caused by: Started by upstream project "libvirt-build" build number 580 originally caused by: Started by an SCM change [EnvInject] - Loading node environment variables. Building remotely on libvirt-fedora-30 (libvirt) in workspace <https://ci.centos.org/job/libvirt-go-xml-check/systems=libvirt-fedora-30/ws/> [libvirt-go-xml] $ /bin/sh -xe /tmp/jenkins6884625447527669183.sh + export 'TEST_ARGS=-tags xmlroundtrip' + TEST_ARGS='-tags xmlroundtrip' + go test -tags xmlroundtrip --- FAIL: TestRoundTrip (19.87s) xml_test.go:394: testdata/libvirt/tests/qemuxml2argvdata/net-virtio-network-portgroup.xml: /domain[0]/devices[0]/interface[0]/source[0]/@portid: attribute '873be5a0-6b8a-4a0b-a1df-ef3659cd64bc' in expected XML missing in actual XML FAIL exit status 1 FAIL _<https://ci.centos.org/job/libvirt-go-xml-check/systems=libvirt-fedora-30/ws/> 20.030s Build step 'Execute shell' marked build as failure

See <https://ci.centos.org/job/libvirt-go-xml-check/systems=libvirt-fedora-30/492/display/redirect> ------------------------------------------ Started by upstream project "libvirt-go-xml-check" build number 492 originally caused by: Started by upstream project "libvirt-go-xml-build" build number 494 originally caused by: Started by upstream project "libvirt-build" build number 581 originally caused by: Started by an SCM change Started by an SCM change Started by an SCM change Started by an SCM change Started by an SCM change Started by an SCM change Started by an SCM change [EnvInject] - Loading node environment variables. Building remotely on libvirt-fedora-30 (libvirt) in workspace <https://ci.centos.org/job/libvirt-go-xml-check/systems=libvirt-fedora-30/ws/> [libvirt-go-xml] $ /bin/sh -xe /tmp/jenkins7124661089419527528.sh + export 'TEST_ARGS=-tags xmlroundtrip' + TEST_ARGS='-tags xmlroundtrip' + go test -tags xmlroundtrip --- FAIL: TestRoundTrip (10.57s) xml_test.go:394: testdata/libvirt/tests/qemuxml2argvdata/net-virtio-network-portgroup.xml: /domain[0]/devices[0]/interface[0]/source[0]/@portid: attribute '873be5a0-6b8a-4a0b-a1df-ef3659cd64bc' in expected XML missing in actual XML FAIL exit status 1 FAIL _<https://ci.centos.org/job/libvirt-go-xml-check/systems=libvirt-fedora-30/ws/> 10.700s Build step 'Execute shell' marked build as failure

See <https://ci.centos.org/job/libvirt-go-xml-check/systems=libvirt-fedora-30/493/display/redirect> ------------------------------------------ Started by upstream project "libvirt-go-xml-check" build number 493 originally caused by: Started by upstream project "libvirt-go-xml-build" build number 495 originally caused by: Started by upstream project "libvirt-build" build number 582 originally caused by: Started by an SCM change [EnvInject] - Loading node environment variables. Building remotely on libvirt-fedora-30 (libvirt) in workspace <https://ci.centos.org/job/libvirt-go-xml-check/systems=libvirt-fedora-30/ws/> [libvirt-go-xml] $ /bin/sh -xe /tmp/jenkins417893793978223286.sh + export 'TEST_ARGS=-tags xmlroundtrip' + TEST_ARGS='-tags xmlroundtrip' + go test -tags xmlroundtrip --- FAIL: TestRoundTrip (18.01s) xml_test.go:394: testdata/libvirt/tests/qemuxml2argvdata/net-virtio-network-portgroup.xml: /domain[0]/devices[0]/interface[0]/source[0]/@portid: attribute '873be5a0-6b8a-4a0b-a1df-ef3659cd64bc' in expected XML missing in actual XML FAIL exit status 1 FAIL _<https://ci.centos.org/job/libvirt-go-xml-check/systems=libvirt-fedora-30/ws/> 18.167s Build step 'Execute shell' marked build as failure

See <https://ci.centos.org/job/libvirt-go-xml-check/systems=libvirt-fedora-30/494/display/redirect> ------------------------------------------ Started by upstream project "libvirt-go-xml-check" build number 494 originally caused by: Started by upstream project "libvirt-go-xml-build" build number 496 originally caused by: Started by upstream project "libvirt-build" build number 583 originally caused by: Started by an SCM change [EnvInject] - Loading node environment variables. Building remotely on libvirt-fedora-30 (libvirt) in workspace <https://ci.centos.org/job/libvirt-go-xml-check/systems=libvirt-fedora-30/ws/> [libvirt-go-xml] $ /bin/sh -xe /tmp/jenkins831174294248488084.sh + export 'TEST_ARGS=-tags xmlroundtrip' + TEST_ARGS='-tags xmlroundtrip' + go test -tags xmlroundtrip --- FAIL: TestRoundTrip (15.44s) xml_test.go:394: testdata/libvirt/tests/qemuxml2argvdata/net-virtio-network-portgroup.xml: /domain[0]/devices[0]/interface[0]/source[0]/@portid: attribute '873be5a0-6b8a-4a0b-a1df-ef3659cd64bc' in expected XML missing in actual XML FAIL exit status 1 FAIL _<https://ci.centos.org/job/libvirt-go-xml-check/systems=libvirt-fedora-30/ws/> 15.580s Build step 'Execute shell' marked build as failure

See <https://ci.centos.org/job/libvirt-go-xml-check/systems=libvirt-fedora-30/495/display/redirect> ------------------------------------------ Started by upstream project "libvirt-go-xml-check" build number 495 originally caused by: Started by upstream project "libvirt-go-xml-build" build number 497 originally caused by: Started by upstream project "libvirt-build" build number 584 originally caused by: Started by an SCM change [EnvInject] - Loading node environment variables. Building remotely on libvirt-fedora-30 (libvirt) in workspace <https://ci.centos.org/job/libvirt-go-xml-check/systems=libvirt-fedora-30/ws/> [libvirt-go-xml] $ /bin/sh -xe /tmp/jenkins4954752211441548981.sh + export 'TEST_ARGS=-tags xmlroundtrip' + TEST_ARGS='-tags xmlroundtrip' + go test -tags xmlroundtrip --- FAIL: TestRoundTrip (17.08s) xml_test.go:394: testdata/libvirt/tests/qemuxml2argvdata/net-virtio-network-portgroup.xml: /domain[0]/devices[0]/interface[0]/source[0]/@portid: attribute '873be5a0-6b8a-4a0b-a1df-ef3659cd64bc' in expected XML missing in actual XML FAIL exit status 1 FAIL _<https://ci.centos.org/job/libvirt-go-xml-check/systems=libvirt-fedora-30/ws/> 17.201s Build step 'Execute shell' marked build as failure

See <https://ci.centos.org/job/libvirt-go-xml-check/systems=libvirt-fedora-30/496/display/redirect> ------------------------------------------ Started by upstream project "libvirt-go-xml-check" build number 496 originally caused by: Started by upstream project "libvirt-go-xml-build" build number 498 originally caused by: Started by upstream project "libvirt-build" build number 586 originally caused by: Started by an SCM change [EnvInject] - Loading node environment variables. Building remotely on libvirt-fedora-30 (libvirt) in workspace <https://ci.centos.org/job/libvirt-go-xml-check/systems=libvirt-fedora-30/ws/> [libvirt-go-xml] $ /bin/sh -xe /tmp/jenkins5622438142204876279.sh + export 'TEST_ARGS=-tags xmlroundtrip' + TEST_ARGS='-tags xmlroundtrip' + go test -tags xmlroundtrip --- FAIL: TestRoundTrip (15.46s) xml_test.go:394: testdata/libvirt/tests/qemuxml2argvdata/net-virtio-network-portgroup.xml: /domain[0]/devices[0]/interface[0]/source[0]/@portid: attribute '873be5a0-6b8a-4a0b-a1df-ef3659cd64bc' in expected XML missing in actual XML FAIL exit status 1 FAIL _<https://ci.centos.org/job/libvirt-go-xml-check/systems=libvirt-fedora-30/ws/> 15.514s Build step 'Execute shell' marked build as failure

See <https://ci.centos.org/job/libvirt-go-xml-check/systems=libvirt-fedora-30/497/display/redirect> ------------------------------------------ Started by upstream project "libvirt-go-xml-check" build number 497 originally caused by: Started by upstream project "libvirt-go-xml-build" build number 499 originally caused by: Started by upstream project "libvirt-build" build number 587 originally caused by: Started by an SCM change Started by an SCM change Started by an SCM change Started by an SCM change Started by an SCM change [EnvInject] - Loading node environment variables. Building remotely on libvirt-fedora-30 (libvirt) in workspace <https://ci.centos.org/job/libvirt-go-xml-check/systems=libvirt-fedora-30/ws/> [libvirt-go-xml] $ /bin/sh -xe /tmp/jenkins2633152374760574409.sh + export 'TEST_ARGS=-tags xmlroundtrip' + TEST_ARGS='-tags xmlroundtrip' + go test -tags xmlroundtrip --- FAIL: TestRoundTrip (5.33s) xml_test.go:394: testdata/libvirt/tests/qemuxml2argvdata/net-virtio-network-portgroup.xml: /domain[0]/devices[0]/interface[0]/source[0]/@portid: attribute '873be5a0-6b8a-4a0b-a1df-ef3659cd64bc' in expected XML missing in actual XML FAIL exit status 1 FAIL _<https://ci.centos.org/job/libvirt-go-xml-check/systems=libvirt-fedora-30/ws/> 5.365s Build step 'Execute shell' marked build as failure

See <https://ci.centos.org/job/libvirt-go-xml-check/systems=libvirt-fedora-30/498/display/redirect> ------------------------------------------ Started by upstream project "libvirt-go-xml-check" build number 498 originally caused by: Started by upstream project "libvirt-go-xml-build" build number 500 originally caused by: Started by upstream project "libvirt-build" build number 588 originally caused by: Started by an SCM change Started by an SCM change Started by an SCM change Started by an SCM change Started by an SCM change Started by an SCM change Started by an SCM change Started by an SCM change [EnvInject] - Loading node environment variables. Building remotely on libvirt-fedora-30 (libvirt) in workspace <https://ci.centos.org/job/libvirt-go-xml-check/systems=libvirt-fedora-30/ws/> [libvirt-go-xml] $ /bin/sh -xe /tmp/jenkins2146708127593657400.sh + export 'TEST_ARGS=-tags xmlroundtrip' + TEST_ARGS='-tags xmlroundtrip' + go test -tags xmlroundtrip --- FAIL: TestRoundTrip (14.82s) xml_test.go:394: testdata/libvirt/tests/qemuxml2argvdata/net-virtio-network-portgroup.xml: /domain[0]/devices[0]/interface[0]/source[0]/@portid: attribute '873be5a0-6b8a-4a0b-a1df-ef3659cd64bc' in expected XML missing in actual XML FAIL exit status 1 FAIL _<https://ci.centos.org/job/libvirt-go-xml-check/systems=libvirt-fedora-30/ws/> 14.883s Build step 'Execute shell' marked build as failure

See <https://ci.centos.org/job/libvirt-go-xml-check/systems=libvirt-fedora-30/499/display/redirect> ------------------------------------------ Started by upstream project "libvirt-go-xml-check" build number 499 originally caused by: Started by upstream project "libvirt-go-xml-build" build number 501 originally caused by: Started by upstream project "libvirt-build" build number 589 originally caused by: Started by an SCM change Started by an SCM change Started by an SCM change Started by an SCM change Started by an SCM change Started by an SCM change Started by an SCM change Started by an SCM change [EnvInject] - Loading node environment variables. Building remotely on libvirt-fedora-30 (libvirt) in workspace <https://ci.centos.org/job/libvirt-go-xml-check/systems=libvirt-fedora-30/ws/> [libvirt-go-xml] $ /bin/sh -xe /tmp/jenkins8918395137104714007.sh + export 'TEST_ARGS=-tags xmlroundtrip' + TEST_ARGS='-tags xmlroundtrip' + go test -tags xmlroundtrip --- FAIL: TestRoundTrip (14.53s) xml_test.go:394: testdata/libvirt/tests/qemuxml2argvdata/net-virtio-network-portgroup.xml: /domain[0]/devices[0]/interface[0]/source[0]/@portid: attribute '873be5a0-6b8a-4a0b-a1df-ef3659cd64bc' in expected XML missing in actual XML FAIL exit status 1 FAIL _<https://ci.centos.org/job/libvirt-go-xml-check/systems=libvirt-fedora-30/ws/> 14.633s Build step 'Execute shell' marked build as failure

See <https://ci.centos.org/job/libvirt-go-xml-check/systems=libvirt-fedora-30/500/display/redirect> ------------------------------------------ Started by upstream project "libvirt-go-xml-check" build number 500 originally caused by: Started by upstream project "libvirt-go-xml-build" build number 502 originally caused by: Started by upstream project "libvirt-build" build number 590 originally caused by: Started by an SCM change [EnvInject] - Loading node environment variables. Building remotely on libvirt-fedora-30 (libvirt) in workspace <https://ci.centos.org/job/libvirt-go-xml-check/systems=libvirt-fedora-30/ws/> [libvirt-go-xml] $ /bin/sh -xe /tmp/jenkins986870370756421372.sh + export 'TEST_ARGS=-tags xmlroundtrip' + TEST_ARGS='-tags xmlroundtrip' + go test -tags xmlroundtrip --- FAIL: TestRoundTrip (18.85s) xml_test.go:394: testdata/libvirt/tests/qemuxml2argvdata/net-virtio-network-portgroup.xml: /domain[0]/devices[0]/interface[0]/source[0]/@portid: attribute '873be5a0-6b8a-4a0b-a1df-ef3659cd64bc' in expected XML missing in actual XML FAIL exit status 1 FAIL _<https://ci.centos.org/job/libvirt-go-xml-check/systems=libvirt-fedora-30/ws/> 18.912s Build step 'Execute shell' marked build as failure

See <https://ci.centos.org/job/libvirt-go-xml-check/systems=libvirt-fedora-30/501/display/redirect> ------------------------------------------ Started by upstream project "libvirt-go-xml-check" build number 501 originally caused by: Started by upstream project "libvirt-go-xml-build" build number 503 originally caused by: Started by upstream project "libvirt-build" build number 591 originally caused by: Started by an SCM change [EnvInject] - Loading node environment variables. Building remotely on libvirt-fedora-30 (libvirt) in workspace <https://ci.centos.org/job/libvirt-go-xml-check/systems=libvirt-fedora-30/ws/> [libvirt-go-xml] $ /bin/sh -xe /tmp/jenkins5481092330896747748.sh + export 'TEST_ARGS=-tags xmlroundtrip' + TEST_ARGS='-tags xmlroundtrip' + go test -tags xmlroundtrip --- FAIL: TestRoundTrip (8.09s) xml_test.go:394: testdata/libvirt/tests/qemuxml2argvdata/net-virtio-network-portgroup.xml: /domain[0]/devices[0]/interface[0]/source[0]/@portid: attribute '873be5a0-6b8a-4a0b-a1df-ef3659cd64bc' in expected XML missing in actual XML FAIL exit status 1 FAIL _<https://ci.centos.org/job/libvirt-go-xml-check/systems=libvirt-fedora-30/ws/> 8.128s Build step 'Execute shell' marked build as failure

See <https://ci.centos.org/job/libvirt-go-xml-check/systems=libvirt-fedora-30/502/display/redirect> ------------------------------------------ Started by upstream project "libvirt-go-xml-check" build number 502 originally caused by: Started by upstream project "libvirt-go-xml-build" build number 504 originally caused by: Started by upstream project "libvirt-build" build number 592 originally caused by: Started by an SCM change Started by an SCM change Started by an SCM change Started by an SCM change Started by an SCM change Started by an SCM change [EnvInject] - Loading node environment variables. Building remotely on libvirt-fedora-30 (libvirt) in workspace <https://ci.centos.org/job/libvirt-go-xml-check/systems=libvirt-fedora-30/ws/> [libvirt-go-xml] $ /bin/sh -xe /tmp/jenkins4500918778848724618.sh + export 'TEST_ARGS=-tags xmlroundtrip' + TEST_ARGS='-tags xmlroundtrip' + go test -tags xmlroundtrip --- FAIL: TestRoundTrip (14.22s) xml_test.go:433: open testdata/libvirt/tests/qemuargv2xmldata: no such file or directory FAIL exit status 1 FAIL _<https://ci.centos.org/job/libvirt-go-xml-check/systems=libvirt-fedora-30/ws/> 14.333s Build step 'Execute shell' marked build as failure

See <https://ci.centos.org/job/libvirt-go-xml-check/systems=libvirt-fedora-30/503/display/redirect> ------------------------------------------ Started by upstream project "libvirt-go-xml-check" build number 503 originally caused by: Started by upstream project "libvirt-go-xml-build" build number 505 originally caused by: Started by upstream project "libvirt-build" build number 593 originally caused by: Started by an SCM change Started by an SCM change Started by an SCM change Started by an SCM change Started by an SCM change Started by an SCM change Started by an SCM change Started by an SCM change [EnvInject] - Loading node environment variables. Building remotely on libvirt-fedora-30 (libvirt) in workspace <https://ci.centos.org/job/libvirt-go-xml-check/systems=libvirt-fedora-30/ws/> [libvirt-go-xml] $ /bin/sh -xe /tmp/jenkins1762294077303410197.sh + export 'TEST_ARGS=-tags xmlroundtrip' + TEST_ARGS='-tags xmlroundtrip' + go test -tags xmlroundtrip --- FAIL: TestRoundTrip (5.20s) xml_test.go:433: open testdata/libvirt/tests/qemuargv2xmldata: no such file or directory FAIL exit status 1 FAIL _<https://ci.centos.org/job/libvirt-go-xml-check/systems=libvirt-fedora-30/ws/> 5.254s Build step 'Execute shell' marked build as failure

See <https://ci.centos.org/job/libvirt-go-xml-check/systems=libvirt-fedora-30/504/display/redirect> ------------------------------------------ Started by upstream project "libvirt-go-xml-check" build number 504 originally caused by: Started by upstream project "libvirt-go-xml-build" build number 506 originally caused by: Started by upstream project "libvirt-build" build number 594 originally caused by: Started by an SCM change Started by an SCM change Started by an SCM change Started by an SCM change Started by an SCM change Started by an SCM change Started by an SCM change Started by an SCM change Started by an SCM change [EnvInject] - Loading node environment variables. Building remotely on libvirt-fedora-30 (libvirt) in workspace <https://ci.centos.org/job/libvirt-go-xml-check/systems=libvirt-fedora-30/ws/> [libvirt-go-xml] $ /bin/sh -xe /tmp/jenkins3894982875761342281.sh + export 'TEST_ARGS=-tags xmlroundtrip' + TEST_ARGS='-tags xmlroundtrip' + go test -tags xmlroundtrip --- FAIL: TestRoundTrip (8.85s) xml_test.go:433: open testdata/libvirt/tests/qemuargv2xmldata: no such file or directory FAIL exit status 1 FAIL _<https://ci.centos.org/job/libvirt-go-xml-check/systems=libvirt-fedora-30/ws/> 8.943s Build step 'Execute shell' marked build as failure

See <https://ci.centos.org/job/libvirt-go-xml-check/systems=libvirt-fedora-30/505/display/redirect> ------------------------------------------ Started by upstream project "libvirt-go-xml-check" build number 505 originally caused by: Started by upstream project "libvirt-go-xml-build" build number 507 originally caused by: Started by upstream project "libvirt-build" build number 595 originally caused by: Started by an SCM change [EnvInject] - Loading node environment variables. Building remotely on libvirt-fedora-30 (libvirt) in workspace <https://ci.centos.org/job/libvirt-go-xml-check/systems=libvirt-fedora-30/ws/> [libvirt-go-xml] $ /bin/sh -xe /tmp/jenkins3993860975565327661.sh + export 'TEST_ARGS=-tags xmlroundtrip' + TEST_ARGS='-tags xmlroundtrip' + go test -tags xmlroundtrip --- FAIL: TestRoundTrip (10.35s) xml_test.go:433: open testdata/libvirt/tests/qemuargv2xmldata: no such file or directory FAIL exit status 1 FAIL _<https://ci.centos.org/job/libvirt-go-xml-check/systems=libvirt-fedora-30/ws/> 10.498s Build step 'Execute shell' marked build as failure

See <https://ci.centos.org/job/libvirt-go-xml-check/systems=libvirt-fedora-30/506/display/redirect> ------------------------------------------ Started by upstream project "libvirt-go-xml-check" build number 506 originally caused by: Started by upstream project "libvirt-go-xml-build" build number 508 originally caused by: Started by upstream project "libvirt-build" build number 596 originally caused by: Started by an SCM change Started by an SCM change Started by an SCM change Started by an SCM change Started by an SCM change Started by an SCM change Started by an SCM change [EnvInject] - Loading node environment variables. Building remotely on libvirt-fedora-30 (libvirt) in workspace <https://ci.centos.org/job/libvirt-go-xml-check/systems=libvirt-fedora-30/ws/> [libvirt-go-xml] $ /bin/sh -xe /tmp/jenkins3028435318002444237.sh + export 'TEST_ARGS=-tags xmlroundtrip' + TEST_ARGS='-tags xmlroundtrip' + go test -tags xmlroundtrip --- FAIL: TestRoundTrip (8.57s) xml_test.go:433: open testdata/libvirt/tests/qemuargv2xmldata: no such file or directory FAIL exit status 1 FAIL _<https://ci.centos.org/job/libvirt-go-xml-check/systems=libvirt-fedora-30/ws/> 8.750s Build step 'Execute shell' marked build as failure

See <https://ci.centos.org/job/libvirt-go-xml-check/systems=libvirt-fedora-30/507/display/redirect> ------------------------------------------ Started by upstream project "libvirt-go-xml-check" build number 507 originally caused by: Started by upstream project "libvirt-go-xml-build" build number 509 originally caused by: Started by upstream project "libvirt-build" build number 599 originally caused by: Started by an SCM change Started by an SCM change [EnvInject] - Loading node environment variables. Building remotely on libvirt-fedora-30 (libvirt) in workspace <https://ci.centos.org/job/libvirt-go-xml-check/systems=libvirt-fedora-30/ws/> [libvirt-go-xml] $ /bin/sh -xe /tmp/jenkins7249519106994796021.sh + export 'TEST_ARGS=-tags xmlroundtrip' + TEST_ARGS='-tags xmlroundtrip' + go test -tags xmlroundtrip --- FAIL: TestRoundTrip (8.70s) xml_test.go:433: open testdata/libvirt/tests/qemuargv2xmldata: no such file or directory FAIL exit status 1 FAIL _<https://ci.centos.org/job/libvirt-go-xml-check/systems=libvirt-fedora-30/ws/> 8.804s Build step 'Execute shell' marked build as failure

See <https://ci.centos.org/job/libvirt-go-xml-check/systems=libvirt-fedora-30/508/display/redirect> ------------------------------------------ Started by upstream project "libvirt-go-xml-check" build number 508 originally caused by: Started by upstream project "libvirt-go-xml-build" build number 510 originally caused by: Started by upstream project "libvirt-build" build number 600 originally caused by: Started by an SCM change Started by an SCM change Started by an SCM change Started by an SCM change Started by an SCM change [EnvInject] - Loading node environment variables. Building remotely on libvirt-fedora-30 (libvirt) in workspace <https://ci.centos.org/job/libvirt-go-xml-check/systems=libvirt-fedora-30/ws/> [libvirt-go-xml] $ /bin/sh -xe /tmp/jenkins6770028305639430128.sh + export 'TEST_ARGS=-tags xmlroundtrip' + TEST_ARGS='-tags xmlroundtrip' + go test -tags xmlroundtrip --- FAIL: TestRoundTrip (5.18s) xml_test.go:433: open testdata/libvirt/tests/qemuargv2xmldata: no such file or directory FAIL exit status 1 FAIL _<https://ci.centos.org/job/libvirt-go-xml-check/systems=libvirt-fedora-30/ws/> 5.289s Build step 'Execute shell' marked build as failure

See <https://ci.centos.org/job/libvirt-go-xml-check/systems=libvirt-fedora-30/509/display/redirect> ------------------------------------------ Started by upstream project "libvirt-go-xml-check" build number 509 originally caused by: Started by upstream project "libvirt-go-xml-build" build number 511 originally caused by: Started by upstream project "libvirt-build" build number 601 originally caused by: Started by an SCM change [EnvInject] - Loading node environment variables. Building remotely on libvirt-fedora-30 (libvirt) in workspace <https://ci.centos.org/job/libvirt-go-xml-check/systems=libvirt-fedora-30/ws/> [libvirt-go-xml] $ /bin/sh -xe /tmp/jenkins6212342923124772299.sh + export 'TEST_ARGS=-tags xmlroundtrip' + TEST_ARGS='-tags xmlroundtrip' + go test -tags xmlroundtrip --- FAIL: TestRoundTrip (7.20s) xml_test.go:433: open testdata/libvirt/tests/qemuargv2xmldata: no such file or directory FAIL exit status 1 FAIL _<https://ci.centos.org/job/libvirt-go-xml-check/systems=libvirt-fedora-30/ws/> 7.252s Build step 'Execute shell' marked build as failure

See <https://ci.centos.org/job/libvirt-go-xml-check/systems=libvirt-fedora-30/510/display/redirect> ------------------------------------------ Started by upstream project "libvirt-go-xml-check" build number 510 originally caused by: Started by upstream project "libvirt-go-xml-build" build number 512 originally caused by: Started by upstream project "libvirt-build" build number 602 originally caused by: Started by an SCM change Started by an SCM change Started by an SCM change Started by an SCM change Started by an SCM change Started by an SCM change Started by an SCM change [EnvInject] - Loading node environment variables. Building remotely on libvirt-fedora-30 (libvirt) in workspace <https://ci.centos.org/job/libvirt-go-xml-check/systems=libvirt-fedora-30/ws/> [libvirt-go-xml] $ /bin/sh -xe /tmp/jenkins3102004588973524850.sh + export 'TEST_ARGS=-tags xmlroundtrip' + TEST_ARGS='-tags xmlroundtrip' + go test -tags xmlroundtrip --- FAIL: TestRoundTrip (4.92s) xml_test.go:433: open testdata/libvirt/tests/qemuargv2xmldata: no such file or directory FAIL exit status 1 FAIL _<https://ci.centos.org/job/libvirt-go-xml-check/systems=libvirt-fedora-30/ws/> 4.987s Build step 'Execute shell' marked build as failure

See <https://ci.centos.org/job/libvirt-go-xml-check/systems=libvirt-fedora-30/511/display/redirect> ------------------------------------------ Started by upstream project "libvirt-go-xml-check" build number 511 originally caused by: Started by upstream project "libvirt-go-xml-build" build number 513 originally caused by: Started by upstream project "libvirt-build" build number 614 originally caused by: Started by an SCM change [EnvInject] - Loading node environment variables. Building remotely on libvirt-fedora-30 (libvirt) in workspace <https://ci.centos.org/job/libvirt-go-xml-check/systems=libvirt-fedora-30/ws/> [libvirt-go-xml] $ /bin/sh -xe /tmp/jenkins6387683551539848714.sh + export 'TEST_ARGS=-tags xmlroundtrip' + TEST_ARGS='-tags xmlroundtrip' + go test -tags xmlroundtrip --- FAIL: TestRoundTrip (13.41s) xml_test.go:433: open testdata/libvirt/tests/qemuargv2xmldata: no such file or directory FAIL exit status 1 FAIL _<https://ci.centos.org/job/libvirt-go-xml-check/systems=libvirt-fedora-30/ws/> 13.513s Build step 'Execute shell' marked build as failure

See <https://ci.centos.org/job/libvirt-go-xml-check/systems=libvirt-fedora-30/512/display/redirect> ------------------------------------------ Started by upstream project "libvirt-go-xml-check" build number 512 originally caused by: Started by upstream project "libvirt-go-xml-build" build number 514 originally caused by: Started by upstream project "libvirt-build" build number 615 originally caused by: Started by an SCM change Started by an SCM change Started by an SCM change Started by an SCM change [EnvInject] - Loading node environment variables. Building remotely on libvirt-fedora-30 (libvirt) in workspace <https://ci.centos.org/job/libvirt-go-xml-check/systems=libvirt-fedora-30/ws/> [libvirt-go-xml] $ /bin/sh -xe /tmp/jenkins7249403643062424105.sh + export 'TEST_ARGS=-tags xmlroundtrip' + TEST_ARGS='-tags xmlroundtrip' + go test -tags xmlroundtrip --- FAIL: TestRoundTrip (11.07s) xml_test.go:433: open testdata/libvirt/tests/qemuargv2xmldata: no such file or directory FAIL exit status 1 FAIL _<https://ci.centos.org/job/libvirt-go-xml-check/systems=libvirt-fedora-30/ws/> 11.204s Build step 'Execute shell' marked build as failure

See <https://ci.centos.org/job/libvirt-go-xml-check/systems=libvirt-fedora-30/513/display/redirect> ------------------------------------------ Started by upstream project "libvirt-go-xml-check" build number 513 originally caused by: Started by upstream project "libvirt-go-xml-build" build number 515 originally caused by: Started by upstream project "libvirt-build" build number 616 originally caused by: Started by an SCM change [EnvInject] - Loading node environment variables. Building remotely on libvirt-fedora-30 (libvirt) in workspace <https://ci.centos.org/job/libvirt-go-xml-check/systems=libvirt-fedora-30/ws/> [libvirt-go-xml] $ /bin/sh -xe /tmp/jenkins5207684661377691527.sh + export 'TEST_ARGS=-tags xmlroundtrip' + TEST_ARGS='-tags xmlroundtrip' + go test -tags xmlroundtrip --- FAIL: TestRoundTrip (5.68s) xml_test.go:433: open testdata/libvirt/tests/qemuargv2xmldata: no such file or directory FAIL exit status 1 FAIL _<https://ci.centos.org/job/libvirt-go-xml-check/systems=libvirt-fedora-30/ws/> 5.809s Build step 'Execute shell' marked build as failure

participants (1)
-
ci@centos.org