[Libvirt-ci] Build failed in Jenkins: libvirt-go-check » libvirt-freebsd-11 #905

See <https://ci.centos.org/job/libvirt-go-check/systems=libvirt-freebsd-11/905/display/redirect> ------------------------------------------ Started by upstream project "libvirt-go-check" build number 905 originally caused by: Started by upstream project "libvirt-go-build" build number 919 originally caused by: Started by upstream project "libvirt-build" build number 1088 originally caused by: Started by an SCM change Running as SYSTEM [EnvInject] - Loading node environment variables. Building remotely on libvirt-freebsd-11 (libvirt) in workspace <https://ci.centos.org/job/libvirt-go-check/systems=libvirt-freebsd-11/ws/> [libvirt-go] $ /bin/sh -xe /tmp/jenkins2066712137364960422.sh + export 'TEST_ARGS=-tags api' + go test -tags api Missing enum 'VIR_DOMAIN_STATS_MEMORY' --- FAIL: TestAPICoverage (1.16s) panic: Missing symbols found [recovered] panic: Missing symbols found goroutine 7 [running]: testing.tRunner.func1(0xc0000a8100) /usr/local/go/src/testing/testing.go:874 +0x3a3 panic(0x5df660, 0x65bc40) /usr/local/go/src/runtime/panic.go:679 +0x1b2 _/usr<https://ci.centos.org/job/libvirt-go-check/systems=libvirt-freebsd-11/ws/.TestAPICoverage(0xc0000a8100)> /usr<https://ci.centos.org/job/libvirt-go-check/systems=libvirt-freebsd-11/ws/api_test.go>:503 +0x551 testing.tRunner(0xc0000a8100, 0x634e70) /usr/local/go/src/testing/testing.go:909 +0xc9 created by testing.(*T).Run /usr/local/go/src/testing/testing.go:960 +0x350 exit status 2 FAIL _/usr<https://ci.centos.org/job/libvirt-go-check/systems=libvirt-freebsd-11/ws/> 1.359s Build step 'Execute shell' marked build as failure

See <https://ci.centos.org/job/libvirt-go-check/systems=libvirt-freebsd-11/906/display/redirect> ------------------------------------------ Started by upstream project "libvirt-go-check" build number 906 originally caused by: Started by upstream project "libvirt-go-build" build number 920 originally caused by: Started by upstream project "libvirt-build" build number 1093 originally caused by: Started by an SCM change Running as SYSTEM [EnvInject] - Loading node environment variables. Building remotely on libvirt-freebsd-11 (libvirt) in workspace <https://ci.centos.org/job/libvirt-go-check/systems=libvirt-freebsd-11/ws/> [libvirt-go] $ /bin/sh -xe /tmp/jenkins12951058868147147509.sh + export 'TEST_ARGS=-tags api' + go test -tags api Missing enum 'VIR_DOMAIN_STATS_MEMORY' --- FAIL: TestAPICoverage (0.58s) panic: Missing symbols found [recovered] panic: Missing symbols found goroutine 5 [running]: testing.tRunner.func1(0xc0000b0100) /usr/local/go/src/testing/testing.go:874 +0x3a3 panic(0x5df660, 0x65bc40) /usr/local/go/src/runtime/panic.go:679 +0x1b2 _/usr<https://ci.centos.org/job/libvirt-go-check/systems=libvirt-freebsd-11/ws/.TestAPICoverage(0xc0000b0100)> /usr<https://ci.centos.org/job/libvirt-go-check/systems=libvirt-freebsd-11/ws/api_test.go>:503 +0x551 testing.tRunner(0xc0000b0100, 0x634e70) /usr/local/go/src/testing/testing.go:909 +0xc9 created by testing.(*T).Run /usr/local/go/src/testing/testing.go:960 +0x350 exit status 2 FAIL _/usr<https://ci.centos.org/job/libvirt-go-check/systems=libvirt-freebsd-11/ws/> 1.063s Build step 'Execute shell' marked build as failure

See <https://ci.centos.org/job/libvirt-go-check/systems=libvirt-freebsd-11/907/display/redirect> ------------------------------------------ Started by upstream project "libvirt-go-check" build number 907 originally caused by: Started by upstream project "libvirt-go-build" build number 921 originally caused by: Started by upstream project "libvirt-build" build number 1094 originally caused by: Started by an SCM change Running as SYSTEM [EnvInject] - Loading node environment variables. Building remotely on libvirt-freebsd-11 (libvirt) in workspace <https://ci.centos.org/job/libvirt-go-check/systems=libvirt-freebsd-11/ws/> [libvirt-go] $ /bin/sh -xe /tmp/jenkins3927028141591690622.sh + export 'TEST_ARGS=-tags api' + go test -tags api Missing enum 'VIR_DOMAIN_STATS_MEMORY' --- FAIL: TestAPICoverage (0.56s) panic: Missing symbols found [recovered] panic: Missing symbols found goroutine 7 [running]: testing.tRunner.func1(0xc0000a8100) /usr/local/go/src/testing/testing.go:874 +0x3a3 panic(0x5df660, 0x65bc40) /usr/local/go/src/runtime/panic.go:679 +0x1b2 _/usr<https://ci.centos.org/job/libvirt-go-check/systems=libvirt-freebsd-11/ws/.TestAPICoverage(0xc0000a8100)> /usr<https://ci.centos.org/job/libvirt-go-check/systems=libvirt-freebsd-11/ws/api_test.go>:503 +0x551 testing.tRunner(0xc0000a8100, 0x634e70) /usr/local/go/src/testing/testing.go:909 +0xc9 created by testing.(*T).Run /usr/local/go/src/testing/testing.go:960 +0x350 exit status 2 FAIL _/usr<https://ci.centos.org/job/libvirt-go-check/systems=libvirt-freebsd-11/ws/> 0.893s Build step 'Execute shell' marked build as failure

See <https://ci.centos.org/job/libvirt-go-check/systems=libvirt-freebsd-11/908/display/redirect> ------------------------------------------ Started by upstream project "libvirt-go-check" build number 908 originally caused by: Started by upstream project "libvirt-go-build" build number 922 originally caused by: Started by upstream project "libvirt-build" build number 1095 originally caused by: Started by an SCM change Running as SYSTEM [EnvInject] - Loading node environment variables. Building remotely on libvirt-freebsd-11 (libvirt) in workspace <https://ci.centos.org/job/libvirt-go-check/systems=libvirt-freebsd-11/ws/> [libvirt-go] $ /bin/sh -xe /tmp/jenkins2321879622338130001.sh + export 'TEST_ARGS=-tags api' + go test -tags api Missing enum 'VIR_DOMAIN_STATS_MEMORY' --- FAIL: TestAPICoverage (1.06s) panic: Missing symbols found [recovered] panic: Missing symbols found goroutine 21 [running]: testing.tRunner.func1(0xc0000c2100) /usr/local/go/src/testing/testing.go:874 +0x3a3 panic(0x5df660, 0x65bc40) /usr/local/go/src/runtime/panic.go:679 +0x1b2 _/usr<https://ci.centos.org/job/libvirt-go-check/systems=libvirt-freebsd-11/ws/.TestAPICoverage(0xc0000c2100)> /usr<https://ci.centos.org/job/libvirt-go-check/systems=libvirt-freebsd-11/ws/api_test.go>:503 +0x551 testing.tRunner(0xc0000c2100, 0x634e70) /usr/local/go/src/testing/testing.go:909 +0xc9 created by testing.(*T).Run /usr/local/go/src/testing/testing.go:960 +0x350 exit status 2 FAIL _/usr<https://ci.centos.org/job/libvirt-go-check/systems=libvirt-freebsd-11/ws/> 1.940s Build step 'Execute shell' marked build as failure

See <https://ci.centos.org/job/libvirt-go-check/systems=libvirt-freebsd-11/909/display/redirect> ------------------------------------------ Started by upstream project "libvirt-go-check" build number 909 originally caused by: Started by upstream project "libvirt-go-build" build number 923 originally caused by: Started by upstream project "libvirt-build" build number 1096 originally caused by: Started by an SCM change Running as SYSTEM [EnvInject] - Loading node environment variables. Building remotely on libvirt-freebsd-11 (libvirt) in workspace <https://ci.centos.org/job/libvirt-go-check/systems=libvirt-freebsd-11/ws/> [libvirt-go] $ /bin/sh -xe /tmp/jenkins1311706253767757006.sh + export 'TEST_ARGS=-tags api' + go test -tags api Missing enum 'VIR_DOMAIN_STATS_MEMORY' --- FAIL: TestAPICoverage (0.91s) panic: Missing symbols found [recovered] panic: Missing symbols found goroutine 20 [running]: testing.tRunner.func1(0xc0000c0100) /usr/local/go/src/testing/testing.go:874 +0x3a3 panic(0x5df660, 0x65bc40) /usr/local/go/src/runtime/panic.go:679 +0x1b2 _/usr<https://ci.centos.org/job/libvirt-go-check/systems=libvirt-freebsd-11/ws/.TestAPICoverage(0xc0000c0100)> /usr<https://ci.centos.org/job/libvirt-go-check/systems=libvirt-freebsd-11/ws/api_test.go>:503 +0x551 testing.tRunner(0xc0000c0100, 0x634e70) /usr/local/go/src/testing/testing.go:909 +0xc9 created by testing.(*T).Run /usr/local/go/src/testing/testing.go:960 +0x350 exit status 2 FAIL _/usr<https://ci.centos.org/job/libvirt-go-check/systems=libvirt-freebsd-11/ws/> 1.297s Build step 'Execute shell' marked build as failure

See <https://ci.centos.org/job/libvirt-go-check/systems=libvirt-freebsd-11/910/display/redirect> ------------------------------------------ Started by upstream project "libvirt-go-check" build number 910 originally caused by: Started by upstream project "libvirt-go-build" build number 924 originally caused by: Started by upstream project "libvirt-build" build number 1097 originally caused by: Started by an SCM change Started by an SCM change Started by an SCM change Running as SYSTEM [EnvInject] - Loading node environment variables. Building remotely on libvirt-freebsd-11 (libvirt) in workspace <https://ci.centos.org/job/libvirt-go-check/systems=libvirt-freebsd-11/ws/> [libvirt-go] $ /bin/sh -xe /tmp/jenkins106502611295335688.sh + export 'TEST_ARGS=-tags api' + go test -tags api Missing enum 'VIR_DOMAIN_STATS_MEMORY' --- FAIL: TestAPICoverage (0.55s) panic: Missing symbols found [recovered] panic: Missing symbols found goroutine 20 [running]: testing.tRunner.func1(0xc0000c0100) /usr/local/go/src/testing/testing.go:874 +0x3a3 panic(0x5df660, 0x65bc40) /usr/local/go/src/runtime/panic.go:679 +0x1b2 _/usr<https://ci.centos.org/job/libvirt-go-check/systems=libvirt-freebsd-11/ws/.TestAPICoverage(0xc0000c0100)> /usr<https://ci.centos.org/job/libvirt-go-check/systems=libvirt-freebsd-11/ws/api_test.go>:503 +0x551 testing.tRunner(0xc0000c0100, 0x634e70) /usr/local/go/src/testing/testing.go:909 +0xc9 created by testing.(*T).Run /usr/local/go/src/testing/testing.go:960 +0x350 exit status 2 FAIL _/usr<https://ci.centos.org/job/libvirt-go-check/systems=libvirt-freebsd-11/ws/> 0.950s Build step 'Execute shell' marked build as failure

See <https://ci.centos.org/job/libvirt-go-check/systems=libvirt-freebsd-11/911/display/redirect> ------------------------------------------ Started by upstream project "libvirt-go-check" build number 911 originally caused by: Started by upstream project "libvirt-go-build" build number 925 originally caused by: Started by upstream project "libvirt-build" build number 1098 originally caused by: Started by an SCM change Started by an SCM change Started by an SCM change Running as SYSTEM [EnvInject] - Loading node environment variables. Building remotely on libvirt-freebsd-11 (libvirt) in workspace <https://ci.centos.org/job/libvirt-go-check/systems=libvirt-freebsd-11/ws/> [libvirt-go] $ /bin/sh -xe /tmp/jenkins7120256685971624128.sh + export 'TEST_ARGS=-tags api' + go test -tags api Missing enum 'VIR_DOMAIN_STATS_MEMORY' --- FAIL: TestAPICoverage (0.69s) panic: Missing symbols found [recovered] panic: Missing symbols found goroutine 6 [running]: testing.tRunner.func1(0xc0000c6100) /usr/local/go/src/testing/testing.go:874 +0x3a3 panic(0x5df660, 0x65bc40) /usr/local/go/src/runtime/panic.go:679 +0x1b2 _/usr<https://ci.centos.org/job/libvirt-go-check/systems=libvirt-freebsd-11/ws/.TestAPICoverage(0xc0000c6100)> /usr<https://ci.centos.org/job/libvirt-go-check/systems=libvirt-freebsd-11/ws/api_test.go>:503 +0x551 testing.tRunner(0xc0000c6100, 0x634e70) /usr/local/go/src/testing/testing.go:909 +0xc9 created by testing.(*T).Run /usr/local/go/src/testing/testing.go:960 +0x350 exit status 2 FAIL _/usr<https://ci.centos.org/job/libvirt-go-check/systems=libvirt-freebsd-11/ws/> 1.162s Build step 'Execute shell' marked build as failure

See <https://ci.centos.org/job/libvirt-go-check/systems=libvirt-freebsd-11/912/display/redirect> ------------------------------------------ Started by upstream project "libvirt-go-check" build number 912 originally caused by: Started by upstream project "libvirt-go-build" build number 926 originally caused by: Started by upstream project "libvirt-build" build number 1099 originally caused by: Started by user Libvirt Running as SYSTEM [EnvInject] - Loading node environment variables. Building remotely on libvirt-freebsd-11 (libvirt) in workspace <https://ci.centos.org/job/libvirt-go-check/systems=libvirt-freebsd-11/ws/> [libvirt-go] $ /bin/sh -xe /tmp/jenkins4316782099120950493.sh + export 'TEST_ARGS=-tags api' + go test -tags api Missing enum 'VIR_DOMAIN_STATS_MEMORY' --- FAIL: TestAPICoverage (0.70s) panic: Missing symbols found [recovered] panic: Missing symbols found goroutine 5 [running]: testing.tRunner.func1(0xc0000b6100) /usr/local/go/src/testing/testing.go:874 +0x3a3 panic(0x5df600, 0x65bbe0) /usr/local/go/src/runtime/panic.go:679 +0x1b2 _/usr<https://ci.centos.org/job/libvirt-go-check/systems=libvirt-freebsd-11/ws/.TestAPICoverage(0xc0000b6100)> /usr<https://ci.centos.org/job/libvirt-go-check/systems=libvirt-freebsd-11/ws/api_test.go>:503 +0x551 testing.tRunner(0xc0000b6100, 0x634e10) /usr/local/go/src/testing/testing.go:909 +0xc9 created by testing.(*T).Run /usr/local/go/src/testing/testing.go:960 +0x350 exit status 2 FAIL _/usr<https://ci.centos.org/job/libvirt-go-check/systems=libvirt-freebsd-11/ws/> 1.050s Build step 'Execute shell' marked build as failure

participants (1)
-
ci@centos.org