[Libvirt-ci] Build failed in Jenkins: libvirt-go-check » libvirt-debian-9 #439

See <https://ci.centos.org/job/libvirt-go-check/systems=libvirt-debian-9/439/display/redirect> ------------------------------------------ Started by upstream project "libvirt-go-check" build number 439 originally caused by: Started by upstream project "libvirt-go-build" build number 445 originally caused by: Started by upstream project "libvirt-build" build number 539 originally caused by: Started by an SCM change [EnvInject] - Loading node environment variables. Building remotely on libvirt-debian-9 (libvirt) in workspace <https://ci.centos.org/job/libvirt-go-check/systems=libvirt-debian-9/ws/> [libvirt-go] $ /bin/sh -xe /tmp/jenkins447660711395640918.sh + export TEST_ARGS=-tags api + go test -tags api Missing enum 'VIR_DOMAIN_MEMORY_STAT_HUGETLB_PGALLOC' Missing enum 'VIR_DOMAIN_MEMORY_STAT_HUGETLB_PGFAIL' --- FAIL: TestAPICoverage (0.33s) panic: Missing symbols found [recovered] panic: Missing symbols found goroutine 5 [running]: panic(0x55e869e531c0, 0xc4200b08a0) /usr/lib/go-1.7/src/runtime/panic.go:500 +0x1a1 testing.tRunner.func1(0xc420078180) /usr/lib/go-1.7/src/testing/testing.go:579 +0x25d panic(0x55e869e531c0, 0xc4200b08a0) /usr/lib/go-1.7/src/runtime/panic.go:458 +0x243 _<https://ci.centos.org/job/libvirt-go-check/systems=libvirt-debian-9/ws/.TestAPICoverage(0xc420078180)> <https://ci.centos.org/job/libvirt-go-check/systems=libvirt-debian-9/ws/api_test.go>:501 +0x5ff testing.tRunner(0xc420078180, 0x55e869ea6908) /usr/lib/go-1.7/src/testing/testing.go:610 +0x81 created by testing.(*T).Run /usr/lib/go-1.7/src/testing/testing.go:646 +0x2ec exit status 2 FAIL _<https://ci.centos.org/job/libvirt-go-check/systems=libvirt-debian-9/ws/> 0.400s Build step 'Execute shell' marked build as failure

See <https://ci.centos.org/job/libvirt-go-check/systems=libvirt-debian-9/440/display/redirect> ------------------------------------------ Started by upstream project "libvirt-go-check" build number 440 originally caused by: Started by upstream project "libvirt-go-build" build number 446 originally caused by: Started by upstream project "libvirt-build" build number 540 originally caused by: Started by an SCM change Started by an SCM change Started by an SCM change Started by an SCM change Started by an SCM change [EnvInject] - Loading node environment variables. Building remotely on libvirt-debian-9 (libvirt) in workspace <https://ci.centos.org/job/libvirt-go-check/systems=libvirt-debian-9/ws/> [libvirt-go] $ /bin/sh -xe /tmp/jenkins5029967059150725957.sh + export TEST_ARGS=-tags api + go test -tags api Missing enum 'VIR_DOMAIN_MEMORY_STAT_HUGETLB_PGALLOC' Missing enum 'VIR_DOMAIN_MEMORY_STAT_HUGETLB_PGFAIL' --- FAIL: TestAPICoverage (0.69s) panic: Missing symbols found [recovered] panic: Missing symbols found goroutine 5 [running]: panic(0x563e6a16e1c0, 0xc4200b8670) /usr/lib/go-1.7/src/runtime/panic.go:500 +0x1a1 testing.tRunner.func1(0xc420078180) /usr/lib/go-1.7/src/testing/testing.go:579 +0x25d panic(0x563e6a16e1c0, 0xc4200b8670) /usr/lib/go-1.7/src/runtime/panic.go:458 +0x243 _<https://ci.centos.org/job/libvirt-go-check/systems=libvirt-debian-9/ws/.TestAPICoverage(0xc420078180)> <https://ci.centos.org/job/libvirt-go-check/systems=libvirt-debian-9/ws/api_test.go>:501 +0x5ff testing.tRunner(0xc420078180, 0x563e6a1c1908) /usr/lib/go-1.7/src/testing/testing.go:610 +0x81 created by testing.(*T).Run /usr/lib/go-1.7/src/testing/testing.go:646 +0x2ec exit status 2 FAIL _<https://ci.centos.org/job/libvirt-go-check/systems=libvirt-debian-9/ws/> 0.830s Build step 'Execute shell' marked build as failure

See <https://ci.centos.org/job/libvirt-go-check/systems=libvirt-debian-9/441/display/redirect> ------------------------------------------ Started by upstream project "libvirt-go-check" build number 441 originally caused by: Started by upstream project "libvirt-go-build" build number 447 originally caused by: Started by upstream project "libvirt-build" build number 541 originally caused by: Started by an SCM change [EnvInject] - Loading node environment variables. Building remotely on libvirt-debian-9 (libvirt) in workspace <https://ci.centos.org/job/libvirt-go-check/systems=libvirt-debian-9/ws/> [libvirt-go] $ /bin/sh -xe /tmp/jenkins2328336628122744395.sh + export TEST_ARGS=-tags api + go test -tags api Missing enum 'VIR_DOMAIN_MEMORY_STAT_HUGETLB_PGALLOC' Missing enum 'VIR_DOMAIN_MEMORY_STAT_HUGETLB_PGFAIL' --- FAIL: TestAPICoverage (1.30s) panic: Missing symbols found [recovered] panic: Missing symbols found goroutine 5 [running]: panic(0x55909647e1c0, 0xc420432560) /usr/lib/go-1.7/src/runtime/panic.go:500 +0x1a1 testing.tRunner.func1(0xc420078180) /usr/lib/go-1.7/src/testing/testing.go:579 +0x25d panic(0x55909647e1c0, 0xc420432560) /usr/lib/go-1.7/src/runtime/panic.go:458 +0x243 _<https://ci.centos.org/job/libvirt-go-check/systems=libvirt-debian-9/ws/.TestAPICoverage(0xc420078180)> <https://ci.centos.org/job/libvirt-go-check/systems=libvirt-debian-9/ws/api_test.go>:501 +0x5ff testing.tRunner(0xc420078180, 0x5590964d1908) /usr/lib/go-1.7/src/testing/testing.go:610 +0x81 created by testing.(*T).Run /usr/lib/go-1.7/src/testing/testing.go:646 +0x2ec exit status 2 FAIL _<https://ci.centos.org/job/libvirt-go-check/systems=libvirt-debian-9/ws/> 1.458s Build step 'Execute shell' marked build as failure

See <https://ci.centos.org/job/libvirt-go-check/systems=libvirt-debian-9/442/display/redirect> ------------------------------------------ Started by upstream project "libvirt-go-check" build number 442 originally caused by: Started by upstream project "libvirt-go-build" build number 448 originally caused by: Started by upstream project "libvirt-build" build number 542 originally caused by: Started by an SCM change Started by an SCM change Started by an SCM change Started by an SCM change Started by an SCM change Started by an SCM change Started by an SCM change Started by an SCM change [EnvInject] - Loading node environment variables. Building remotely on libvirt-debian-9 (libvirt) in workspace <https://ci.centos.org/job/libvirt-go-check/systems=libvirt-debian-9/ws/> [libvirt-go] $ /bin/sh -xe /tmp/jenkins6189701304719368405.sh + export TEST_ARGS=-tags api + go test -tags api Missing enum 'VIR_DOMAIN_MEMORY_STAT_HUGETLB_PGALLOC' Missing enum 'VIR_DOMAIN_MEMORY_STAT_HUGETLB_PGFAIL' --- FAIL: TestAPICoverage (0.82s) panic: Missing symbols found [recovered] panic: Missing symbols found goroutine 5 [running]: panic(0x55c52ceb51c0, 0xc4202086f0) /usr/lib/go-1.7/src/runtime/panic.go:500 +0x1a1 testing.tRunner.func1(0xc420078180) /usr/lib/go-1.7/src/testing/testing.go:579 +0x25d panic(0x55c52ceb51c0, 0xc4202086f0) /usr/lib/go-1.7/src/runtime/panic.go:458 +0x243 _<https://ci.centos.org/job/libvirt-go-check/systems=libvirt-debian-9/ws/.TestAPICoverage(0xc420078180)> <https://ci.centos.org/job/libvirt-go-check/systems=libvirt-debian-9/ws/api_test.go>:501 +0x5ff testing.tRunner(0xc420078180, 0x55c52cf08908) /usr/lib/go-1.7/src/testing/testing.go:610 +0x81 created by testing.(*T).Run /usr/lib/go-1.7/src/testing/testing.go:646 +0x2ec exit status 2 FAIL _<https://ci.centos.org/job/libvirt-go-check/systems=libvirt-debian-9/ws/> 0.923s Build step 'Execute shell' marked build as failure

participants (1)
-
ci@centos.org