[Libvirt-ci] Build failed in Jenkins: libvirt-go-xml-master-check » libvirt-debian-8 #481

See <https://ci.centos.org/job/libvirt-go-xml-master-check/systems=libvirt-debian-8/481/display/redirect> ------------------------------------------ Started by upstream project "libvirt-go-xml-master-check" build number 481 originally caused by: Started by upstream project "libvirt-go-xml-master-build" build number 490 originally caused by: Started by upstream project "libvirt-master-build" build number 1541 originally caused by: Started by an SCM change [EnvInject] - Loading node environment variables. Building remotely on libvirt-debian-8 (libvirt) in workspace <https://ci.centos.org/job/libvirt-go-xml-master-check/systems=libvirt-debian-8/ws/> [libvirt-go-xml-master] $ /bin/sh -xe /tmp/jenkins273132993855198042.sh + export TEST_ARGS=-tags xmlroundtrip + go test -tags xmlroundtrip --- FAIL: TestRoundTrip (30.82 seconds) xml_test.go:383: testdata/libvirt/tests/storagevolxml2xmlin/vol-luks-convert.xml: /volume[0]/source[0]: element in expected XML missing in actual XML FAIL exit status 1 FAIL _<https://ci.centos.org/job/libvirt-go-xml-master-check/systems=libvirt-debian-8/ws/> 31.014s Build step 'Execute shell' marked build as failure

See <https://ci.centos.org/job/libvirt-go-xml-master-check/systems=libvirt-debian-8/482/display/redirect> ------------------------------------------ Started by upstream project "libvirt-go-xml-master-check" build number 482 originally caused by: Started by upstream project "libvirt-go-xml-master-build" build number 491 originally caused by: Started by upstream project "libvirt-master-build" build number 1542 originally caused by: Started by an SCM change Started by an SCM change Started by an SCM change Started by an SCM change Started by an SCM change [EnvInject] - Loading node environment variables. Building remotely on libvirt-debian-8 (libvirt) in workspace <https://ci.centos.org/job/libvirt-go-xml-master-check/systems=libvirt-debian-8/ws/> [libvirt-go-xml-master] $ /bin/sh -xe /tmp/jenkins1078175067269519790.sh + export TEST_ARGS=-tags xmlroundtrip + go test -tags xmlroundtrip --- FAIL: TestRoundTrip (33.19 seconds) xml_test.go:383: testdata/libvirt/tests/storagevolxml2xmlin/vol-luks-convert.xml: /volume[0]/source[0]: element in expected XML missing in actual XML FAIL exit status 1 FAIL _<https://ci.centos.org/job/libvirt-go-xml-master-check/systems=libvirt-debian-8/ws/> 33.419s Build step 'Execute shell' marked build as failure

See <https://ci.centos.org/job/libvirt-go-xml-master-check/systems=libvirt-debian-8/483/display/redirect> ------------------------------------------ Started by upstream project "libvirt-go-xml-master-check" build number 483 originally caused by: Started by upstream project "libvirt-go-xml-master-build" build number 492 originally caused by: Started by upstream project "libvirt-master-build" build number 1543 originally caused by: Started by an SCM change Started by an SCM change Started by an SCM change [EnvInject] - Loading node environment variables. Building remotely on libvirt-debian-8 (libvirt) in workspace <https://ci.centos.org/job/libvirt-go-xml-master-check/systems=libvirt-debian-8/ws/> [libvirt-go-xml-master] $ /bin/sh -xe /tmp/jenkins3004927413026335524.sh + export TEST_ARGS=-tags xmlroundtrip + go test -tags xmlroundtrip --- FAIL: TestRoundTrip (32.10 seconds) xml_test.go:383: testdata/libvirt/tests/storagevolxml2xmlin/vol-luks-convert.xml: /volume[0]/source[0]: element in expected XML missing in actual XML FAIL exit status 1 FAIL _<https://ci.centos.org/job/libvirt-go-xml-master-check/systems=libvirt-debian-8/ws/> 32.393s Build step 'Execute shell' marked build as failure

See <https://ci.centos.org/job/libvirt-go-xml-master-check/systems=libvirt-debian-8/484/display/redirect> ------------------------------------------ Started by upstream project "libvirt-go-xml-master-check" build number 484 originally caused by: Started by upstream project "libvirt-go-xml-master-build" build number 493 originally caused by: Started by upstream project "libvirt-master-build" build number 1544 originally caused by: Started by an SCM change [EnvInject] - Loading node environment variables. Building remotely on libvirt-debian-8 (libvirt) in workspace <https://ci.centos.org/job/libvirt-go-xml-master-check/systems=libvirt-debian-8/ws/> [libvirt-go-xml-master] $ /bin/sh -xe /tmp/jenkins2040822277525408006.sh + export TEST_ARGS=-tags xmlroundtrip + go test -tags xmlroundtrip --- FAIL: TestRoundTrip (6.78 seconds) xml_test.go:383: testdata/libvirt/tests/storagevolxml2xmlin/vol-luks-convert.xml: /volume[0]/source[0]: element in expected XML missing in actual XML FAIL exit status 1 FAIL _<https://ci.centos.org/job/libvirt-go-xml-master-check/systems=libvirt-debian-8/ws/> 6.830s Build step 'Execute shell' marked build as failure

See <https://ci.centos.org/job/libvirt-go-xml-master-check/systems=libvirt-debian-8/485/display/redirect> ------------------------------------------ Started by upstream project "libvirt-go-xml-master-check" build number 485 originally caused by: Started by upstream project "libvirt-go-xml-master-build" build number 494 originally caused by: Started by upstream project "libvirt-master-build" build number 1545 originally caused by: Started by an SCM change [EnvInject] - Loading node environment variables. Building remotely on libvirt-debian-8 (libvirt) in workspace <https://ci.centos.org/job/libvirt-go-xml-master-check/systems=libvirt-debian-8/ws/> [libvirt-go-xml-master] $ /bin/sh -xe /tmp/jenkins7433413038358982027.sh + export TEST_ARGS=-tags xmlroundtrip + go test -tags xmlroundtrip --- FAIL: TestRoundTrip (34.56 seconds) xml_test.go:383: testdata/libvirt/tests/storagevolxml2xmlin/vol-luks-convert.xml: /volume[0]/source[0]: element in expected XML missing in actual XML FAIL exit status 1 FAIL _<https://ci.centos.org/job/libvirt-go-xml-master-check/systems=libvirt-debian-8/ws/> 34.766s Build step 'Execute shell' marked build as failure

See <https://ci.centos.org/job/libvirt-go-xml-master-check/systems=libvirt-debian-8/486/display/redirect> ------------------------------------------ Started by upstream project "libvirt-go-xml-master-check" build number 486 originally caused by: Started by upstream project "libvirt-go-xml-master-build" build number 495 originally caused by: Started by upstream project "libvirt-master-build" build number 1546 originally caused by: Started by an SCM change [EnvInject] - Loading node environment variables. Building remotely on libvirt-debian-8 (libvirt) in workspace <https://ci.centos.org/job/libvirt-go-xml-master-check/systems=libvirt-debian-8/ws/> [libvirt-go-xml-master] $ /bin/sh -xe /tmp/jenkins6715528697046202378.sh + export TEST_ARGS=-tags xmlroundtrip + go test -tags xmlroundtrip --- FAIL: TestRoundTrip (9.03 seconds) xml_test.go:383: testdata/libvirt/tests/storagevolxml2xmlin/vol-luks-convert.xml: /volume[0]/source[0]: element in expected XML missing in actual XML FAIL exit status 1 FAIL _<https://ci.centos.org/job/libvirt-go-xml-master-check/systems=libvirt-debian-8/ws/> 9.072s Build step 'Execute shell' marked build as failure

See <https://ci.centos.org/job/libvirt-go-xml-master-check/systems=libvirt-debian-8/487/display/redirect> ------------------------------------------ Started by upstream project "libvirt-go-xml-master-check" build number 487 originally caused by: Started by upstream project "libvirt-go-xml-master-build" build number 496 originally caused by: Started by upstream project "libvirt-master-build" build number 1547 originally caused by: Started by an SCM change [EnvInject] - Loading node environment variables. Building remotely on libvirt-debian-8 (libvirt) in workspace <https://ci.centos.org/job/libvirt-go-xml-master-check/systems=libvirt-debian-8/ws/> [libvirt-go-xml-master] $ /bin/sh -xe /tmp/jenkins1126702491976369467.sh + export TEST_ARGS=-tags xmlroundtrip + go test -tags xmlroundtrip --- FAIL: TestRoundTrip (6.66 seconds) xml_test.go:383: testdata/libvirt/tests/storagevolxml2xmlin/vol-luks-convert.xml: /volume[0]/source[0]: element in expected XML missing in actual XML FAIL exit status 1 FAIL _<https://ci.centos.org/job/libvirt-go-xml-master-check/systems=libvirt-debian-8/ws/> 6.716s Build step 'Execute shell' marked build as failure

See <https://ci.centos.org/job/libvirt-go-xml-master-check/systems=libvirt-debian-8/488/display/redirect> ------------------------------------------ Started by upstream project "libvirt-go-xml-master-check" build number 488 originally caused by: Started by upstream project "libvirt-go-xml-master-build" build number 497 originally caused by: Started by upstream project "libvirt-master-build" build number 1548 originally caused by: Started by an SCM change [EnvInject] - Loading node environment variables. Building remotely on libvirt-debian-8 (libvirt) in workspace <https://ci.centos.org/job/libvirt-go-xml-master-check/systems=libvirt-debian-8/ws/> [libvirt-go-xml-master] $ /bin/sh -xe /tmp/jenkins1777052876380528989.sh + export TEST_ARGS=-tags xmlroundtrip + go test -tags xmlroundtrip --- FAIL: TestRoundTrip (6.08 seconds) xml_test.go:383: testdata/libvirt/tests/storagevolxml2xmlin/vol-luks-convert.xml: /volume[0]/source[0]: element in expected XML missing in actual XML FAIL exit status 1 FAIL _<https://ci.centos.org/job/libvirt-go-xml-master-check/systems=libvirt-debian-8/ws/> 6.132s Build step 'Execute shell' marked build as failure

See <https://ci.centos.org/job/libvirt-go-xml-master-check/systems=libvirt-debian-8/489/display/redirect> ------------------------------------------ Started by upstream project "libvirt-go-xml-master-check" build number 489 originally caused by: Started by upstream project "libvirt-go-xml-master-build" build number 498 originally caused by: Started by upstream project "libvirt-master-build" build number 1549 originally caused by: Started by an SCM change Started by an SCM change Started by an SCM change [EnvInject] - Loading node environment variables. Building remotely on libvirt-debian-8 (libvirt) in workspace <https://ci.centos.org/job/libvirt-go-xml-master-check/systems=libvirt-debian-8/ws/> [libvirt-go-xml-master] $ /bin/sh -xe /tmp/jenkins3405841355842390747.sh + export TEST_ARGS=-tags xmlroundtrip + go test -tags xmlroundtrip --- FAIL: TestRoundTrip (11.81 seconds) xml_test.go:383: testdata/libvirt/tests/storagevolxml2xmlin/vol-luks-convert.xml: /volume[0]/source[0]: element in expected XML missing in actual XML FAIL exit status 1 FAIL _<https://ci.centos.org/job/libvirt-go-xml-master-check/systems=libvirt-debian-8/ws/> 11.937s Build step 'Execute shell' marked build as failure

participants (1)
-
ci@centos.org