[Libvirt-ci] Build failed in Jenkins: libvirt-go-xml-master-check » libvirt-fedora-rawhide #481

See <https://ci.centos.org/job/libvirt-go-xml-master-check/systems=libvirt-fedora-rawhide/481/display/redirect> ------------------------------------------ Started by upstream project "libvirt-go-xml-master-check" build number 481 originally caused by: Started by upstream project "libvirt-go-xml-master-build" build number 490 originally caused by: Started by upstream project "libvirt-master-build" build number 1541 originally caused by: Started by an SCM change [EnvInject] - Loading node environment variables. Building remotely on libvirt-fedora-rawhide (libvirt) in workspace <https://ci.centos.org/job/libvirt-go-xml-master-check/systems=libvirt-fedora-rawhide/ws/> [libvirt-go-xml-master] $ /bin/sh -xe /tmp/jenkins2553979069557758837.sh + export 'TEST_ARGS=-tags xmlroundtrip' + TEST_ARGS='-tags xmlroundtrip' + go test -tags xmlroundtrip --- FAIL: TestRoundTrip (8.29s) xml_test.go:383: testdata/libvirt/tests/storagevolxml2xmlin/vol-luks-convert.xml: /volume[0]/source[0]: element in expected XML missing in actual XML FAIL exit status 1 FAIL _<https://ci.centos.org/job/libvirt-go-xml-master-check/systems=libvirt-fedora-rawhide/ws/> 8.346s Build step 'Execute shell' marked build as failure

See <https://ci.centos.org/job/libvirt-go-xml-master-check/systems=libvirt-fedora-rawhide/482/display/redirect> ------------------------------------------ Started by upstream project "libvirt-go-xml-master-check" build number 482 originally caused by: Started by upstream project "libvirt-go-xml-master-build" build number 491 originally caused by: Started by upstream project "libvirt-master-build" build number 1542 originally caused by: Started by an SCM change Started by an SCM change Started by an SCM change Started by an SCM change Started by an SCM change [EnvInject] - Loading node environment variables. Building remotely on libvirt-fedora-rawhide (libvirt) in workspace <https://ci.centos.org/job/libvirt-go-xml-master-check/systems=libvirt-fedora-rawhide/ws/> [libvirt-go-xml-master] $ /bin/sh -xe /tmp/jenkins6007199746460295804.sh + export 'TEST_ARGS=-tags xmlroundtrip' + TEST_ARGS='-tags xmlroundtrip' + go test -tags xmlroundtrip --- FAIL: TestRoundTrip (27.99s) xml_test.go:383: testdata/libvirt/tests/storagevolxml2xmlin/vol-luks-convert.xml: /volume[0]/source[0]: element in expected XML missing in actual XML FAIL exit status 1 FAIL _<https://ci.centos.org/job/libvirt-go-xml-master-check/systems=libvirt-fedora-rawhide/ws/> 28.104s Build step 'Execute shell' marked build as failure

See <https://ci.centos.org/job/libvirt-go-xml-master-check/systems=libvirt-fedora-rawhide/483/display/redirect> ------------------------------------------ Started by upstream project "libvirt-go-xml-master-check" build number 483 originally caused by: Started by upstream project "libvirt-go-xml-master-build" build number 492 originally caused by: Started by upstream project "libvirt-master-build" build number 1543 originally caused by: Started by an SCM change Started by an SCM change Started by an SCM change [EnvInject] - Loading node environment variables. Building remotely on libvirt-fedora-rawhide (libvirt) in workspace <https://ci.centos.org/job/libvirt-go-xml-master-check/systems=libvirt-fedora-rawhide/ws/> [libvirt-go-xml-master] $ /bin/sh -xe /tmp/jenkins7495331219445584385.sh + export 'TEST_ARGS=-tags xmlroundtrip' + TEST_ARGS='-tags xmlroundtrip' + go test -tags xmlroundtrip --- FAIL: TestRoundTrip (28.42s) xml_test.go:383: testdata/libvirt/tests/storagevolxml2xmlin/vol-luks-convert.xml: /volume[0]/source[0]: element in expected XML missing in actual XML FAIL exit status 1 FAIL _<https://ci.centos.org/job/libvirt-go-xml-master-check/systems=libvirt-fedora-rawhide/ws/> 28.594s Build step 'Execute shell' marked build as failure

See <https://ci.centos.org/job/libvirt-go-xml-master-check/systems=libvirt-fedora-rawhide/484/display/redirect> ------------------------------------------ Started by upstream project "libvirt-go-xml-master-check" build number 484 originally caused by: Started by upstream project "libvirt-go-xml-master-build" build number 493 originally caused by: Started by upstream project "libvirt-master-build" build number 1544 originally caused by: Started by an SCM change [EnvInject] - Loading node environment variables. Building remotely on libvirt-fedora-rawhide (libvirt) in workspace <https://ci.centos.org/job/libvirt-go-xml-master-check/systems=libvirt-fedora-rawhide/ws/> [libvirt-go-xml-master] $ /bin/sh -xe /tmp/jenkins5634694488005667151.sh + export 'TEST_ARGS=-tags xmlroundtrip' + TEST_ARGS='-tags xmlroundtrip' + go test -tags xmlroundtrip --- FAIL: TestRoundTrip (11.81s) xml_test.go:383: testdata/libvirt/tests/storagevolxml2xmlin/vol-luks-convert.xml: /volume[0]/source[0]: element in expected XML missing in actual XML FAIL exit status 1 FAIL _<https://ci.centos.org/job/libvirt-go-xml-master-check/systems=libvirt-fedora-rawhide/ws/> 11.896s Build step 'Execute shell' marked build as failure

See <https://ci.centos.org/job/libvirt-go-xml-master-check/systems=libvirt-fedora-rawhide/485/display/redirect> ------------------------------------------ Started by upstream project "libvirt-go-xml-master-check" build number 485 originally caused by: Started by upstream project "libvirt-go-xml-master-build" build number 494 originally caused by: Started by upstream project "libvirt-master-build" build number 1545 originally caused by: Started by an SCM change [EnvInject] - Loading node environment variables. Building remotely on libvirt-fedora-rawhide (libvirt) in workspace <https://ci.centos.org/job/libvirt-go-xml-master-check/systems=libvirt-fedora-rawhide/ws/> [libvirt-go-xml-master] $ /bin/sh -xe /tmp/jenkins176589904464805848.sh + export 'TEST_ARGS=-tags xmlroundtrip' + TEST_ARGS='-tags xmlroundtrip' + go test -tags xmlroundtrip --- FAIL: TestRoundTrip (31.74s) xml_test.go:383: testdata/libvirt/tests/storagevolxml2xmlin/vol-luks-convert.xml: /volume[0]/source[0]: element in expected XML missing in actual XML FAIL exit status 1 FAIL _<https://ci.centos.org/job/libvirt-go-xml-master-check/systems=libvirt-fedora-rawhide/ws/> 32.037s Build step 'Execute shell' marked build as failure

See <https://ci.centos.org/job/libvirt-go-xml-master-check/systems=libvirt-fedora-rawhide/486/display/redirect> ------------------------------------------ Started by upstream project "libvirt-go-xml-master-check" build number 486 originally caused by: Started by upstream project "libvirt-go-xml-master-build" build number 495 originally caused by: Started by upstream project "libvirt-master-build" build number 1546 originally caused by: Started by an SCM change [EnvInject] - Loading node environment variables. Building remotely on libvirt-fedora-rawhide (libvirt) in workspace <https://ci.centos.org/job/libvirt-go-xml-master-check/systems=libvirt-fedora-rawhide/ws/> [libvirt-go-xml-master] $ /bin/sh -xe /tmp/jenkins7664369074048104381.sh + export 'TEST_ARGS=-tags xmlroundtrip' + TEST_ARGS='-tags xmlroundtrip' + go test -tags xmlroundtrip --- FAIL: TestRoundTrip (9.48s) xml_test.go:383: testdata/libvirt/tests/storagevolxml2xmlin/vol-luks-convert.xml: /volume[0]/source[0]: element in expected XML missing in actual XML FAIL exit status 1 FAIL _<https://ci.centos.org/job/libvirt-go-xml-master-check/systems=libvirt-fedora-rawhide/ws/> 9.546s Build step 'Execute shell' marked build as failure

See <https://ci.centos.org/job/libvirt-go-xml-master-check/systems=libvirt-fedora-rawhide/487/display/redirect> ------------------------------------------ Started by upstream project "libvirt-go-xml-master-check" build number 487 originally caused by: Started by upstream project "libvirt-go-xml-master-build" build number 496 originally caused by: Started by upstream project "libvirt-master-build" build number 1547 originally caused by: Started by an SCM change [EnvInject] - Loading node environment variables. Building remotely on libvirt-fedora-rawhide (libvirt) in workspace <https://ci.centos.org/job/libvirt-go-xml-master-check/systems=libvirt-fedora-rawhide/ws/> [libvirt-go-xml-master] $ /bin/sh -xe /tmp/jenkins5668415275196896393.sh + export 'TEST_ARGS=-tags xmlroundtrip' + TEST_ARGS='-tags xmlroundtrip' + go test -tags xmlroundtrip --- FAIL: TestRoundTrip (11.16s) xml_test.go:383: testdata/libvirt/tests/storagevolxml2xmlin/vol-luks-convert.xml: /volume[0]/source[0]: element in expected XML missing in actual XML FAIL exit status 1 FAIL _<https://ci.centos.org/job/libvirt-go-xml-master-check/systems=libvirt-fedora-rawhide/ws/> 11.255s Build step 'Execute shell' marked build as failure

See <https://ci.centos.org/job/libvirt-go-xml-master-check/systems=libvirt-fedora-rawhide/488/display/redirect> ------------------------------------------ Started by upstream project "libvirt-go-xml-master-check" build number 488 originally caused by: Started by upstream project "libvirt-go-xml-master-build" build number 497 originally caused by: Started by upstream project "libvirt-master-build" build number 1548 originally caused by: Started by an SCM change [EnvInject] - Loading node environment variables. Building remotely on libvirt-fedora-rawhide (libvirt) in workspace <https://ci.centos.org/job/libvirt-go-xml-master-check/systems=libvirt-fedora-rawhide/ws/> [libvirt-go-xml-master] $ /bin/sh -xe /tmp/jenkins282376194525899371.sh + export 'TEST_ARGS=-tags xmlroundtrip' + TEST_ARGS='-tags xmlroundtrip' + go test -tags xmlroundtrip --- FAIL: TestRoundTrip (12.62s) xml_test.go:383: testdata/libvirt/tests/storagevolxml2xmlin/vol-luks-convert.xml: /volume[0]/source[0]: element in expected XML missing in actual XML FAIL exit status 1 FAIL _<https://ci.centos.org/job/libvirt-go-xml-master-check/systems=libvirt-fedora-rawhide/ws/> 12.704s Build step 'Execute shell' marked build as failure

See <https://ci.centos.org/job/libvirt-go-xml-master-check/systems=libvirt-fedora-rawhide/489/display/redirect> ------------------------------------------ Started by upstream project "libvirt-go-xml-master-check" build number 489 originally caused by: Started by upstream project "libvirt-go-xml-master-build" build number 498 originally caused by: Started by upstream project "libvirt-master-build" build number 1549 originally caused by: Started by an SCM change Started by an SCM change Started by an SCM change [EnvInject] - Loading node environment variables. Building remotely on libvirt-fedora-rawhide (libvirt) in workspace <https://ci.centos.org/job/libvirt-go-xml-master-check/systems=libvirt-fedora-rawhide/ws/> [libvirt-go-xml-master] $ /bin/sh -xe /tmp/jenkins6683335664622002485.sh + export 'TEST_ARGS=-tags xmlroundtrip' + TEST_ARGS='-tags xmlroundtrip' + go test -tags xmlroundtrip --- FAIL: TestRoundTrip (23.21s) xml_test.go:383: testdata/libvirt/tests/storagevolxml2xmlin/vol-luks-convert.xml: /volume[0]/source[0]: element in expected XML missing in actual XML FAIL exit status 1 FAIL _<https://ci.centos.org/job/libvirt-go-xml-master-check/systems=libvirt-fedora-rawhide/ws/> 23.327s Build step 'Execute shell' marked build as failure

participants (1)
-
ci@centos.org