[Libvirt-ci] Build failed in Jenkins: virt-manager-check » libvirt-freebsd-12 #1388

See <https://ci.centos.org/job/virt-manager-check/systems=libvirt-freebsd-12/1388/display/redirect> ------------------------------------------ Started by upstream project "virt-manager-check" build number 1388 originally caused by: Started by upstream project "virt-manager-build" build number 1392 originally caused by: Started by upstream project "libosinfo-build" build number 311 originally caused by: Started by upstream project "osinfo-db-build" build number 204 originally caused by: Started by an SCM change Started by upstream project "libvirt-python-build" build number 946 originally caused by: Started by upstream project "libvirt-build" build number 1098 originally caused by: Started by an SCM change Started by an SCM change Started by an SCM change Running as SYSTEM [EnvInject] - Loading node environment variables. Building remotely on libvirt-freebsd-12 (libvirt) in workspace <https://ci.centos.org/job/virt-manager-check/systems=libvirt-freebsd-12/ws/> [virt-manager] $ /bin/sh -xe /tmp/jenkins9112861702639127371.sh + /usr/local/bin/python3 ./setup.py test running test Traceback (most recent call last): File "./setup.py", line 738, in <module> distclass=VMMDistribution, File "/usr/local/lib/python3.7/distutils/core.py", line 148, in setup dist.run_commands() File "/usr/local/lib/python3.7/distutils/dist.py", line 966, in run_commands self.run_command(cmd) File "/usr/local/lib/python3.7/distutils/dist.py", line 985, in run_command cmd_obj.run() File "./setup.py", line 528, in run TestBaseCommand.run(self) File "./setup.py", line 448, in run import tests as testsmodule File "/usr<https://ci.centos.org/job/virt-manager-check/systems=libvirt-freebsd-12/ws/tests/__init__.py",> line 16, in <module> from virtinst import buildconfig File "/usr<https://ci.centos.org/job/virt-manager-check/systems=libvirt-freebsd-12/ws/virtinst/__init__.py",> line 9, in <module> gi.require_version('Libosinfo', '1.0') File "/usr/local/lib/python3.7/site-packages/gi/__init__.py", line 130, in require_version raise ValueError('Namespace %s not available' % namespace) ValueError: Namespace Libosinfo not available Build step 'Execute shell' marked build as failure

See <https://ci.centos.org/job/virt-manager-check/systems=libvirt-freebsd-12/1389/display/redirect> ------------------------------------------ Started by upstream project "virt-manager-check" build number 1389 originally caused by: Started by upstream project "virt-manager-build" build number 1393 originally caused by: Started by upstream project "libvirt-python-build" build number 947 originally caused by: Started by upstream project "libvirt-build" build number 1099 originally caused by: Started by user Libvirt Running as SYSTEM [EnvInject] - Loading node environment variables. Building remotely on libvirt-freebsd-12 (libvirt) in workspace <https://ci.centos.org/job/virt-manager-check/systems=libvirt-freebsd-12/ws/> [virt-manager] $ /bin/sh -xe /tmp/jenkins6062328569385851348.sh + /usr/local/bin/python3 ./setup.py test running test Traceback (most recent call last): File "./setup.py", line 738, in <module> distclass=VMMDistribution, File "/usr/local/lib/python3.7/distutils/core.py", line 148, in setup dist.run_commands() File "/usr/local/lib/python3.7/distutils/dist.py", line 966, in run_commands self.run_command(cmd) File "/usr/local/lib/python3.7/distutils/dist.py", line 985, in run_command cmd_obj.run() File "./setup.py", line 528, in run TestBaseCommand.run(self) File "./setup.py", line 448, in run import tests as testsmodule File "/usr<https://ci.centos.org/job/virt-manager-check/systems=libvirt-freebsd-12/ws/tests/__init__.py",> line 16, in <module> from virtinst import buildconfig File "/usr<https://ci.centos.org/job/virt-manager-check/systems=libvirt-freebsd-12/ws/virtinst/__init__.py",> line 9, in <module> gi.require_version('Libosinfo', '1.0') File "/usr/local/lib/python3.7/site-packages/gi/__init__.py", line 130, in require_version raise ValueError('Namespace %s not available' % namespace) ValueError: Namespace Libosinfo not available Build step 'Execute shell' marked build as failure

See <https://ci.centos.org/job/virt-manager-check/systems=libvirt-freebsd-12/1390/display/redirect> ------------------------------------------ Started by upstream project "virt-manager-check" build number 1390 originally caused by: Started by upstream project "virt-manager-build" build number 1394 originally caused by: Started by upstream project "libvirt-python-build" build number 948 originally caused by: Started by upstream project "libvirt-build" build number 1100 originally caused by: Started by an SCM change Running as SYSTEM [EnvInject] - Loading node environment variables. Building remotely on libvirt-freebsd-12 (libvirt) in workspace <https://ci.centos.org/job/virt-manager-check/systems=libvirt-freebsd-12/ws/> [virt-manager] $ /bin/sh -xe /tmp/jenkins18439151410492225854.sh + /usr/local/bin/python3 ./setup.py test running test Traceback (most recent call last): File "./setup.py", line 738, in <module> distclass=VMMDistribution, File "/usr/local/lib/python3.7/distutils/core.py", line 148, in setup dist.run_commands() File "/usr/local/lib/python3.7/distutils/dist.py", line 966, in run_commands self.run_command(cmd) File "/usr/local/lib/python3.7/distutils/dist.py", line 985, in run_command cmd_obj.run() File "./setup.py", line 528, in run TestBaseCommand.run(self) File "./setup.py", line 448, in run import tests as testsmodule File "/usr<https://ci.centos.org/job/virt-manager-check/systems=libvirt-freebsd-12/ws/tests/__init__.py",> line 16, in <module> from virtinst import buildconfig File "/usr<https://ci.centos.org/job/virt-manager-check/systems=libvirt-freebsd-12/ws/virtinst/__init__.py",> line 9, in <module> gi.require_version('Libosinfo', '1.0') File "/usr/local/lib/python3.7/site-packages/gi/__init__.py", line 130, in require_version raise ValueError('Namespace %s not available' % namespace) ValueError: Namespace Libosinfo not available Build step 'Execute shell' marked build as failure

See <https://ci.centos.org/job/virt-manager-check/systems=libvirt-freebsd-12/1391/display/redirect> ------------------------------------------ Started by upstream project "virt-manager-check" build number 1391 originally caused by: Started by upstream project "virt-manager-build" build number 1395 originally caused by: Started by upstream project "libvirt-python-build" build number 949 originally caused by: Started by upstream project "libvirt-build" build number 1101 originally caused by: Started by an SCM change Started by an SCM change Started by an SCM change Started by an SCM change Running as SYSTEM [EnvInject] - Loading node environment variables. Building remotely on libvirt-freebsd-12 (libvirt) in workspace <https://ci.centos.org/job/virt-manager-check/systems=libvirt-freebsd-12/ws/> [virt-manager] $ /bin/sh -xe /tmp/jenkins10026936902950581828.sh + /usr/local/bin/python3 ./setup.py test running test Traceback (most recent call last): File "./setup.py", line 738, in <module> distclass=VMMDistribution, File "/usr/local/lib/python3.7/distutils/core.py", line 148, in setup dist.run_commands() File "/usr/local/lib/python3.7/distutils/dist.py", line 966, in run_commands self.run_command(cmd) File "/usr/local/lib/python3.7/distutils/dist.py", line 985, in run_command cmd_obj.run() File "./setup.py", line 528, in run TestBaseCommand.run(self) File "./setup.py", line 448, in run import tests as testsmodule File "/usr<https://ci.centos.org/job/virt-manager-check/systems=libvirt-freebsd-12/ws/tests/__init__.py",> line 16, in <module> from virtinst import buildconfig File "/usr<https://ci.centos.org/job/virt-manager-check/systems=libvirt-freebsd-12/ws/virtinst/__init__.py",> line 9, in <module> gi.require_version('Libosinfo', '1.0') File "/usr/local/lib/python3.7/site-packages/gi/__init__.py", line 130, in require_version raise ValueError('Namespace %s not available' % namespace) ValueError: Namespace Libosinfo not available Build step 'Execute shell' marked build as failure

See <https://ci.centos.org/job/virt-manager-check/systems=libvirt-freebsd-12/1392/display/redirect> ------------------------------------------ Started by upstream project "virt-manager-check" build number 1392 originally caused by: Started by upstream project "virt-manager-build" build number 1396 originally caused by: Started by upstream project "libvirt-python-build" build number 950 originally caused by: Started by upstream project "libvirt-build" build number 1102 originally caused by: Started by an SCM change Started by an SCM change Started by an SCM change Started by an SCM change Running as SYSTEM [EnvInject] - Loading node environment variables. Building remotely on libvirt-freebsd-12 (libvirt) in workspace <https://ci.centos.org/job/virt-manager-check/systems=libvirt-freebsd-12/ws/> [virt-manager] $ /bin/sh -xe /tmp/jenkins5491881523211149011.sh + /usr/local/bin/python3 ./setup.py test running test Traceback (most recent call last): File "./setup.py", line 738, in <module> distclass=VMMDistribution, File "/usr/local/lib/python3.7/distutils/core.py", line 148, in setup dist.run_commands() File "/usr/local/lib/python3.7/distutils/dist.py", line 966, in run_commands self.run_command(cmd) File "/usr/local/lib/python3.7/distutils/dist.py", line 985, in run_command cmd_obj.run() File "./setup.py", line 528, in run TestBaseCommand.run(self) File "./setup.py", line 448, in run import tests as testsmodule File "/usr<https://ci.centos.org/job/virt-manager-check/systems=libvirt-freebsd-12/ws/tests/__init__.py",> line 16, in <module> from virtinst import buildconfig File "/usr<https://ci.centos.org/job/virt-manager-check/systems=libvirt-freebsd-12/ws/virtinst/__init__.py",> line 9, in <module> gi.require_version('Libosinfo', '1.0') File "/usr/local/lib/python3.7/site-packages/gi/__init__.py", line 130, in require_version raise ValueError('Namespace %s not available' % namespace) ValueError: Namespace Libosinfo not available Build step 'Execute shell' marked build as failure

participants (1)
-
ci@centos.org