[Libvirt-ci] Build failed in Jenkins: libvirt-go-xml-master-check » libvirt-debian-9 #459

See <https://ci.centos.org/job/libvirt-go-xml-master-check/systems=libvirt-debian-9/459/display/redirect> ------------------------------------------ Started by upstream project "libvirt-go-xml-master-check" build number 459 originally caused by: Started by upstream project "libvirt-go-xml-master-build" build number 467 originally caused by: Started by upstream project "libvirt-master-build" build number 1519 originally caused by: Started by an SCM change Started by an SCM change [EnvInject] - Loading node environment variables. Building remotely on libvirt-debian-9 (libvirt) in workspace <https://ci.centos.org/job/libvirt-go-xml-master-check/systems=libvirt-debian-9/ws/> [libvirt-go-xml-master] $ /bin/sh -xe /tmp/jenkins8574005864840233339.sh + export TEST_ARGS=-tags xmlroundtrip + go test -tags xmlroundtrip --- FAIL: TestRoundTrip (13.47s) xml_test.go:383: testdata/libvirt/tests/genericxml2xmlindata/launch-security-sev.xml: /domain[0]/launch-security[0]: element in expected XML missing in actual XML FAIL exit status 1 FAIL _<https://ci.centos.org/job/libvirt-go-xml-master-check/systems=libvirt-debian-9/ws/> 13.729s Build step 'Execute shell' marked build as failure

See <https://ci.centos.org/job/libvirt-go-xml-master-check/systems=libvirt-debian-9/460/display/redirect> ------------------------------------------ Started by upstream project "libvirt-go-xml-master-check" build number 460 originally caused by: Started by upstream project "libvirt-go-xml-master-build" build number 468 originally caused by: Started by upstream project "libvirt-master-build" build number 1520 originally caused by: Started by an SCM change Started by an SCM change Started by an SCM change Started by an SCM change [EnvInject] - Loading node environment variables. Building remotely on libvirt-debian-9 (libvirt) in workspace <https://ci.centos.org/job/libvirt-go-xml-master-check/systems=libvirt-debian-9/ws/> [libvirt-go-xml-master] $ /bin/sh -xe /tmp/jenkins7702391775181815448.sh + export TEST_ARGS=-tags xmlroundtrip + go test -tags xmlroundtrip --- FAIL: TestRoundTrip (6.38s) xml_test.go:383: testdata/libvirt/tests/genericxml2xmlindata/launch-security-sev.xml: /domain[0]/launch-security[0]: element in expected XML missing in actual XML FAIL exit status 1 FAIL _<https://ci.centos.org/job/libvirt-go-xml-master-check/systems=libvirt-debian-9/ws/> 6.616s Build step 'Execute shell' marked build as failure

See <https://ci.centos.org/job/libvirt-go-xml-master-check/systems=libvirt-debian-9/461/display/redirect> ------------------------------------------ Started by upstream project "libvirt-go-xml-master-check" build number 461 originally caused by: Started by upstream project "libvirt-go-xml-master-build" build number 469 originally caused by: Started by upstream project "libvirt-master-build" build number 1521 originally caused by: Started by an SCM change [EnvInject] - Loading node environment variables. Building remotely on libvirt-debian-9 (libvirt) in workspace <https://ci.centos.org/job/libvirt-go-xml-master-check/systems=libvirt-debian-9/ws/> [libvirt-go-xml-master] $ /bin/sh -xe /tmp/jenkins3361421450912493341.sh + export TEST_ARGS=-tags xmlroundtrip + go test -tags xmlroundtrip --- FAIL: TestRoundTrip (10.49s) xml_test.go:383: testdata/libvirt/tests/genericxml2xmlindata/launch-security-sev.xml: /domain[0]/launch-security[0]: element in expected XML missing in actual XML FAIL exit status 1 FAIL _<https://ci.centos.org/job/libvirt-go-xml-master-check/systems=libvirt-debian-9/ws/> 10.705s Build step 'Execute shell' marked build as failure

See <https://ci.centos.org/job/libvirt-go-xml-master-check/systems=libvirt-debian-9/462/display/redirect> ------------------------------------------ Started by upstream project "libvirt-go-xml-master-check" build number 462 originally caused by: Started by upstream project "libvirt-go-xml-master-build" build number 470 originally caused by: Started by upstream project "libvirt-master-build" build number 1522 originally caused by: Started by an SCM change [EnvInject] - Loading node environment variables. Building remotely on libvirt-debian-9 (libvirt) in workspace <https://ci.centos.org/job/libvirt-go-xml-master-check/systems=libvirt-debian-9/ws/> [libvirt-go-xml-master] $ /bin/sh -xe /tmp/jenkins3358193627098128355.sh + export TEST_ARGS=-tags xmlroundtrip + go test -tags xmlroundtrip --- FAIL: TestRoundTrip (8.94s) xml_test.go:383: testdata/libvirt/tests/genericxml2xmlindata/launch-security-sev.xml: /domain[0]/launch-security[0]: element in expected XML missing in actual XML FAIL exit status 1 FAIL _<https://ci.centos.org/job/libvirt-go-xml-master-check/systems=libvirt-debian-9/ws/> 9.106s Build step 'Execute shell' marked build as failure

See <https://ci.centos.org/job/libvirt-go-xml-master-check/systems=libvirt-debian-9/463/display/redirect> ------------------------------------------ Started by upstream project "libvirt-go-xml-master-check" build number 463 originally caused by: Started by upstream project "libvirt-go-xml-master-build" build number 471 originally caused by: Started by upstream project "libvirt-master-build" build number 1523 originally caused by: Started by an SCM change [EnvInject] - Loading node environment variables. Building remotely on libvirt-debian-9 (libvirt) in workspace <https://ci.centos.org/job/libvirt-go-xml-master-check/systems=libvirt-debian-9/ws/> [libvirt-go-xml-master] $ /bin/sh -xe /tmp/jenkins5853662987653883241.sh + export TEST_ARGS=-tags xmlroundtrip + go test -tags xmlroundtrip --- FAIL: TestRoundTrip (11.12s) xml_test.go:383: testdata/libvirt/tests/genericxml2xmlindata/launch-security-sev.xml: /domain[0]/launch-security[0]: element in expected XML missing in actual XML FAIL exit status 1 FAIL _<https://ci.centos.org/job/libvirt-go-xml-master-check/systems=libvirt-debian-9/ws/> 11.274s Build step 'Execute shell' marked build as failure

See <https://ci.centos.org/job/libvirt-go-xml-master-check/systems=libvirt-debian-9/464/display/redirect> ------------------------------------------ Started by upstream project "libvirt-go-xml-master-check" build number 464 originally caused by: Started by upstream project "libvirt-go-xml-master-build" build number 472 originally caused by: Started by upstream project "libvirt-master-build" build number 1524 originally caused by: Started by an SCM change Started by an SCM change Started by an SCM change [EnvInject] - Loading node environment variables. Building remotely on libvirt-debian-9 (libvirt) in workspace <https://ci.centos.org/job/libvirt-go-xml-master-check/systems=libvirt-debian-9/ws/> [libvirt-go-xml-master] $ /bin/sh -xe /tmp/jenkins3858013515755073445.sh + export TEST_ARGS=-tags xmlroundtrip + go test -tags xmlroundtrip --- FAIL: TestRoundTrip (6.96s) xml_test.go:383: testdata/libvirt/tests/genericxml2xmlindata/launch-security-sev.xml: /domain[0]/launch-security[0]: element in expected XML missing in actual XML FAIL exit status 1 FAIL _<https://ci.centos.org/job/libvirt-go-xml-master-check/systems=libvirt-debian-9/ws/> 7.033s Build step 'Execute shell' marked build as failure

See <https://ci.centos.org/job/libvirt-go-xml-master-check/systems=libvirt-debian-9/465/display/redirect> ------------------------------------------ Started by upstream project "libvirt-go-xml-master-check" build number 465 originally caused by: Started by upstream project "libvirt-go-xml-master-build" build number 473 originally caused by: Started by upstream project "libvirt-master-build" build number 1525 originally caused by: Started by an SCM change [EnvInject] - Loading node environment variables. Building remotely on libvirt-debian-9 (libvirt) in workspace <https://ci.centos.org/job/libvirt-go-xml-master-check/systems=libvirt-debian-9/ws/> [libvirt-go-xml-master] $ /bin/sh -xe /tmp/jenkins7235416217971214751.sh + export TEST_ARGS=-tags xmlroundtrip + go test -tags xmlroundtrip --- FAIL: TestRoundTrip (7.45s) xml_test.go:383: testdata/libvirt/tests/genericxml2xmlindata/launch-security-sev.xml: /domain[0]/launch-security[0]: element in expected XML missing in actual XML FAIL exit status 1 FAIL _<https://ci.centos.org/job/libvirt-go-xml-master-check/systems=libvirt-debian-9/ws/> 7.646s Build step 'Execute shell' marked build as failure

See <https://ci.centos.org/job/libvirt-go-xml-master-check/systems=libvirt-debian-9/466/display/redirect> ------------------------------------------ Started by upstream project "libvirt-go-xml-master-check" build number 466 originally caused by: Started by upstream project "libvirt-go-xml-master-build" build number 474 originally caused by: Started by upstream project "libvirt-master-build" build number 1526 originally caused by: Started by an SCM change [EnvInject] - Loading node environment variables. Building remotely on libvirt-debian-9 (libvirt) in workspace <https://ci.centos.org/job/libvirt-go-xml-master-check/systems=libvirt-debian-9/ws/> [libvirt-go-xml-master] $ /bin/sh -xe /tmp/jenkins6424830778343687864.sh + export TEST_ARGS=-tags xmlroundtrip + go test -tags xmlroundtrip --- FAIL: TestRoundTrip (7.75s) xml_test.go:383: testdata/libvirt/tests/genericxml2xmlindata/launch-security-sev.xml: /domain[0]/launchSecurity[0]: element in expected XML missing in actual XML FAIL exit status 1 FAIL _<https://ci.centos.org/job/libvirt-go-xml-master-check/systems=libvirt-debian-9/ws/> 7.961s Build step 'Execute shell' marked build as failure

See <https://ci.centos.org/job/libvirt-go-xml-master-check/systems=libvirt-debian-9/467/display/redirect> ------------------------------------------ Started by upstream project "libvirt-go-xml-master-check" build number 467 originally caused by: Started by upstream project "libvirt-go-xml-master-build" build number 475 originally caused by: Started by upstream project "libvirt-master-build" build number 1527 originally caused by: Started by an SCM change [EnvInject] - Loading node environment variables. Building remotely on libvirt-debian-9 (libvirt) in workspace <https://ci.centos.org/job/libvirt-go-xml-master-check/systems=libvirt-debian-9/ws/> [libvirt-go-xml-master] $ /bin/sh -xe /tmp/jenkins69389735488739882.sh + export TEST_ARGS=-tags xmlroundtrip + go test -tags xmlroundtrip --- FAIL: TestRoundTrip (9.18s) xml_test.go:383: testdata/libvirt/tests/genericxml2xmlindata/launch-security-sev.xml: /domain[0]/launchSecurity[0]: element in expected XML missing in actual XML FAIL exit status 1 FAIL _<https://ci.centos.org/job/libvirt-go-xml-master-check/systems=libvirt-debian-9/ws/> 9.283s Build step 'Execute shell' marked build as failure

See <https://ci.centos.org/job/libvirt-go-xml-master-check/systems=libvirt-debian-9/468/display/redirect> ------------------------------------------ Started by upstream project "libvirt-go-xml-master-check" build number 468 originally caused by: Started by upstream project "libvirt-go-xml-master-build" build number 476 originally caused by: Started by upstream project "libvirt-master-build" build number 1528 originally caused by: Started by an SCM change [EnvInject] - Loading node environment variables. Building remotely on libvirt-debian-9 (libvirt) in workspace <https://ci.centos.org/job/libvirt-go-xml-master-check/systems=libvirt-debian-9/ws/> [libvirt-go-xml-master] $ /bin/sh -xe /tmp/jenkins8516683702883971860.sh + export TEST_ARGS=-tags xmlroundtrip + go test -tags xmlroundtrip --- FAIL: TestRoundTrip (14.08s) xml_test.go:383: testdata/libvirt/tests/genericxml2xmlindata/launch-security-sev.xml: /domain[0]/launchSecurity[0]: element in expected XML missing in actual XML FAIL exit status 1 FAIL _<https://ci.centos.org/job/libvirt-go-xml-master-check/systems=libvirt-debian-9/ws/> 14.273s Build step 'Execute shell' marked build as failure

See <https://ci.centos.org/job/libvirt-go-xml-master-check/systems=libvirt-debian-9/469/display/redirect> ------------------------------------------ Started by upstream project "libvirt-go-xml-master-check" build number 469 originally caused by: Started by upstream project "libvirt-go-xml-master-build" build number 477 originally caused by: Started by upstream project "libvirt-master-build" build number 1529 originally caused by: Started by an SCM change Started by an SCM change Started by an SCM change [EnvInject] - Loading node environment variables. Building remotely on libvirt-debian-9 (libvirt) in workspace <https://ci.centos.org/job/libvirt-go-xml-master-check/systems=libvirt-debian-9/ws/> [libvirt-go-xml-master] $ /bin/sh -xe /tmp/jenkins8485602941346443409.sh + export TEST_ARGS=-tags xmlroundtrip + go test -tags xmlroundtrip --- FAIL: TestRoundTrip (5.10s) xml_test.go:383: testdata/libvirt/tests/genericxml2xmlindata/launch-security-sev.xml: /domain[0]/launchSecurity[0]: element in expected XML missing in actual XML FAIL exit status 1 FAIL _<https://ci.centos.org/job/libvirt-go-xml-master-check/systems=libvirt-debian-9/ws/> 5.270s Build step 'Execute shell' marked build as failure

See <https://ci.centos.org/job/libvirt-go-xml-master-check/systems=libvirt-debian-9/470/display/redirect> ------------------------------------------ Started by upstream project "libvirt-go-xml-master-check" build number 470 originally caused by: Started by upstream project "libvirt-go-xml-master-build" build number 478 originally caused by: Started by upstream project "libvirt-master-build" build number 1530 originally caused by: Started by an SCM change [EnvInject] - Loading node environment variables. Building remotely on libvirt-debian-9 (libvirt) in workspace <https://ci.centos.org/job/libvirt-go-xml-master-check/systems=libvirt-debian-9/ws/> [libvirt-go-xml-master] $ /bin/sh -xe /tmp/jenkins8523667364676237225.sh + export TEST_ARGS=-tags xmlroundtrip + go test -tags xmlroundtrip --- FAIL: TestRoundTrip (8.85s) xml_test.go:383: testdata/libvirt/tests/genericxml2xmlindata/launch-security-sev.xml: /domain[0]/launchSecurity[0]: element in expected XML missing in actual XML FAIL exit status 1 FAIL _<https://ci.centos.org/job/libvirt-go-xml-master-check/systems=libvirt-debian-9/ws/> 9.008s Build step 'Execute shell' marked build as failure

See <https://ci.centos.org/job/libvirt-go-xml-master-check/systems=libvirt-debian-9/471/display/redirect> ------------------------------------------ Started by upstream project "libvirt-go-xml-master-check" build number 471 originally caused by: Started by upstream project "libvirt-go-xml-master-build" build number 479 originally caused by: Started by upstream project "libvirt-master-build" build number 1531 originally caused by: Started by an SCM change [EnvInject] - Loading node environment variables. Building remotely on libvirt-debian-9 (libvirt) in workspace <https://ci.centos.org/job/libvirt-go-xml-master-check/systems=libvirt-debian-9/ws/> [libvirt-go-xml-master] $ /bin/sh -xe /tmp/jenkins7092838045761984191.sh + export TEST_ARGS=-tags xmlroundtrip + go test -tags xmlroundtrip --- FAIL: TestRoundTrip (8.93s) xml_test.go:383: testdata/libvirt/tests/genericxml2xmlindata/launch-security-sev.xml: /domain[0]/launchSecurity[0]: element in expected XML missing in actual XML FAIL exit status 1 FAIL _<https://ci.centos.org/job/libvirt-go-xml-master-check/systems=libvirt-debian-9/ws/> 9.023s Build step 'Execute shell' marked build as failure

See <https://ci.centos.org/job/libvirt-go-xml-master-check/systems=libvirt-debian-9/472/display/redirect> ------------------------------------------ Started by upstream project "libvirt-go-xml-master-check" build number 472 originally caused by: Started by upstream project "libvirt-go-xml-master-build" build number 480 originally caused by: Started by upstream project "libvirt-master-build" build number 1532 originally caused by: Started by an SCM change [EnvInject] - Loading node environment variables. Building remotely on libvirt-debian-9 (libvirt) in workspace <https://ci.centos.org/job/libvirt-go-xml-master-check/systems=libvirt-debian-9/ws/> [libvirt-go-xml-master] $ /bin/sh -xe /tmp/jenkins8636334938765734288.sh + export TEST_ARGS=-tags xmlroundtrip + go test -tags xmlroundtrip --- FAIL: TestRoundTrip (8.89s) xml_test.go:383: testdata/libvirt/tests/genericxml2xmlindata/launch-security-sev.xml: /domain[0]/launchSecurity[0]: element in expected XML missing in actual XML FAIL exit status 1 FAIL _<https://ci.centos.org/job/libvirt-go-xml-master-check/systems=libvirt-debian-9/ws/> 9.185s Build step 'Execute shell' marked build as failure

See <https://ci.centos.org/job/libvirt-go-xml-master-check/systems=libvirt-debian-9/473/display/redirect> ------------------------------------------ Started by upstream project "libvirt-go-xml-master-check" build number 473 originally caused by: Started by upstream project "libvirt-go-xml-master-build" build number 481 originally caused by: Started by upstream project "libvirt-master-build" build number 1533 originally caused by: Started by an SCM change [EnvInject] - Loading node environment variables. Building remotely on libvirt-debian-9 (libvirt) in workspace <https://ci.centos.org/job/libvirt-go-xml-master-check/systems=libvirt-debian-9/ws/> [libvirt-go-xml-master] $ /bin/sh -xe /tmp/jenkins1775879586625154878.sh + export TEST_ARGS=-tags xmlroundtrip + go test -tags xmlroundtrip --- FAIL: TestRoundTrip (16.31s) xml_test.go:383: testdata/libvirt/tests/genericxml2xmlindata/launch-security-sev.xml: /domain[0]/launchSecurity[0]: element in expected XML missing in actual XML FAIL exit status 1 FAIL _<https://ci.centos.org/job/libvirt-go-xml-master-check/systems=libvirt-debian-9/ws/> 16.482s Build step 'Execute shell' marked build as failure

See <https://ci.centos.org/job/libvirt-go-xml-master-check/systems=libvirt-debian-9/474/display/redirect> ------------------------------------------ Started by upstream project "libvirt-go-xml-master-check" build number 474 originally caused by: Started by upstream project "libvirt-go-xml-master-build" build number 482 originally caused by: Started by upstream project "libvirt-master-build" build number 1534 originally caused by: Started by an SCM change [EnvInject] - Loading node environment variables. Building remotely on libvirt-debian-9 (libvirt) in workspace <https://ci.centos.org/job/libvirt-go-xml-master-check/systems=libvirt-debian-9/ws/> [libvirt-go-xml-master] $ /bin/sh -xe /tmp/jenkins3209712785167608937.sh + export TEST_ARGS=-tags xmlroundtrip + go test -tags xmlroundtrip --- FAIL: TestRoundTrip (6.98s) xml_test.go:383: testdata/libvirt/tests/domaincapsschemadata/basic.xml: /domainCapabilities[0]/features[0]/sev[0]: element in expected XML missing in actual XML FAIL exit status 1 FAIL _<https://ci.centos.org/job/libvirt-go-xml-master-check/systems=libvirt-debian-9/ws/> 7.166s Build step 'Execute shell' marked build as failure

See <https://ci.centos.org/job/libvirt-go-xml-master-check/systems=libvirt-debian-9/475/display/redirect> ------------------------------------------ Started by upstream project "libvirt-go-xml-master-check" build number 475 originally caused by: Started by upstream project "libvirt-go-xml-master-build" build number 483 originally caused by: Started by upstream project "libvirt-master-build" build number 1535 originally caused by: Started by an SCM change [EnvInject] - Loading node environment variables. Building remotely on libvirt-debian-9 (libvirt) in workspace <https://ci.centos.org/job/libvirt-go-xml-master-check/systems=libvirt-debian-9/ws/> [libvirt-go-xml-master] $ /bin/sh -xe /tmp/jenkins4433925141891803551.sh + export TEST_ARGS=-tags xmlroundtrip + go test -tags xmlroundtrip --- FAIL: TestRoundTrip (8.03s) xml_test.go:383: testdata/libvirt/tests/domaincapsschemadata/basic.xml: /domainCapabilities[0]/features[0]/sev[0]: element in expected XML missing in actual XML FAIL exit status 1 FAIL _<https://ci.centos.org/job/libvirt-go-xml-master-check/systems=libvirt-debian-9/ws/> 8.195s Build step 'Execute shell' marked build as failure

See <https://ci.centos.org/job/libvirt-go-xml-master-check/systems=libvirt-debian-9/476/display/redirect> ------------------------------------------ Started by upstream project "libvirt-go-xml-master-check" build number 476 originally caused by: Started by upstream project "libvirt-go-xml-master-build" build number 485 originally caused by: Started by upstream project "libvirt-master-build" build number 1537 originally caused by: Started by user Libvirt [EnvInject] - Loading node environment variables. Building remotely on libvirt-debian-9 (libvirt) in workspace <https://ci.centos.org/job/libvirt-go-xml-master-check/systems=libvirt-debian-9/ws/> [libvirt-go-xml-master] $ /bin/sh -xe /tmp/jenkins1189065902390809696.sh + export TEST_ARGS=-tags xmlroundtrip + go test -tags xmlroundtrip --- FAIL: TestRoundTrip (40.06s) xml_test.go:383: testdata/libvirt/tests/qemuxml2argvdata/name-escape.xml: /domain[0]/devices[0]/smartcard[0]/database[0]: element in expected XML missing in actual XML FAIL exit status 1 FAIL _<https://ci.centos.org/job/libvirt-go-xml-master-check/systems=libvirt-debian-9/ws/> 40.309s Build step 'Execute shell' marked build as failure

See <https://ci.centos.org/job/libvirt-go-xml-master-check/systems=libvirt-debian-9/477/display/redirect> ------------------------------------------ Started by upstream project "libvirt-go-xml-master-check" build number 477 originally caused by: Started by upstream project "libvirt-go-xml-master-build" build number 486 originally caused by: Started by upstream project "libvirt-master-build" build number 1538 originally caused by: Started by an SCM change Started by an SCM change [EnvInject] - Loading node environment variables. Building remotely on libvirt-debian-9 (libvirt) in workspace <https://ci.centos.org/job/libvirt-go-xml-master-check/systems=libvirt-debian-9/ws/> [libvirt-go-xml-master] $ /bin/sh -xe /tmp/jenkins8816844704477868728.sh + export TEST_ARGS=-tags xmlroundtrip + go test -tags xmlroundtrip --- FAIL: TestRoundTrip (26.51s) xml_test.go:383: testdata/libvirt/tests/qemuxml2argvdata/name-escape.xml: /domain[0]/devices[0]/smartcard[0]/database[0]: element in expected XML missing in actual XML FAIL exit status 1 FAIL _<https://ci.centos.org/job/libvirt-go-xml-master-check/systems=libvirt-debian-9/ws/> 26.647s Build step 'Execute shell' marked build as failure

participants (1)
-
ci@centos.org