[Libvirt-ci] Build failed in Jenkins: libvirt-go-check » libvirt-debian-8 #116

See <https://ci.centos.org/job/libvirt-go-check/systems=libvirt-debian-8/116/display/redirect> ------------------------------------------ Started by upstream project "libvirt-go-check" build number 116 originally caused by: Started by upstream project "libvirt-go-build" build number 120 originally caused by: Started by upstream project "libvirt-build" build number 143 originally caused by: Started by an SCM change [EnvInject] - Loading node environment variables. Building remotely on libvirt-debian-8 (libvirt) in workspace <https://ci.centos.org/job/libvirt-go-check/systems=libvirt-debian-8/ws/> [libvirt-go] $ /bin/sh -xe /tmp/jenkins4386244522910186647.sh + export TEST_ARGS=-tags api + go test -tags api Missing function 'virDomainSetIOThreadParams' Missing macro 'VIR_DOMAIN_IOTHREAD_POLL_GROW' Missing macro 'VIR_DOMAIN_IOTHREAD_POLL_MAX_NS' Missing macro 'VIR_DOMAIN_IOTHREAD_POLL_SHRINK' Missing enum 'VIR_DOMAIN_STATS_IOTHREAD' --- FAIL: TestAPICoverage (0.31s) panic: Missing symbols found [recovered] panic: Missing symbols found goroutine 5 [running]: panic(0x5b21c0, 0xc4200edef0) /usr/lib/go-1.7/src/runtime/panic.go:500 +0x1a1 testing.tRunner.func1(0xc42007c180) /usr/lib/go-1.7/src/testing/testing.go:579 +0x25d panic(0x5b21c0, 0xc4200edef0) /usr/lib/go-1.7/src/runtime/panic.go:458 +0x243 _<https://ci.centos.org/job/libvirt-go-check/systems=libvirt-debian-8/ws/.TestAPICoverage(0xc42007c180)> <https://ci.centos.org/job/libvirt-go-check/systems=libvirt-debian-8/ws/api_test.go>:507 +0x5ff testing.tRunner(0xc42007c180, 0x605948) /usr/lib/go-1.7/src/testing/testing.go:610 +0x81 created by testing.(*T).Run /usr/lib/go-1.7/src/testing/testing.go:646 +0x2ec exit status 2 FAIL _<https://ci.centos.org/job/libvirt-go-check/systems=libvirt-debian-8/ws/> 0.390s Build step 'Execute shell' marked build as failure

See <https://ci.centos.org/job/libvirt-go-check/systems=libvirt-debian-8/117/display/redirect> ------------------------------------------ Started by upstream project "libvirt-go-check" build number 117 originally caused by: Started by upstream project "libvirt-go-build" build number 121 originally caused by: Started by upstream project "libvirt-build" build number 144 originally caused by: Started by an SCM change [EnvInject] - Loading node environment variables. Building remotely on libvirt-debian-8 (libvirt) in workspace <https://ci.centos.org/job/libvirt-go-check/systems=libvirt-debian-8/ws/> [libvirt-go] $ /bin/sh -xe /tmp/jenkins8342813382895474234.sh + export TEST_ARGS=-tags api + go test -tags api Missing function 'virDomainSetIOThreadParams' Missing macro 'VIR_DOMAIN_IOTHREAD_POLL_GROW' Missing macro 'VIR_DOMAIN_IOTHREAD_POLL_MAX_NS' Missing macro 'VIR_DOMAIN_IOTHREAD_POLL_SHRINK' Missing enum 'VIR_DOMAIN_STATS_IOTHREAD' --- FAIL: TestAPICoverage (0.46s) panic: Missing symbols found [recovered] panic: Missing symbols found goroutine 5 [running]: panic(0x5b21c0, 0xc420222130) /usr/lib/go-1.7/src/runtime/panic.go:500 +0x1a1 testing.tRunner.func1(0xc420078180) /usr/lib/go-1.7/src/testing/testing.go:579 +0x25d panic(0x5b21c0, 0xc420222130) /usr/lib/go-1.7/src/runtime/panic.go:458 +0x243 _<https://ci.centos.org/job/libvirt-go-check/systems=libvirt-debian-8/ws/.TestAPICoverage(0xc420078180)> <https://ci.centos.org/job/libvirt-go-check/systems=libvirt-debian-8/ws/api_test.go>:507 +0x5ff testing.tRunner(0xc420078180, 0x605948) /usr/lib/go-1.7/src/testing/testing.go:610 +0x81 created by testing.(*T).Run /usr/lib/go-1.7/src/testing/testing.go:646 +0x2ec exit status 2 FAIL _<https://ci.centos.org/job/libvirt-go-check/systems=libvirt-debian-8/ws/> 0.523s Build step 'Execute shell' marked build as failure

See <https://ci.centos.org/job/libvirt-go-check/systems=libvirt-debian-8/118/display/redirect> ------------------------------------------ Started by upstream project "libvirt-go-check" build number 118 originally caused by: Started by upstream project "libvirt-go-build" build number 122 originally caused by: Started by upstream project "libvirt-build" build number 145 originally caused by: Started by an SCM change [EnvInject] - Loading node environment variables. Building remotely on libvirt-debian-8 (libvirt) in workspace <https://ci.centos.org/job/libvirt-go-check/systems=libvirt-debian-8/ws/> [libvirt-go] $ /bin/sh -xe /tmp/jenkins7453111426618373716.sh + export TEST_ARGS=-tags api + go test -tags api Missing function 'virDomainSetIOThreadParams' Missing macro 'VIR_DOMAIN_IOTHREAD_POLL_GROW' Missing macro 'VIR_DOMAIN_IOTHREAD_POLL_MAX_NS' Missing macro 'VIR_DOMAIN_IOTHREAD_POLL_SHRINK' Missing enum 'VIR_DOMAIN_STATS_IOTHREAD' --- FAIL: TestAPICoverage (0.31s) panic: Missing symbols found [recovered] panic: Missing symbols found goroutine 5 [running]: panic(0x5b21c0, 0xc420439fa0) /usr/lib/go-1.7/src/runtime/panic.go:500 +0x1a1 testing.tRunner.func1(0xc420078180) /usr/lib/go-1.7/src/testing/testing.go:579 +0x25d panic(0x5b21c0, 0xc420439fa0) /usr/lib/go-1.7/src/runtime/panic.go:458 +0x243 _<https://ci.centos.org/job/libvirt-go-check/systems=libvirt-debian-8/ws/.TestAPICoverage(0xc420078180)> <https://ci.centos.org/job/libvirt-go-check/systems=libvirt-debian-8/ws/api_test.go>:507 +0x5ff testing.tRunner(0xc420078180, 0x605948) /usr/lib/go-1.7/src/testing/testing.go:610 +0x81 created by testing.(*T).Run /usr/lib/go-1.7/src/testing/testing.go:646 +0x2ec exit status 2 FAIL _<https://ci.centos.org/job/libvirt-go-check/systems=libvirt-debian-8/ws/> 0.371s Build step 'Execute shell' marked build as failure

participants (1)
-
ci@centos.org