[Libvirt-ci] Build failed in Jenkins: libvirt-dbus-check » libvirt-freebsd-11 #290

See <https://ci.centos.org/job/libvirt-dbus-check/systems=libvirt-freebsd-11/290/display/redirect> ------------------------------------------ Started by upstream project "libvirt-dbus-check" build number 290 originally caused by: Started by upstream project "libvirt-dbus-syntax-check" build number 333 originally caused by: Started by upstream project "libvirt-dbus-build" build number 340 originally caused by: Started by upstream project "libvirt-glib-build" build number 337 originally caused by: Started by upstream project "libvirt-build" build number 435 originally caused by: Started by an SCM change [EnvInject] - Loading node environment variables. Building remotely on libvirt-freebsd-11 (libvirt) in workspace <https://ci.centos.org/job/libvirt-dbus-check/systems=libvirt-freebsd-11/ws/> [libvirt-dbus] $ /bin/sh -xe /tmp/jenkins4534165812246974153.sh + cd build + /usr/local/bin/gmake check Making check in data gmake[1]: Entering directory '/usr<https://ci.centos.org/job/libvirt-dbus-check/systems=libvirt-freebsd-11/ws/build/data'> gmake[1]: Nothing to be done for 'check'. gmake[1]: Leaving directory '/usr<https://ci.centos.org/job/libvirt-dbus-check/systems=libvirt-freebsd-11/ws/build/data'> Making check in docs gmake[1]: Entering directory '/usr<https://ci.centos.org/job/libvirt-dbus-check/systems=libvirt-freebsd-11/ws/build/docs'> gmake[1]: Nothing to be done for 'check'. gmake[1]: Leaving directory '/usr<https://ci.centos.org/job/libvirt-dbus-check/systems=libvirt-freebsd-11/ws/build/docs'> Making check in src gmake[1]: Entering directory '/usr<https://ci.centos.org/job/libvirt-dbus-check/systems=libvirt-freebsd-11/ws/build/src'> gmake[1]: Nothing to be done for 'check'. gmake[1]: Leaving directory '/usr<https://ci.centos.org/job/libvirt-dbus-check/systems=libvirt-freebsd-11/ws/build/src'> Making check in tests gmake[1]: Entering directory '/usr<https://ci.centos.org/job/libvirt-dbus-check/systems=libvirt-freebsd-11/ws/build/tests'> /usr/local/bin/gmake test_util gmake[2]: Entering directory '/usr<https://ci.centos.org/job/libvirt-dbus-check/systems=libvirt-freebsd-11/ws/build/tests'> CC test_util-test_util.o CCLD test_util gmake[2]: Leaving directory '/usr<https://ci.centos.org/job/libvirt-dbus-check/systems=libvirt-freebsd-11/ws/build/tests'> /usr/local/bin/gmake check-TESTS gmake[2]: Entering directory '/usr<https://ci.centos.org/job/libvirt-dbus-check/systems=libvirt-freebsd-11/ws/build/tests'> gmake[3]: Entering directory '/usr<https://ci.centos.org/job/libvirt-dbus-check/systems=libvirt-freebsd-11/ws/build/tests'> PASS: test_util PASS: test_interface.py PASS: test_domain.py PASS: test_network.py PASS: test_nodedev.py FAIL: test_connect.py PASS: test_storage.py ============================================================================ Testsuite summary for libvirt-dbus 1.4.0 ============================================================================ # TOTAL: 7 # PASS: 6 # SKIP: 0 # XFAIL: 0 # FAIL: 1 # XPASS: 0 # ERROR: 0 ============================================================================ See tests/test-suite.log Please report to libvir-list@redhat.com ============================================================================ gmake[3]: *** [Makefile:766: test-suite.log] Error 1 gmake[3]: Leaving directory '/usr<https://ci.centos.org/job/libvirt-dbus-check/systems=libvirt-freebsd-11/ws/build/tests'> gmake[2]: *** [Makefile:874: check-TESTS] Error 2 gmake[2]: Leaving directory '/usr<https://ci.centos.org/job/libvirt-dbus-check/systems=libvirt-freebsd-11/ws/build/tests'> gmake[1]: *** [Makefile:990: check-am] Error 2 gmake[1]: Leaving directory '/usr<https://ci.centos.org/job/libvirt-dbus-check/systems=libvirt-freebsd-11/ws/build/tests'> gmake: *** [Makefile:460: check-recursive] Error 1 + cat tests/test-suite.log ============================================== libvirt-dbus 1.4.0: tests/test-suite.log ============================================== # TOTAL: 7 # PASS: 6 # SKIP: 0 # XFAIL: 0 # FAIL: 1 # XPASS: 0 # ERROR: 0 .. contents:: :depth: 2 FAIL: test_connect.py ===================== ============================= test session starts ============================== platform freebsd11 -- Python 3.6.8, pytest-4.3.1, py-1.8.0, pluggy-0.7.1 rootdir: /usr<https://ci.centos.org/job/libvirt-dbus-check/systems=libvirt-freebsd-11/ws/,> inifile: collected 35 items ../../tests/test_connect.py .........................F......... [100%] =================================== FAILURES =================================== _______________ TestConnect.test_connect_node_device_create_xml ________________ Fixture "node_device_create" called directly. Fixtures are not meant to be called directly, but are created automatically when test functions request them as parameters. See https://docs.pytest.org/en/latest/fixture.html for more information about fixtures, and https://docs.pytest.org/en/latest/deprecations.html#calling-fixtures-directl... about how to update your code. ===================== 1 failed, 34 passed in 15.02 seconds ===================== FAIL test_connect.py (exit status: 1) + exit 1 Build step 'Execute shell' marked build as failure

See <https://ci.centos.org/job/libvirt-dbus-check/systems=libvirt-freebsd-11/291/display/redirect> ------------------------------------------ Started by upstream project "libvirt-dbus-check" build number 291 originally caused by: Started by upstream project "libvirt-dbus-syntax-check" build number 334 originally caused by: Started by upstream project "libvirt-dbus-build" build number 341 originally caused by: Started by upstream project "libvirt-glib-build" build number 338 originally caused by: Started by upstream project "libvirt-build" build number 436 originally caused by: Started by an SCM change [EnvInject] - Loading node environment variables. Building remotely on libvirt-freebsd-11 (libvirt) in workspace <https://ci.centos.org/job/libvirt-dbus-check/systems=libvirt-freebsd-11/ws/> [libvirt-dbus] $ /bin/sh -xe /tmp/jenkins6052063720813999375.sh + cd build + /usr/local/bin/gmake check Making check in data gmake[1]: Entering directory '/usr<https://ci.centos.org/job/libvirt-dbus-check/systems=libvirt-freebsd-11/ws/build/data'> gmake[1]: Nothing to be done for 'check'. gmake[1]: Leaving directory '/usr<https://ci.centos.org/job/libvirt-dbus-check/systems=libvirt-freebsd-11/ws/build/data'> Making check in docs gmake[1]: Entering directory '/usr<https://ci.centos.org/job/libvirt-dbus-check/systems=libvirt-freebsd-11/ws/build/docs'> gmake[1]: Nothing to be done for 'check'. gmake[1]: Leaving directory '/usr<https://ci.centos.org/job/libvirt-dbus-check/systems=libvirt-freebsd-11/ws/build/docs'> Making check in src gmake[1]: Entering directory '/usr<https://ci.centos.org/job/libvirt-dbus-check/systems=libvirt-freebsd-11/ws/build/src'> gmake[1]: Nothing to be done for 'check'. gmake[1]: Leaving directory '/usr<https://ci.centos.org/job/libvirt-dbus-check/systems=libvirt-freebsd-11/ws/build/src'> Making check in tests gmake[1]: Entering directory '/usr<https://ci.centos.org/job/libvirt-dbus-check/systems=libvirt-freebsd-11/ws/build/tests'> /usr/local/bin/gmake test_util gmake[2]: Entering directory '/usr<https://ci.centos.org/job/libvirt-dbus-check/systems=libvirt-freebsd-11/ws/build/tests'> CC test_util-test_util.o CCLD test_util gmake[2]: Leaving directory '/usr<https://ci.centos.org/job/libvirt-dbus-check/systems=libvirt-freebsd-11/ws/build/tests'> /usr/local/bin/gmake check-TESTS gmake[2]: Entering directory '/usr<https://ci.centos.org/job/libvirt-dbus-check/systems=libvirt-freebsd-11/ws/build/tests'> gmake[3]: Entering directory '/usr<https://ci.centos.org/job/libvirt-dbus-check/systems=libvirt-freebsd-11/ws/build/tests'> PASS: test_util PASS: test_interface.py PASS: test_domain.py PASS: test_network.py PASS: test_nodedev.py FAIL: test_connect.py PASS: test_storage.py ============================================================================ Testsuite summary for libvirt-dbus 1.4.0 ============================================================================ # TOTAL: 7 # PASS: 6 # SKIP: 0 # XFAIL: 0 # FAIL: 1 # XPASS: 0 # ERROR: 0 ============================================================================ See tests/test-suite.log Please report to libvir-list@redhat.com ============================================================================ gmake[3]: *** [Makefile:766: test-suite.log] Error 1 gmake[3]: Leaving directory '/usr<https://ci.centos.org/job/libvirt-dbus-check/systems=libvirt-freebsd-11/ws/build/tests'> gmake[2]: *** [Makefile:874: check-TESTS] Error 2 gmake[2]: Leaving directory '/usr<https://ci.centos.org/job/libvirt-dbus-check/systems=libvirt-freebsd-11/ws/build/tests'> gmake[1]: *** [Makefile:990: check-am] Error 2 gmake[1]: Leaving directory '/usr<https://ci.centos.org/job/libvirt-dbus-check/systems=libvirt-freebsd-11/ws/build/tests'> gmake: *** [Makefile:460: check-recursive] Error 1 + cat tests/test-suite.log ============================================== libvirt-dbus 1.4.0: tests/test-suite.log ============================================== # TOTAL: 7 # PASS: 6 # SKIP: 0 # XFAIL: 0 # FAIL: 1 # XPASS: 0 # ERROR: 0 .. contents:: :depth: 2 FAIL: test_connect.py ===================== ============================= test session starts ============================== platform freebsd11 -- Python 3.6.8, pytest-4.3.1, py-1.8.0, pluggy-0.7.1 rootdir: /usr<https://ci.centos.org/job/libvirt-dbus-check/systems=libvirt-freebsd-11/ws/,> inifile: collected 35 items ../../tests/test_connect.py .........................F......... [100%] =================================== FAILURES =================================== _______________ TestConnect.test_connect_node_device_create_xml ________________ Fixture "node_device_create" called directly. Fixtures are not meant to be called directly, but are created automatically when test functions request them as parameters. See https://docs.pytest.org/en/latest/fixture.html for more information about fixtures, and https://docs.pytest.org/en/latest/deprecations.html#calling-fixtures-directl... about how to update your code. ===================== 1 failed, 34 passed in 14.33 seconds ===================== FAIL test_connect.py (exit status: 1) + exit 1 Build step 'Execute shell' marked build as failure

See <https://ci.centos.org/job/libvirt-dbus-check/systems=libvirt-freebsd-11/292/display/redirect> ------------------------------------------ Started by upstream project "libvirt-dbus-check" build number 292 originally caused by: Started by upstream project "libvirt-dbus-syntax-check" build number 335 originally caused by: Started by upstream project "libvirt-dbus-build" build number 342 originally caused by: Started by upstream project "libvirt-glib-build" build number 339 originally caused by: Started by upstream project "libvirt-build" build number 437 originally caused by: Started by an SCM change [EnvInject] - Loading node environment variables. Building remotely on libvirt-freebsd-11 (libvirt) in workspace <https://ci.centos.org/job/libvirt-dbus-check/systems=libvirt-freebsd-11/ws/> [libvirt-dbus] $ /bin/sh -xe /tmp/jenkins3072299121992691776.sh + cd build + /usr/local/bin/gmake check Making check in data gmake[1]: Entering directory '/usr<https://ci.centos.org/job/libvirt-dbus-check/systems=libvirt-freebsd-11/ws/build/data'> gmake[1]: Nothing to be done for 'check'. gmake[1]: Leaving directory '/usr<https://ci.centos.org/job/libvirt-dbus-check/systems=libvirt-freebsd-11/ws/build/data'> Making check in docs gmake[1]: Entering directory '/usr<https://ci.centos.org/job/libvirt-dbus-check/systems=libvirt-freebsd-11/ws/build/docs'> gmake[1]: Nothing to be done for 'check'. gmake[1]: Leaving directory '/usr<https://ci.centos.org/job/libvirt-dbus-check/systems=libvirt-freebsd-11/ws/build/docs'> Making check in src gmake[1]: Entering directory '/usr<https://ci.centos.org/job/libvirt-dbus-check/systems=libvirt-freebsd-11/ws/build/src'> gmake[1]: Nothing to be done for 'check'. gmake[1]: Leaving directory '/usr<https://ci.centos.org/job/libvirt-dbus-check/systems=libvirt-freebsd-11/ws/build/src'> Making check in tests gmake[1]: Entering directory '/usr<https://ci.centos.org/job/libvirt-dbus-check/systems=libvirt-freebsd-11/ws/build/tests'> /usr/local/bin/gmake test_util gmake[2]: Entering directory '/usr<https://ci.centos.org/job/libvirt-dbus-check/systems=libvirt-freebsd-11/ws/build/tests'> CC test_util-test_util.o CCLD test_util gmake[2]: Leaving directory '/usr<https://ci.centos.org/job/libvirt-dbus-check/systems=libvirt-freebsd-11/ws/build/tests'> /usr/local/bin/gmake check-TESTS gmake[2]: Entering directory '/usr<https://ci.centos.org/job/libvirt-dbus-check/systems=libvirt-freebsd-11/ws/build/tests'> gmake[3]: Entering directory '/usr<https://ci.centos.org/job/libvirt-dbus-check/systems=libvirt-freebsd-11/ws/build/tests'> PASS: test_util PASS: test_interface.py PASS: test_domain.py PASS: test_network.py PASS: test_nodedev.py FAIL: test_connect.py PASS: test_storage.py ============================================================================ Testsuite summary for libvirt-dbus 1.4.0 ============================================================================ # TOTAL: 7 # PASS: 6 # SKIP: 0 # XFAIL: 0 # FAIL: 1 # XPASS: 0 # ERROR: 0 ============================================================================ See tests/test-suite.log Please report to libvir-list@redhat.com ============================================================================ gmake[3]: *** [Makefile:766: test-suite.log] Error 1 gmake[3]: Leaving directory '/usr<https://ci.centos.org/job/libvirt-dbus-check/systems=libvirt-freebsd-11/ws/build/tests'> gmake[2]: *** [Makefile:874: check-TESTS] Error 2 gmake[2]: Leaving directory '/usr<https://ci.centos.org/job/libvirt-dbus-check/systems=libvirt-freebsd-11/ws/build/tests'> gmake[1]: *** [Makefile:990: check-am] Error 2 gmake[1]: Leaving directory '/usr<https://ci.centos.org/job/libvirt-dbus-check/systems=libvirt-freebsd-11/ws/build/tests'> gmake: *** [Makefile:460: check-recursive] Error 1 + cat tests/test-suite.log ============================================== libvirt-dbus 1.4.0: tests/test-suite.log ============================================== # TOTAL: 7 # PASS: 6 # SKIP: 0 # XFAIL: 0 # FAIL: 1 # XPASS: 0 # ERROR: 0 .. contents:: :depth: 2 FAIL: test_connect.py ===================== ============================= test session starts ============================== platform freebsd11 -- Python 3.6.8, pytest-4.3.1, py-1.8.0, pluggy-0.7.1 rootdir: /usr<https://ci.centos.org/job/libvirt-dbus-check/systems=libvirt-freebsd-11/ws/,> inifile: collected 35 items ../../tests/test_connect.py .........................F......... [100%] =================================== FAILURES =================================== _______________ TestConnect.test_connect_node_device_create_xml ________________ Fixture "node_device_create" called directly. Fixtures are not meant to be called directly, but are created automatically when test functions request them as parameters. See https://docs.pytest.org/en/latest/fixture.html for more information about fixtures, and https://docs.pytest.org/en/latest/deprecations.html#calling-fixtures-directl... about how to update your code. ===================== 1 failed, 34 passed in 15.88 seconds ===================== FAIL test_connect.py (exit status: 1) + exit 1 Build step 'Execute shell' marked build as failure

See <https://ci.centos.org/job/libvirt-dbus-check/systems=libvirt-freebsd-11/293/display/redirect> ------------------------------------------ Started by upstream project "libvirt-dbus-check" build number 293 originally caused by: Started by upstream project "libvirt-dbus-syntax-check" build number 336 originally caused by: Started by upstream project "libvirt-dbus-build" build number 343 originally caused by: Started by upstream project "libvirt-glib-build" build number 340 originally caused by: Started by upstream project "libvirt-build" build number 438 originally caused by: Started by an SCM change [EnvInject] - Loading node environment variables. Building remotely on libvirt-freebsd-11 (libvirt) in workspace <https://ci.centos.org/job/libvirt-dbus-check/systems=libvirt-freebsd-11/ws/> [libvirt-dbus] $ /bin/sh -xe /tmp/jenkins7677237924997325413.sh + cd build + /usr/local/bin/gmake check Making check in data gmake[1]: Entering directory '/usr<https://ci.centos.org/job/libvirt-dbus-check/systems=libvirt-freebsd-11/ws/build/data'> gmake[1]: Nothing to be done for 'check'. gmake[1]: Leaving directory '/usr<https://ci.centos.org/job/libvirt-dbus-check/systems=libvirt-freebsd-11/ws/build/data'> Making check in docs gmake[1]: Entering directory '/usr<https://ci.centos.org/job/libvirt-dbus-check/systems=libvirt-freebsd-11/ws/build/docs'> gmake[1]: Nothing to be done for 'check'. gmake[1]: Leaving directory '/usr<https://ci.centos.org/job/libvirt-dbus-check/systems=libvirt-freebsd-11/ws/build/docs'> Making check in src gmake[1]: Entering directory '/usr<https://ci.centos.org/job/libvirt-dbus-check/systems=libvirt-freebsd-11/ws/build/src'> gmake[1]: Nothing to be done for 'check'. gmake[1]: Leaving directory '/usr<https://ci.centos.org/job/libvirt-dbus-check/systems=libvirt-freebsd-11/ws/build/src'> Making check in tests gmake[1]: Entering directory '/usr<https://ci.centos.org/job/libvirt-dbus-check/systems=libvirt-freebsd-11/ws/build/tests'> /usr/local/bin/gmake test_util gmake[2]: Entering directory '/usr<https://ci.centos.org/job/libvirt-dbus-check/systems=libvirt-freebsd-11/ws/build/tests'> CC test_util-test_util.o CCLD test_util gmake[2]: Leaving directory '/usr<https://ci.centos.org/job/libvirt-dbus-check/systems=libvirt-freebsd-11/ws/build/tests'> /usr/local/bin/gmake check-TESTS gmake[2]: Entering directory '/usr<https://ci.centos.org/job/libvirt-dbus-check/systems=libvirt-freebsd-11/ws/build/tests'> gmake[3]: Entering directory '/usr<https://ci.centos.org/job/libvirt-dbus-check/systems=libvirt-freebsd-11/ws/build/tests'> PASS: test_util PASS: test_interface.py PASS: test_domain.py PASS: test_network.py PASS: test_nodedev.py FAIL: test_connect.py PASS: test_storage.py ============================================================================ Testsuite summary for libvirt-dbus 1.4.0 ============================================================================ # TOTAL: 7 # PASS: 6 # SKIP: 0 # XFAIL: 0 # FAIL: 1 # XPASS: 0 # ERROR: 0 ============================================================================ See tests/test-suite.log Please report to libvir-list@redhat.com ============================================================================ gmake[3]: *** [Makefile:766: test-suite.log] Error 1 gmake[3]: Leaving directory '/usr<https://ci.centos.org/job/libvirt-dbus-check/systems=libvirt-freebsd-11/ws/build/tests'> gmake[2]: *** [Makefile:874: check-TESTS] Error 2 gmake[2]: Leaving directory '/usr<https://ci.centos.org/job/libvirt-dbus-check/systems=libvirt-freebsd-11/ws/build/tests'> gmake[1]: *** [Makefile:990: check-am] Error 2 gmake[1]: Leaving directory '/usr<https://ci.centos.org/job/libvirt-dbus-check/systems=libvirt-freebsd-11/ws/build/tests'> gmake: *** [Makefile:460: check-recursive] Error 1 + cat tests/test-suite.log ============================================== libvirt-dbus 1.4.0: tests/test-suite.log ============================================== # TOTAL: 7 # PASS: 6 # SKIP: 0 # XFAIL: 0 # FAIL: 1 # XPASS: 0 # ERROR: 0 .. contents:: :depth: 2 FAIL: test_connect.py ===================== ============================= test session starts ============================== platform freebsd11 -- Python 3.6.8, pytest-4.3.1, py-1.8.0, pluggy-0.7.1 rootdir: /usr<https://ci.centos.org/job/libvirt-dbus-check/systems=libvirt-freebsd-11/ws/,> inifile: collected 35 items ../../tests/test_connect.py .........................F......... [100%] =================================== FAILURES =================================== _______________ TestConnect.test_connect_node_device_create_xml ________________ Fixture "node_device_create" called directly. Fixtures are not meant to be called directly, but are created automatically when test functions request them as parameters. See https://docs.pytest.org/en/latest/fixture.html for more information about fixtures, and https://docs.pytest.org/en/latest/deprecations.html#calling-fixtures-directl... about how to update your code. ===================== 1 failed, 34 passed in 13.17 seconds ===================== FAIL test_connect.py (exit status: 1) + exit 1 Build step 'Execute shell' marked build as failure

See <https://ci.centos.org/job/libvirt-dbus-check/systems=libvirt-freebsd-11/294/display/redirect> ------------------------------------------ Started by upstream project "libvirt-dbus-check" build number 294 originally caused by: Started by upstream project "libvirt-dbus-syntax-check" build number 337 originally caused by: Started by upstream project "libvirt-dbus-build" build number 344 originally caused by: Started by upstream project "libvirt-glib-build" build number 341 originally caused by: Started by upstream project "libvirt-build" build number 439 originally caused by: Started by an SCM change Started by an SCM change Started by an SCM change Started by an SCM change Started by an SCM change Started by an SCM change Started by an SCM change Started by an SCM change Started by an SCM change Started by an SCM change [EnvInject] - Loading node environment variables. Building remotely on libvirt-freebsd-11 (libvirt) in workspace <https://ci.centos.org/job/libvirt-dbus-check/systems=libvirt-freebsd-11/ws/> [libvirt-dbus] $ /bin/sh -xe /tmp/jenkins5187640467453371326.sh + cd build + /usr/local/bin/gmake check Making check in data gmake[1]: Entering directory '/usr<https://ci.centos.org/job/libvirt-dbus-check/systems=libvirt-freebsd-11/ws/build/data'> gmake[1]: Nothing to be done for 'check'. gmake[1]: Leaving directory '/usr<https://ci.centos.org/job/libvirt-dbus-check/systems=libvirt-freebsd-11/ws/build/data'> Making check in docs gmake[1]: Entering directory '/usr<https://ci.centos.org/job/libvirt-dbus-check/systems=libvirt-freebsd-11/ws/build/docs'> gmake[1]: Nothing to be done for 'check'. gmake[1]: Leaving directory '/usr<https://ci.centos.org/job/libvirt-dbus-check/systems=libvirt-freebsd-11/ws/build/docs'> Making check in src gmake[1]: Entering directory '/usr<https://ci.centos.org/job/libvirt-dbus-check/systems=libvirt-freebsd-11/ws/build/src'> gmake[1]: Nothing to be done for 'check'. gmake[1]: Leaving directory '/usr<https://ci.centos.org/job/libvirt-dbus-check/systems=libvirt-freebsd-11/ws/build/src'> Making check in tests gmake[1]: Entering directory '/usr<https://ci.centos.org/job/libvirt-dbus-check/systems=libvirt-freebsd-11/ws/build/tests'> /usr/local/bin/gmake test_util gmake[2]: Entering directory '/usr<https://ci.centos.org/job/libvirt-dbus-check/systems=libvirt-freebsd-11/ws/build/tests'> CC test_util-test_util.o CCLD test_util gmake[2]: Leaving directory '/usr<https://ci.centos.org/job/libvirt-dbus-check/systems=libvirt-freebsd-11/ws/build/tests'> /usr/local/bin/gmake check-TESTS gmake[2]: Entering directory '/usr<https://ci.centos.org/job/libvirt-dbus-check/systems=libvirt-freebsd-11/ws/build/tests'> gmake[3]: Entering directory '/usr<https://ci.centos.org/job/libvirt-dbus-check/systems=libvirt-freebsd-11/ws/build/tests'> PASS: test_util PASS: test_interface.py PASS: test_domain.py PASS: test_network.py PASS: test_nodedev.py FAIL: test_connect.py PASS: test_storage.py ============================================================================ Testsuite summary for libvirt-dbus 1.4.0 ============================================================================ # TOTAL: 7 # PASS: 6 # SKIP: 0 # XFAIL: 0 # FAIL: 1 # XPASS: 0 # ERROR: 0 ============================================================================ See tests/test-suite.log Please report to libvir-list@redhat.com ============================================================================ gmake[3]: *** [Makefile:766: test-suite.log] Error 1 gmake[3]: Leaving directory '/usr<https://ci.centos.org/job/libvirt-dbus-check/systems=libvirt-freebsd-11/ws/build/tests'> gmake[2]: *** [Makefile:874: check-TESTS] Error 2 gmake[2]: Leaving directory '/usr<https://ci.centos.org/job/libvirt-dbus-check/systems=libvirt-freebsd-11/ws/build/tests'> gmake[1]: *** [Makefile:990: check-am] Error 2 gmake[1]: Leaving directory '/usr<https://ci.centos.org/job/libvirt-dbus-check/systems=libvirt-freebsd-11/ws/build/tests'> gmake: *** [Makefile:460: check-recursive] Error 1 + cat tests/test-suite.log ============================================== libvirt-dbus 1.4.0: tests/test-suite.log ============================================== # TOTAL: 7 # PASS: 6 # SKIP: 0 # XFAIL: 0 # FAIL: 1 # XPASS: 0 # ERROR: 0 .. contents:: :depth: 2 FAIL: test_connect.py ===================== ============================= test session starts ============================== platform freebsd11 -- Python 3.6.8, pytest-4.3.1, py-1.8.0, pluggy-0.7.1 rootdir: /usr<https://ci.centos.org/job/libvirt-dbus-check/systems=libvirt-freebsd-11/ws/,> inifile: collected 35 items ../../tests/test_connect.py .........................F......... [100%] =================================== FAILURES =================================== _______________ TestConnect.test_connect_node_device_create_xml ________________ Fixture "node_device_create" called directly. Fixtures are not meant to be called directly, but are created automatically when test functions request them as parameters. See https://docs.pytest.org/en/latest/fixture.html for more information about fixtures, and https://docs.pytest.org/en/latest/deprecations.html#calling-fixtures-directl... about how to update your code. ===================== 1 failed, 34 passed in 14.41 seconds ===================== FAIL test_connect.py (exit status: 1) + exit 1 Build step 'Execute shell' marked build as failure

See <https://ci.centos.org/job/libvirt-dbus-check/systems=libvirt-freebsd-11/295/display/redirect> ------------------------------------------ Started by upstream project "libvirt-dbus-check" build number 295 originally caused by: Started by upstream project "libvirt-dbus-syntax-check" build number 338 originally caused by: Started by upstream project "libvirt-dbus-build" build number 345 originally caused by: Started by upstream project "libvirt-glib-build" build number 342 originally caused by: Started by upstream project "libvirt-build" build number 440 originally caused by: Started by an SCM change Started by an SCM change Started by an SCM change Started by an SCM change Started by an SCM change Started by an SCM change Started by an SCM change [EnvInject] - Loading node environment variables. Building remotely on libvirt-freebsd-11 (libvirt) in workspace <https://ci.centos.org/job/libvirt-dbus-check/systems=libvirt-freebsd-11/ws/> [libvirt-dbus] $ /bin/sh -xe /tmp/jenkins4162330936117984788.sh + cd build + /usr/local/bin/gmake check Making check in data gmake[1]: Entering directory '/usr<https://ci.centos.org/job/libvirt-dbus-check/systems=libvirt-freebsd-11/ws/build/data'> gmake[1]: Nothing to be done for 'check'. gmake[1]: Leaving directory '/usr<https://ci.centos.org/job/libvirt-dbus-check/systems=libvirt-freebsd-11/ws/build/data'> Making check in docs gmake[1]: Entering directory '/usr<https://ci.centos.org/job/libvirt-dbus-check/systems=libvirt-freebsd-11/ws/build/docs'> gmake[1]: Nothing to be done for 'check'. gmake[1]: Leaving directory '/usr<https://ci.centos.org/job/libvirt-dbus-check/systems=libvirt-freebsd-11/ws/build/docs'> Making check in src gmake[1]: Entering directory '/usr<https://ci.centos.org/job/libvirt-dbus-check/systems=libvirt-freebsd-11/ws/build/src'> gmake[1]: Nothing to be done for 'check'. gmake[1]: Leaving directory '/usr<https://ci.centos.org/job/libvirt-dbus-check/systems=libvirt-freebsd-11/ws/build/src'> Making check in tests gmake[1]: Entering directory '/usr<https://ci.centos.org/job/libvirt-dbus-check/systems=libvirt-freebsd-11/ws/build/tests'> /usr/local/bin/gmake test_util gmake[2]: Entering directory '/usr<https://ci.centos.org/job/libvirt-dbus-check/systems=libvirt-freebsd-11/ws/build/tests'> CC test_util-test_util.o CCLD test_util gmake[2]: Leaving directory '/usr<https://ci.centos.org/job/libvirt-dbus-check/systems=libvirt-freebsd-11/ws/build/tests'> /usr/local/bin/gmake check-TESTS gmake[2]: Entering directory '/usr<https://ci.centos.org/job/libvirt-dbus-check/systems=libvirt-freebsd-11/ws/build/tests'> gmake[3]: Entering directory '/usr<https://ci.centos.org/job/libvirt-dbus-check/systems=libvirt-freebsd-11/ws/build/tests'> PASS: test_util PASS: test_interface.py PASS: test_domain.py PASS: test_network.py PASS: test_nodedev.py FAIL: test_connect.py PASS: test_storage.py ============================================================================ Testsuite summary for libvirt-dbus 1.4.0 ============================================================================ # TOTAL: 7 # PASS: 6 # SKIP: 0 # XFAIL: 0 # FAIL: 1 # XPASS: 0 # ERROR: 0 ============================================================================ See tests/test-suite.log Please report to libvir-list@redhat.com ============================================================================ gmake[3]: *** [Makefile:766: test-suite.log] Error 1 gmake[3]: Leaving directory '/usr<https://ci.centos.org/job/libvirt-dbus-check/systems=libvirt-freebsd-11/ws/build/tests'> gmake[2]: *** [Makefile:874: check-TESTS] Error 2 gmake[2]: Leaving directory '/usr<https://ci.centos.org/job/libvirt-dbus-check/systems=libvirt-freebsd-11/ws/build/tests'> gmake[1]: *** [Makefile:990: check-am] Error 2 gmake[1]: Leaving directory '/usr<https://ci.centos.org/job/libvirt-dbus-check/systems=libvirt-freebsd-11/ws/build/tests'> gmake: *** [Makefile:460: check-recursive] Error 1 + cat tests/test-suite.log ============================================== libvirt-dbus 1.4.0: tests/test-suite.log ============================================== # TOTAL: 7 # PASS: 6 # SKIP: 0 # XFAIL: 0 # FAIL: 1 # XPASS: 0 # ERROR: 0 .. contents:: :depth: 2 FAIL: test_connect.py ===================== ============================= test session starts ============================== platform freebsd11 -- Python 3.6.8, pytest-4.3.1, py-1.8.0, pluggy-0.7.1 rootdir: /usr<https://ci.centos.org/job/libvirt-dbus-check/systems=libvirt-freebsd-11/ws/,> inifile: collected 35 items ../../tests/test_connect.py .........................F......... [100%] =================================== FAILURES =================================== _______________ TestConnect.test_connect_node_device_create_xml ________________ Fixture "node_device_create" called directly. Fixtures are not meant to be called directly, but are created automatically when test functions request them as parameters. See https://docs.pytest.org/en/latest/fixture.html for more information about fixtures, and https://docs.pytest.org/en/latest/deprecations.html#calling-fixtures-directl... about how to update your code. ===================== 1 failed, 34 passed in 17.07 seconds ===================== FAIL test_connect.py (exit status: 1) + exit 1 Build step 'Execute shell' marked build as failure

See <https://ci.centos.org/job/libvirt-dbus-check/systems=libvirt-freebsd-11/296/display/redirect> ------------------------------------------ Started by upstream project "libvirt-dbus-check" build number 296 originally caused by: Started by upstream project "libvirt-dbus-syntax-check" build number 339 originally caused by: Started by upstream project "libvirt-dbus-build" build number 346 originally caused by: Started by upstream project "libvirt-glib-build" build number 343 originally caused by: Started by upstream project "libvirt-build" build number 441 originally caused by: Started by an SCM change Started by an SCM change Started by an SCM change Started by an SCM change Started by an SCM change Started by an SCM change Started by an SCM change Started by an SCM change [EnvInject] - Loading node environment variables. Building remotely on libvirt-freebsd-11 (libvirt) in workspace <https://ci.centos.org/job/libvirt-dbus-check/systems=libvirt-freebsd-11/ws/> [libvirt-dbus] $ /bin/sh -xe /tmp/jenkins589348927359917568.sh + cd build + /usr/local/bin/gmake check Making check in data gmake[1]: Entering directory '/usr<https://ci.centos.org/job/libvirt-dbus-check/systems=libvirt-freebsd-11/ws/build/data'> gmake[1]: Nothing to be done for 'check'. gmake[1]: Leaving directory '/usr<https://ci.centos.org/job/libvirt-dbus-check/systems=libvirt-freebsd-11/ws/build/data'> Making check in docs gmake[1]: Entering directory '/usr<https://ci.centos.org/job/libvirt-dbus-check/systems=libvirt-freebsd-11/ws/build/docs'> gmake[1]: Nothing to be done for 'check'. gmake[1]: Leaving directory '/usr<https://ci.centos.org/job/libvirt-dbus-check/systems=libvirt-freebsd-11/ws/build/docs'> Making check in src gmake[1]: Entering directory '/usr<https://ci.centos.org/job/libvirt-dbus-check/systems=libvirt-freebsd-11/ws/build/src'> gmake[1]: Nothing to be done for 'check'. gmake[1]: Leaving directory '/usr<https://ci.centos.org/job/libvirt-dbus-check/systems=libvirt-freebsd-11/ws/build/src'> Making check in tests gmake[1]: Entering directory '/usr<https://ci.centos.org/job/libvirt-dbus-check/systems=libvirt-freebsd-11/ws/build/tests'> /usr/local/bin/gmake test_util gmake[2]: Entering directory '/usr<https://ci.centos.org/job/libvirt-dbus-check/systems=libvirt-freebsd-11/ws/build/tests'> CC test_util-test_util.o CCLD test_util gmake[2]: Leaving directory '/usr<https://ci.centos.org/job/libvirt-dbus-check/systems=libvirt-freebsd-11/ws/build/tests'> /usr/local/bin/gmake check-TESTS gmake[2]: Entering directory '/usr<https://ci.centos.org/job/libvirt-dbus-check/systems=libvirt-freebsd-11/ws/build/tests'> gmake[3]: Entering directory '/usr<https://ci.centos.org/job/libvirt-dbus-check/systems=libvirt-freebsd-11/ws/build/tests'> PASS: test_util PASS: test_interface.py PASS: test_domain.py PASS: test_network.py PASS: test_nodedev.py FAIL: test_connect.py PASS: test_storage.py ============================================================================ Testsuite summary for libvirt-dbus 1.4.0 ============================================================================ # TOTAL: 7 # PASS: 6 # SKIP: 0 # XFAIL: 0 # FAIL: 1 # XPASS: 0 # ERROR: 0 ============================================================================ See tests/test-suite.log Please report to libvir-list@redhat.com ============================================================================ gmake[3]: *** [Makefile:766: test-suite.log] Error 1 gmake[3]: Leaving directory '/usr<https://ci.centos.org/job/libvirt-dbus-check/systems=libvirt-freebsd-11/ws/build/tests'> gmake[2]: *** [Makefile:874: check-TESTS] Error 2 gmake[2]: Leaving directory '/usr<https://ci.centos.org/job/libvirt-dbus-check/systems=libvirt-freebsd-11/ws/build/tests'> gmake[1]: *** [Makefile:990: check-am] Error 2 gmake[1]: Leaving directory '/usr<https://ci.centos.org/job/libvirt-dbus-check/systems=libvirt-freebsd-11/ws/build/tests'> gmake: *** [Makefile:460: check-recursive] Error 1 + cat tests/test-suite.log ============================================== libvirt-dbus 1.4.0: tests/test-suite.log ============================================== # TOTAL: 7 # PASS: 6 # SKIP: 0 # XFAIL: 0 # FAIL: 1 # XPASS: 0 # ERROR: 0 .. contents:: :depth: 2 FAIL: test_connect.py ===================== ============================= test session starts ============================== platform freebsd11 -- Python 3.6.8, pytest-4.3.1, py-1.8.0, pluggy-0.7.1 rootdir: /usr<https://ci.centos.org/job/libvirt-dbus-check/systems=libvirt-freebsd-11/ws/,> inifile: collected 35 items ../../tests/test_connect.py .........................F......... [100%] =================================== FAILURES =================================== _______________ TestConnect.test_connect_node_device_create_xml ________________ Fixture "node_device_create" called directly. Fixtures are not meant to be called directly, but are created automatically when test functions request them as parameters. See https://docs.pytest.org/en/latest/fixture.html for more information about fixtures, and https://docs.pytest.org/en/latest/deprecations.html#calling-fixtures-directl... about how to update your code. ===================== 1 failed, 34 passed in 12.97 seconds ===================== FAIL test_connect.py (exit status: 1) + exit 1 Build step 'Execute shell' marked build as failure

See <https://ci.centos.org/job/libvirt-dbus-check/systems=libvirt-freebsd-11/297/display/redirect> ------------------------------------------ Started by upstream project "libvirt-dbus-check" build number 297 originally caused by: Started by upstream project "libvirt-dbus-syntax-check" build number 340 originally caused by: Started by upstream project "libvirt-dbus-build" build number 347 originally caused by: Started by upstream project "libvirt-glib-build" build number 344 originally caused by: Started by upstream project "libvirt-build" build number 442 originally caused by: Started by an SCM change Started by an SCM change Started by an SCM change Started by an SCM change Started by an SCM change Started by an SCM change [EnvInject] - Loading node environment variables. Building remotely on libvirt-freebsd-11 (libvirt) in workspace <https://ci.centos.org/job/libvirt-dbus-check/systems=libvirt-freebsd-11/ws/> [libvirt-dbus] $ /bin/sh -xe /tmp/jenkins6852088316536423806.sh + cd build + /usr/local/bin/gmake check Making check in data gmake[1]: Entering directory '/usr<https://ci.centos.org/job/libvirt-dbus-check/systems=libvirt-freebsd-11/ws/build/data'> gmake[1]: Nothing to be done for 'check'. gmake[1]: Leaving directory '/usr<https://ci.centos.org/job/libvirt-dbus-check/systems=libvirt-freebsd-11/ws/build/data'> Making check in docs gmake[1]: Entering directory '/usr<https://ci.centos.org/job/libvirt-dbus-check/systems=libvirt-freebsd-11/ws/build/docs'> gmake[1]: Nothing to be done for 'check'. gmake[1]: Leaving directory '/usr<https://ci.centos.org/job/libvirt-dbus-check/systems=libvirt-freebsd-11/ws/build/docs'> Making check in src gmake[1]: Entering directory '/usr<https://ci.centos.org/job/libvirt-dbus-check/systems=libvirt-freebsd-11/ws/build/src'> gmake[1]: Nothing to be done for 'check'. gmake[1]: Leaving directory '/usr<https://ci.centos.org/job/libvirt-dbus-check/systems=libvirt-freebsd-11/ws/build/src'> Making check in tests gmake[1]: Entering directory '/usr<https://ci.centos.org/job/libvirt-dbus-check/systems=libvirt-freebsd-11/ws/build/tests'> /usr/local/bin/gmake test_util gmake[2]: Entering directory '/usr<https://ci.centos.org/job/libvirt-dbus-check/systems=libvirt-freebsd-11/ws/build/tests'> CC test_util-test_util.o CCLD test_util gmake[2]: Leaving directory '/usr<https://ci.centos.org/job/libvirt-dbus-check/systems=libvirt-freebsd-11/ws/build/tests'> /usr/local/bin/gmake check-TESTS gmake[2]: Entering directory '/usr<https://ci.centos.org/job/libvirt-dbus-check/systems=libvirt-freebsd-11/ws/build/tests'> gmake[3]: Entering directory '/usr<https://ci.centos.org/job/libvirt-dbus-check/systems=libvirt-freebsd-11/ws/build/tests'> PASS: test_util PASS: test_interface.py PASS: test_domain.py PASS: test_network.py PASS: test_nodedev.py FAIL: test_connect.py PASS: test_storage.py ============================================================================ Testsuite summary for libvirt-dbus 1.4.0 ============================================================================ # TOTAL: 7 # PASS: 6 # SKIP: 0 # XFAIL: 0 # FAIL: 1 # XPASS: 0 # ERROR: 0 ============================================================================ See tests/test-suite.log Please report to libvir-list@redhat.com ============================================================================ gmake[3]: *** [Makefile:766: test-suite.log] Error 1 gmake[3]: Leaving directory '/usr<https://ci.centos.org/job/libvirt-dbus-check/systems=libvirt-freebsd-11/ws/build/tests'> gmake[2]: *** [Makefile:874: check-TESTS] Error 2 gmake[2]: Leaving directory '/usr<https://ci.centos.org/job/libvirt-dbus-check/systems=libvirt-freebsd-11/ws/build/tests'> gmake[1]: *** [Makefile:990: check-am] Error 2 gmake[1]: Leaving directory '/usr<https://ci.centos.org/job/libvirt-dbus-check/systems=libvirt-freebsd-11/ws/build/tests'> gmake: *** [Makefile:460: check-recursive] Error 1 + cat tests/test-suite.log ============================================== libvirt-dbus 1.4.0: tests/test-suite.log ============================================== # TOTAL: 7 # PASS: 6 # SKIP: 0 # XFAIL: 0 # FAIL: 1 # XPASS: 0 # ERROR: 0 .. contents:: :depth: 2 FAIL: test_connect.py ===================== ============================= test session starts ============================== platform freebsd11 -- Python 3.6.8, pytest-4.3.1, py-1.8.0, pluggy-0.7.1 rootdir: /usr<https://ci.centos.org/job/libvirt-dbus-check/systems=libvirt-freebsd-11/ws/,> inifile: collected 35 items ../../tests/test_connect.py .........................F......... [100%] =================================== FAILURES =================================== _______________ TestConnect.test_connect_node_device_create_xml ________________ Fixture "node_device_create" called directly. Fixtures are not meant to be called directly, but are created automatically when test functions request them as parameters. See https://docs.pytest.org/en/latest/fixture.html for more information about fixtures, and https://docs.pytest.org/en/latest/deprecations.html#calling-fixtures-directl... about how to update your code. ===================== 1 failed, 34 passed in 15.06 seconds ===================== FAIL test_connect.py (exit status: 1) + exit 1 Build step 'Execute shell' marked build as failure

See <https://ci.centos.org/job/libvirt-dbus-check/systems=libvirt-freebsd-11/298/display/redirect> ------------------------------------------ Started by upstream project "libvirt-dbus-check" build number 298 originally caused by: Started by upstream project "libvirt-dbus-syntax-check" build number 341 originally caused by: Started by upstream project "libvirt-dbus-build" build number 348 originally caused by: Started by upstream project "libvirt-glib-build" build number 345 originally caused by: Started by upstream project "libvirt-build" build number 443 originally caused by: Started by an SCM change [EnvInject] - Loading node environment variables. Building remotely on libvirt-freebsd-11 (libvirt) in workspace <https://ci.centos.org/job/libvirt-dbus-check/systems=libvirt-freebsd-11/ws/> [libvirt-dbus] $ /bin/sh -xe /tmp/jenkins1085819714677049312.sh + cd build + /usr/local/bin/gmake check Making check in data gmake[1]: Entering directory '/usr<https://ci.centos.org/job/libvirt-dbus-check/systems=libvirt-freebsd-11/ws/build/data'> gmake[1]: Nothing to be done for 'check'. gmake[1]: Leaving directory '/usr<https://ci.centos.org/job/libvirt-dbus-check/systems=libvirt-freebsd-11/ws/build/data'> Making check in docs gmake[1]: Entering directory '/usr<https://ci.centos.org/job/libvirt-dbus-check/systems=libvirt-freebsd-11/ws/build/docs'> gmake[1]: Nothing to be done for 'check'. gmake[1]: Leaving directory '/usr<https://ci.centos.org/job/libvirt-dbus-check/systems=libvirt-freebsd-11/ws/build/docs'> Making check in src gmake[1]: Entering directory '/usr<https://ci.centos.org/job/libvirt-dbus-check/systems=libvirt-freebsd-11/ws/build/src'> gmake[1]: Nothing to be done for 'check'. gmake[1]: Leaving directory '/usr<https://ci.centos.org/job/libvirt-dbus-check/systems=libvirt-freebsd-11/ws/build/src'> Making check in tests gmake[1]: Entering directory '/usr<https://ci.centos.org/job/libvirt-dbus-check/systems=libvirt-freebsd-11/ws/build/tests'> /usr/local/bin/gmake test_util gmake[2]: Entering directory '/usr<https://ci.centos.org/job/libvirt-dbus-check/systems=libvirt-freebsd-11/ws/build/tests'> CC test_util-test_util.o CCLD test_util gmake[2]: Leaving directory '/usr<https://ci.centos.org/job/libvirt-dbus-check/systems=libvirt-freebsd-11/ws/build/tests'> /usr/local/bin/gmake check-TESTS gmake[2]: Entering directory '/usr<https://ci.centos.org/job/libvirt-dbus-check/systems=libvirt-freebsd-11/ws/build/tests'> gmake[3]: Entering directory '/usr<https://ci.centos.org/job/libvirt-dbus-check/systems=libvirt-freebsd-11/ws/build/tests'> PASS: test_util PASS: test_interface.py PASS: test_domain.py PASS: test_network.py PASS: test_nodedev.py FAIL: test_connect.py PASS: test_storage.py ============================================================================ Testsuite summary for libvirt-dbus 1.4.0 ============================================================================ # TOTAL: 7 # PASS: 6 # SKIP: 0 # XFAIL: 0 # FAIL: 1 # XPASS: 0 # ERROR: 0 ============================================================================ See tests/test-suite.log Please report to libvir-list@redhat.com ============================================================================ gmake[3]: *** [Makefile:766: test-suite.log] Error 1 gmake[3]: Leaving directory '/usr<https://ci.centos.org/job/libvirt-dbus-check/systems=libvirt-freebsd-11/ws/build/tests'> gmake[2]: *** [Makefile:874: check-TESTS] Error 2 gmake[2]: Leaving directory '/usr<https://ci.centos.org/job/libvirt-dbus-check/systems=libvirt-freebsd-11/ws/build/tests'> gmake[1]: *** [Makefile:990: check-am] Error 2 gmake[1]: Leaving directory '/usr<https://ci.centos.org/job/libvirt-dbus-check/systems=libvirt-freebsd-11/ws/build/tests'> gmake: *** [Makefile:460: check-recursive] Error 1 + cat tests/test-suite.log ============================================== libvirt-dbus 1.4.0: tests/test-suite.log ============================================== # TOTAL: 7 # PASS: 6 # SKIP: 0 # XFAIL: 0 # FAIL: 1 # XPASS: 0 # ERROR: 0 .. contents:: :depth: 2 FAIL: test_connect.py ===================== ============================= test session starts ============================== platform freebsd11 -- Python 3.6.8, pytest-4.3.1, py-1.8.0, pluggy-0.7.1 rootdir: /usr<https://ci.centos.org/job/libvirt-dbus-check/systems=libvirt-freebsd-11/ws/,> inifile: collected 35 items ../../tests/test_connect.py .........................F......... [100%] =================================== FAILURES =================================== _______________ TestConnect.test_connect_node_device_create_xml ________________ Fixture "node_device_create" called directly. Fixtures are not meant to be called directly, but are created automatically when test functions request them as parameters. See https://docs.pytest.org/en/latest/fixture.html for more information about fixtures, and https://docs.pytest.org/en/latest/deprecations.html#calling-fixtures-directl... about how to update your code. ===================== 1 failed, 34 passed in 12.65 seconds ===================== FAIL test_connect.py (exit status: 1) + exit 1 Build step 'Execute shell' marked build as failure

See <https://ci.centos.org/job/libvirt-dbus-check/systems=libvirt-freebsd-11/299/display/redirect> ------------------------------------------ Started by upstream project "libvirt-dbus-check" build number 299 originally caused by: Started by upstream project "libvirt-dbus-syntax-check" build number 342 originally caused by: Started by upstream project "libvirt-dbus-build" build number 349 originally caused by: Started by upstream project "libvirt-glib-build" build number 346 originally caused by: Started by upstream project "libvirt-build" build number 444 originally caused by: Started by an SCM change Started by an SCM change Started by an SCM change Started by an SCM change Started by an SCM change Started by an SCM change Started by an SCM change [EnvInject] - Loading node environment variables. Building remotely on libvirt-freebsd-11 (libvirt) in workspace <https://ci.centos.org/job/libvirt-dbus-check/systems=libvirt-freebsd-11/ws/> [libvirt-dbus] $ /bin/sh -xe /tmp/jenkins5508264555594225739.sh + cd build + /usr/local/bin/gmake check Making check in data gmake[1]: Entering directory '/usr<https://ci.centos.org/job/libvirt-dbus-check/systems=libvirt-freebsd-11/ws/build/data'> gmake[1]: Nothing to be done for 'check'. gmake[1]: Leaving directory '/usr<https://ci.centos.org/job/libvirt-dbus-check/systems=libvirt-freebsd-11/ws/build/data'> Making check in docs gmake[1]: Entering directory '/usr<https://ci.centos.org/job/libvirt-dbus-check/systems=libvirt-freebsd-11/ws/build/docs'> gmake[1]: Nothing to be done for 'check'. gmake[1]: Leaving directory '/usr<https://ci.centos.org/job/libvirt-dbus-check/systems=libvirt-freebsd-11/ws/build/docs'> Making check in src gmake[1]: Entering directory '/usr<https://ci.centos.org/job/libvirt-dbus-check/systems=libvirt-freebsd-11/ws/build/src'> gmake[1]: Nothing to be done for 'check'. gmake[1]: Leaving directory '/usr<https://ci.centos.org/job/libvirt-dbus-check/systems=libvirt-freebsd-11/ws/build/src'> Making check in tests gmake[1]: Entering directory '/usr<https://ci.centos.org/job/libvirt-dbus-check/systems=libvirt-freebsd-11/ws/build/tests'> /usr/local/bin/gmake test_util gmake[2]: Entering directory '/usr<https://ci.centos.org/job/libvirt-dbus-check/systems=libvirt-freebsd-11/ws/build/tests'> CC test_util-test_util.o CCLD test_util gmake[2]: Leaving directory '/usr<https://ci.centos.org/job/libvirt-dbus-check/systems=libvirt-freebsd-11/ws/build/tests'> /usr/local/bin/gmake check-TESTS gmake[2]: Entering directory '/usr<https://ci.centos.org/job/libvirt-dbus-check/systems=libvirt-freebsd-11/ws/build/tests'> gmake[3]: Entering directory '/usr<https://ci.centos.org/job/libvirt-dbus-check/systems=libvirt-freebsd-11/ws/build/tests'> PASS: test_util PASS: test_interface.py PASS: test_domain.py PASS: test_network.py PASS: test_nodedev.py FAIL: test_connect.py PASS: test_storage.py ============================================================================ Testsuite summary for libvirt-dbus 1.4.0 ============================================================================ # TOTAL: 7 # PASS: 6 # SKIP: 0 # XFAIL: 0 # FAIL: 1 # XPASS: 0 # ERROR: 0 ============================================================================ See tests/test-suite.log Please report to libvir-list@redhat.com ============================================================================ gmake[3]: *** [Makefile:766: test-suite.log] Error 1 gmake[3]: Leaving directory '/usr<https://ci.centos.org/job/libvirt-dbus-check/systems=libvirt-freebsd-11/ws/build/tests'> gmake[2]: *** [Makefile:874: check-TESTS] Error 2 gmake[2]: Leaving directory '/usr<https://ci.centos.org/job/libvirt-dbus-check/systems=libvirt-freebsd-11/ws/build/tests'> gmake[1]: *** [Makefile:990: check-am] Error 2 gmake[1]: Leaving directory '/usr<https://ci.centos.org/job/libvirt-dbus-check/systems=libvirt-freebsd-11/ws/build/tests'> gmake: *** [Makefile:460: check-recursive] Error 1 + cat tests/test-suite.log ============================================== libvirt-dbus 1.4.0: tests/test-suite.log ============================================== # TOTAL: 7 # PASS: 6 # SKIP: 0 # XFAIL: 0 # FAIL: 1 # XPASS: 0 # ERROR: 0 .. contents:: :depth: 2 FAIL: test_connect.py ===================== ============================= test session starts ============================== platform freebsd11 -- Python 3.6.8, pytest-4.3.1, py-1.8.0, pluggy-0.7.1 rootdir: /usr<https://ci.centos.org/job/libvirt-dbus-check/systems=libvirt-freebsd-11/ws/,> inifile: collected 35 items ../../tests/test_connect.py .........................F......... [100%] =================================== FAILURES =================================== _______________ TestConnect.test_connect_node_device_create_xml ________________ Fixture "node_device_create" called directly. Fixtures are not meant to be called directly, but are created automatically when test functions request them as parameters. See https://docs.pytest.org/en/latest/fixture.html for more information about fixtures, and https://docs.pytest.org/en/latest/deprecations.html#calling-fixtures-directl... about how to update your code. ===================== 1 failed, 34 passed in 14.49 seconds ===================== FAIL test_connect.py (exit status: 1) + exit 1 Build step 'Execute shell' marked build as failure

See <https://ci.centos.org/job/libvirt-dbus-check/systems=libvirt-freebsd-11/300/display/redirect> ------------------------------------------ Started by upstream project "libvirt-dbus-check" build number 300 originally caused by: Started by upstream project "libvirt-dbus-syntax-check" build number 343 originally caused by: Started by upstream project "libvirt-dbus-build" build number 350 originally caused by: Started by upstream project "libvirt-glib-build" build number 347 originally caused by: Started by upstream project "libvirt-build" build number 445 originally caused by: Started by an SCM change [EnvInject] - Loading node environment variables. Building remotely on libvirt-freebsd-11 (libvirt) in workspace <https://ci.centos.org/job/libvirt-dbus-check/systems=libvirt-freebsd-11/ws/> [libvirt-dbus] $ /bin/sh -xe /tmp/jenkins5294223277416740169.sh + cd build + /usr/local/bin/gmake check Making check in data gmake[1]: Entering directory '/usr<https://ci.centos.org/job/libvirt-dbus-check/systems=libvirt-freebsd-11/ws/build/data'> gmake[1]: Nothing to be done for 'check'. gmake[1]: Leaving directory '/usr<https://ci.centos.org/job/libvirt-dbus-check/systems=libvirt-freebsd-11/ws/build/data'> Making check in docs gmake[1]: Entering directory '/usr<https://ci.centos.org/job/libvirt-dbus-check/systems=libvirt-freebsd-11/ws/build/docs'> gmake[1]: Nothing to be done for 'check'. gmake[1]: Leaving directory '/usr<https://ci.centos.org/job/libvirt-dbus-check/systems=libvirt-freebsd-11/ws/build/docs'> Making check in src gmake[1]: Entering directory '/usr<https://ci.centos.org/job/libvirt-dbus-check/systems=libvirt-freebsd-11/ws/build/src'> gmake[1]: Nothing to be done for 'check'. gmake[1]: Leaving directory '/usr<https://ci.centos.org/job/libvirt-dbus-check/systems=libvirt-freebsd-11/ws/build/src'> Making check in tests gmake[1]: Entering directory '/usr<https://ci.centos.org/job/libvirt-dbus-check/systems=libvirt-freebsd-11/ws/build/tests'> /usr/local/bin/gmake test_util gmake[2]: Entering directory '/usr<https://ci.centos.org/job/libvirt-dbus-check/systems=libvirt-freebsd-11/ws/build/tests'> CC test_util-test_util.o CCLD test_util gmake[2]: Leaving directory '/usr<https://ci.centos.org/job/libvirt-dbus-check/systems=libvirt-freebsd-11/ws/build/tests'> /usr/local/bin/gmake check-TESTS gmake[2]: Entering directory '/usr<https://ci.centos.org/job/libvirt-dbus-check/systems=libvirt-freebsd-11/ws/build/tests'> gmake[3]: Entering directory '/usr<https://ci.centos.org/job/libvirt-dbus-check/systems=libvirt-freebsd-11/ws/build/tests'> PASS: test_util PASS: test_interface.py PASS: test_domain.py PASS: test_network.py PASS: test_nodedev.py FAIL: test_connect.py PASS: test_storage.py ============================================================================ Testsuite summary for libvirt-dbus 1.4.0 ============================================================================ # TOTAL: 7 # PASS: 6 # SKIP: 0 # XFAIL: 0 # FAIL: 1 # XPASS: 0 # ERROR: 0 ============================================================================ See tests/test-suite.log Please report to libvir-list@redhat.com ============================================================================ gmake[3]: *** [Makefile:766: test-suite.log] Error 1 gmake[3]: Leaving directory '/usr<https://ci.centos.org/job/libvirt-dbus-check/systems=libvirt-freebsd-11/ws/build/tests'> gmake[2]: *** [Makefile:874: check-TESTS] Error 2 gmake[2]: Leaving directory '/usr<https://ci.centos.org/job/libvirt-dbus-check/systems=libvirt-freebsd-11/ws/build/tests'> gmake[1]: *** [Makefile:990: check-am] Error 2 gmake[1]: Leaving directory '/usr<https://ci.centos.org/job/libvirt-dbus-check/systems=libvirt-freebsd-11/ws/build/tests'> gmake: *** [Makefile:460: check-recursive] Error 1 + cat tests/test-suite.log ============================================== libvirt-dbus 1.4.0: tests/test-suite.log ============================================== # TOTAL: 7 # PASS: 6 # SKIP: 0 # XFAIL: 0 # FAIL: 1 # XPASS: 0 # ERROR: 0 .. contents:: :depth: 2 FAIL: test_connect.py ===================== ============================= test session starts ============================== platform freebsd11 -- Python 3.6.8, pytest-4.3.1, py-1.8.0, pluggy-0.7.1 rootdir: /usr<https://ci.centos.org/job/libvirt-dbus-check/systems=libvirt-freebsd-11/ws/,> inifile: collected 35 items ../../tests/test_connect.py .........................F......... [100%] =================================== FAILURES =================================== _______________ TestConnect.test_connect_node_device_create_xml ________________ Fixture "node_device_create" called directly. Fixtures are not meant to be called directly, but are created automatically when test functions request them as parameters. See https://docs.pytest.org/en/latest/fixture.html for more information about fixtures, and https://docs.pytest.org/en/latest/deprecations.html#calling-fixtures-directl... about how to update your code. ===================== 1 failed, 34 passed in 14.27 seconds ===================== FAIL test_connect.py (exit status: 1) + exit 1 Build step 'Execute shell' marked build as failure

See <https://ci.centos.org/job/libvirt-dbus-check/systems=libvirt-freebsd-11/301/display/redirect> ------------------------------------------ Started by upstream project "libvirt-dbus-check" build number 301 originally caused by: Started by upstream project "libvirt-dbus-syntax-check" build number 344 originally caused by: Started by upstream project "libvirt-dbus-build" build number 351 originally caused by: Started by upstream project "libvirt-glib-build" build number 348 originally caused by: Started by upstream project "libvirt-build" build number 446 originally caused by: Started by an SCM change [EnvInject] - Loading node environment variables. Building remotely on libvirt-freebsd-11 (libvirt) in workspace <https://ci.centos.org/job/libvirt-dbus-check/systems=libvirt-freebsd-11/ws/> [libvirt-dbus] $ /bin/sh -xe /tmp/jenkins2767684762505563164.sh + cd build + /usr/local/bin/gmake check Making check in data gmake[1]: Entering directory '/usr<https://ci.centos.org/job/libvirt-dbus-check/systems=libvirt-freebsd-11/ws/build/data'> gmake[1]: Nothing to be done for 'check'. gmake[1]: Leaving directory '/usr<https://ci.centos.org/job/libvirt-dbus-check/systems=libvirt-freebsd-11/ws/build/data'> Making check in docs gmake[1]: Entering directory '/usr<https://ci.centos.org/job/libvirt-dbus-check/systems=libvirt-freebsd-11/ws/build/docs'> gmake[1]: Nothing to be done for 'check'. gmake[1]: Leaving directory '/usr<https://ci.centos.org/job/libvirt-dbus-check/systems=libvirt-freebsd-11/ws/build/docs'> Making check in src gmake[1]: Entering directory '/usr<https://ci.centos.org/job/libvirt-dbus-check/systems=libvirt-freebsd-11/ws/build/src'> gmake[1]: Nothing to be done for 'check'. gmake[1]: Leaving directory '/usr<https://ci.centos.org/job/libvirt-dbus-check/systems=libvirt-freebsd-11/ws/build/src'> Making check in tests gmake[1]: Entering directory '/usr<https://ci.centos.org/job/libvirt-dbus-check/systems=libvirt-freebsd-11/ws/build/tests'> /usr/local/bin/gmake test_util gmake[2]: Entering directory '/usr<https://ci.centos.org/job/libvirt-dbus-check/systems=libvirt-freebsd-11/ws/build/tests'> CC test_util-test_util.o CCLD test_util gmake[2]: Leaving directory '/usr<https://ci.centos.org/job/libvirt-dbus-check/systems=libvirt-freebsd-11/ws/build/tests'> /usr/local/bin/gmake check-TESTS gmake[2]: Entering directory '/usr<https://ci.centos.org/job/libvirt-dbus-check/systems=libvirt-freebsd-11/ws/build/tests'> gmake[3]: Entering directory '/usr<https://ci.centos.org/job/libvirt-dbus-check/systems=libvirt-freebsd-11/ws/build/tests'> PASS: test_util PASS: test_interface.py PASS: test_domain.py PASS: test_network.py PASS: test_nodedev.py FAIL: test_connect.py PASS: test_storage.py ============================================================================ Testsuite summary for libvirt-dbus 1.4.0 ============================================================================ # TOTAL: 7 # PASS: 6 # SKIP: 0 # XFAIL: 0 # FAIL: 1 # XPASS: 0 # ERROR: 0 ============================================================================ See tests/test-suite.log Please report to libvir-list@redhat.com ============================================================================ gmake[3]: *** [Makefile:766: test-suite.log] Error 1 gmake[3]: Leaving directory '/usr<https://ci.centos.org/job/libvirt-dbus-check/systems=libvirt-freebsd-11/ws/build/tests'> gmake[2]: *** [Makefile:874: check-TESTS] Error 2 gmake[2]: Leaving directory '/usr<https://ci.centos.org/job/libvirt-dbus-check/systems=libvirt-freebsd-11/ws/build/tests'> gmake[1]: *** [Makefile:990: check-am] Error 2 gmake[1]: Leaving directory '/usr<https://ci.centos.org/job/libvirt-dbus-check/systems=libvirt-freebsd-11/ws/build/tests'> gmake: *** [Makefile:460: check-recursive] Error 1 + cat tests/test-suite.log ============================================== libvirt-dbus 1.4.0: tests/test-suite.log ============================================== # TOTAL: 7 # PASS: 6 # SKIP: 0 # XFAIL: 0 # FAIL: 1 # XPASS: 0 # ERROR: 0 .. contents:: :depth: 2 FAIL: test_connect.py ===================== ============================= test session starts ============================== platform freebsd11 -- Python 3.6.8, pytest-4.3.1, py-1.8.0, pluggy-0.7.1 rootdir: /usr<https://ci.centos.org/job/libvirt-dbus-check/systems=libvirt-freebsd-11/ws/,> inifile: collected 35 items ../../tests/test_connect.py .........................F......... [100%] =================================== FAILURES =================================== _______________ TestConnect.test_connect_node_device_create_xml ________________ Fixture "node_device_create" called directly. Fixtures are not meant to be called directly, but are created automatically when test functions request them as parameters. See https://docs.pytest.org/en/latest/fixture.html for more information about fixtures, and https://docs.pytest.org/en/latest/deprecations.html#calling-fixtures-directl... about how to update your code. ===================== 1 failed, 34 passed in 14.99 seconds ===================== FAIL test_connect.py (exit status: 1) + exit 1 Build step 'Execute shell' marked build as failure

See <https://ci.centos.org/job/libvirt-dbus-check/systems=libvirt-freebsd-11/302/display/redirect> ------------------------------------------ Started by upstream project "libvirt-dbus-check" build number 302 originally caused by: Started by upstream project "libvirt-dbus-syntax-check" build number 345 originally caused by: Started by upstream project "libvirt-dbus-build" build number 352 originally caused by: Started by upstream project "libvirt-glib-build" build number 349 originally caused by: Started by upstream project "libvirt-build" build number 447 originally caused by: Started by an SCM change [EnvInject] - Loading node environment variables. Building remotely on libvirt-freebsd-11 (libvirt) in workspace <https://ci.centos.org/job/libvirt-dbus-check/systems=libvirt-freebsd-11/ws/> [libvirt-dbus] $ /bin/sh -xe /tmp/jenkins5879775045502399263.sh + cd build + /usr/local/bin/gmake check Making check in data gmake[1]: Entering directory '/usr<https://ci.centos.org/job/libvirt-dbus-check/systems=libvirt-freebsd-11/ws/build/data'> gmake[1]: Nothing to be done for 'check'. gmake[1]: Leaving directory '/usr<https://ci.centos.org/job/libvirt-dbus-check/systems=libvirt-freebsd-11/ws/build/data'> Making check in docs gmake[1]: Entering directory '/usr<https://ci.centos.org/job/libvirt-dbus-check/systems=libvirt-freebsd-11/ws/build/docs'> gmake[1]: Nothing to be done for 'check'. gmake[1]: Leaving directory '/usr<https://ci.centos.org/job/libvirt-dbus-check/systems=libvirt-freebsd-11/ws/build/docs'> Making check in src gmake[1]: Entering directory '/usr<https://ci.centos.org/job/libvirt-dbus-check/systems=libvirt-freebsd-11/ws/build/src'> gmake[1]: Nothing to be done for 'check'. gmake[1]: Leaving directory '/usr<https://ci.centos.org/job/libvirt-dbus-check/systems=libvirt-freebsd-11/ws/build/src'> Making check in tests gmake[1]: Entering directory '/usr<https://ci.centos.org/job/libvirt-dbus-check/systems=libvirt-freebsd-11/ws/build/tests'> /usr/local/bin/gmake test_util gmake[2]: Entering directory '/usr<https://ci.centos.org/job/libvirt-dbus-check/systems=libvirt-freebsd-11/ws/build/tests'> CC test_util-test_util.o CCLD test_util gmake[2]: Leaving directory '/usr<https://ci.centos.org/job/libvirt-dbus-check/systems=libvirt-freebsd-11/ws/build/tests'> /usr/local/bin/gmake check-TESTS gmake[2]: Entering directory '/usr<https://ci.centos.org/job/libvirt-dbus-check/systems=libvirt-freebsd-11/ws/build/tests'> gmake[3]: Entering directory '/usr<https://ci.centos.org/job/libvirt-dbus-check/systems=libvirt-freebsd-11/ws/build/tests'> PASS: test_util PASS: test_interface.py PASS: test_domain.py PASS: test_network.py PASS: test_nodedev.py FAIL: test_connect.py PASS: test_storage.py ============================================================================ Testsuite summary for libvirt-dbus 1.4.0 ============================================================================ # TOTAL: 7 # PASS: 6 # SKIP: 0 # XFAIL: 0 # FAIL: 1 # XPASS: 0 # ERROR: 0 ============================================================================ See tests/test-suite.log Please report to libvir-list@redhat.com ============================================================================ gmake[3]: *** [Makefile:766: test-suite.log] Error 1 gmake[3]: Leaving directory '/usr<https://ci.centos.org/job/libvirt-dbus-check/systems=libvirt-freebsd-11/ws/build/tests'> gmake[2]: *** [Makefile:874: check-TESTS] Error 2 gmake[2]: Leaving directory '/usr<https://ci.centos.org/job/libvirt-dbus-check/systems=libvirt-freebsd-11/ws/build/tests'> gmake[1]: *** [Makefile:990: check-am] Error 2 gmake[1]: Leaving directory '/usr<https://ci.centos.org/job/libvirt-dbus-check/systems=libvirt-freebsd-11/ws/build/tests'> gmake: *** [Makefile:460: check-recursive] Error 1 + cat tests/test-suite.log ============================================== libvirt-dbus 1.4.0: tests/test-suite.log ============================================== # TOTAL: 7 # PASS: 6 # SKIP: 0 # XFAIL: 0 # FAIL: 1 # XPASS: 0 # ERROR: 0 .. contents:: :depth: 2 FAIL: test_connect.py ===================== ============================= test session starts ============================== platform freebsd11 -- Python 3.6.8, pytest-4.3.1, py-1.8.0, pluggy-0.7.1 rootdir: /usr<https://ci.centos.org/job/libvirt-dbus-check/systems=libvirt-freebsd-11/ws/,> inifile: collected 35 items ../../tests/test_connect.py .........................F......... [100%] =================================== FAILURES =================================== _______________ TestConnect.test_connect_node_device_create_xml ________________ Fixture "node_device_create" called directly. Fixtures are not meant to be called directly, but are created automatically when test functions request them as parameters. See https://docs.pytest.org/en/latest/fixture.html for more information about fixtures, and https://docs.pytest.org/en/latest/deprecations.html#calling-fixtures-directl... about how to update your code. ===================== 1 failed, 34 passed in 13.68 seconds ===================== FAIL test_connect.py (exit status: 1) + exit 1 Build step 'Execute shell' marked build as failure

See <https://ci.centos.org/job/libvirt-dbus-check/systems=libvirt-freebsd-11/303/display/redirect> ------------------------------------------ Started by upstream project "libvirt-dbus-check" build number 303 originally caused by: Started by upstream project "libvirt-dbus-syntax-check" build number 346 originally caused by: Started by upstream project "libvirt-dbus-build" build number 353 originally caused by: Started by upstream project "libvirt-glib-build" build number 350 originally caused by: Started by upstream project "libvirt-build" build number 448 originally caused by: Started by an SCM change Started by an SCM change Started by an SCM change Started by an SCM change Started by an SCM change Started by an SCM change Started by an SCM change [EnvInject] - Loading node environment variables. Building remotely on libvirt-freebsd-11 (libvirt) in workspace <https://ci.centos.org/job/libvirt-dbus-check/systems=libvirt-freebsd-11/ws/> [libvirt-dbus] $ /bin/sh -xe /tmp/jenkins1096322149279973625.sh + cd build + /usr/local/bin/gmake check Making check in data gmake[1]: Entering directory '/usr<https://ci.centos.org/job/libvirt-dbus-check/systems=libvirt-freebsd-11/ws/build/data'> gmake[1]: Nothing to be done for 'check'. gmake[1]: Leaving directory '/usr<https://ci.centos.org/job/libvirt-dbus-check/systems=libvirt-freebsd-11/ws/build/data'> Making check in docs gmake[1]: Entering directory '/usr<https://ci.centos.org/job/libvirt-dbus-check/systems=libvirt-freebsd-11/ws/build/docs'> gmake[1]: Nothing to be done for 'check'. gmake[1]: Leaving directory '/usr<https://ci.centos.org/job/libvirt-dbus-check/systems=libvirt-freebsd-11/ws/build/docs'> Making check in src gmake[1]: Entering directory '/usr<https://ci.centos.org/job/libvirt-dbus-check/systems=libvirt-freebsd-11/ws/build/src'> gmake[1]: Nothing to be done for 'check'. gmake[1]: Leaving directory '/usr<https://ci.centos.org/job/libvirt-dbus-check/systems=libvirt-freebsd-11/ws/build/src'> Making check in tests gmake[1]: Entering directory '/usr<https://ci.centos.org/job/libvirt-dbus-check/systems=libvirt-freebsd-11/ws/build/tests'> /usr/local/bin/gmake test_util gmake[2]: Entering directory '/usr<https://ci.centos.org/job/libvirt-dbus-check/systems=libvirt-freebsd-11/ws/build/tests'> CC test_util-test_util.o CCLD test_util gmake[2]: Leaving directory '/usr<https://ci.centos.org/job/libvirt-dbus-check/systems=libvirt-freebsd-11/ws/build/tests'> /usr/local/bin/gmake check-TESTS gmake[2]: Entering directory '/usr<https://ci.centos.org/job/libvirt-dbus-check/systems=libvirt-freebsd-11/ws/build/tests'> gmake[3]: Entering directory '/usr<https://ci.centos.org/job/libvirt-dbus-check/systems=libvirt-freebsd-11/ws/build/tests'> PASS: test_util PASS: test_interface.py PASS: test_domain.py PASS: test_network.py PASS: test_nodedev.py FAIL: test_connect.py PASS: test_storage.py ============================================================================ Testsuite summary for libvirt-dbus 1.4.0 ============================================================================ # TOTAL: 7 # PASS: 6 # SKIP: 0 # XFAIL: 0 # FAIL: 1 # XPASS: 0 # ERROR: 0 ============================================================================ See tests/test-suite.log Please report to libvir-list@redhat.com ============================================================================ gmake[3]: *** [Makefile:766: test-suite.log] Error 1 gmake[3]: Leaving directory '/usr<https://ci.centos.org/job/libvirt-dbus-check/systems=libvirt-freebsd-11/ws/build/tests'> gmake[2]: *** [Makefile:874: check-TESTS] Error 2 gmake[2]: Leaving directory '/usr<https://ci.centos.org/job/libvirt-dbus-check/systems=libvirt-freebsd-11/ws/build/tests'> gmake[1]: *** [Makefile:990: check-am] Error 2 gmake[1]: Leaving directory '/usr<https://ci.centos.org/job/libvirt-dbus-check/systems=libvirt-freebsd-11/ws/build/tests'> gmake: *** [Makefile:460: check-recursive] Error 1 + cat tests/test-suite.log ============================================== libvirt-dbus 1.4.0: tests/test-suite.log ============================================== # TOTAL: 7 # PASS: 6 # SKIP: 0 # XFAIL: 0 # FAIL: 1 # XPASS: 0 # ERROR: 0 .. contents:: :depth: 2 FAIL: test_connect.py ===================== ============================= test session starts ============================== platform freebsd11 -- Python 3.6.8, pytest-4.3.1, py-1.8.0, pluggy-0.7.1 rootdir: /usr<https://ci.centos.org/job/libvirt-dbus-check/systems=libvirt-freebsd-11/ws/,> inifile: collected 35 items ../../tests/test_connect.py .........................F......... [100%] =================================== FAILURES =================================== _______________ TestConnect.test_connect_node_device_create_xml ________________ Fixture "node_device_create" called directly. Fixtures are not meant to be called directly, but are created automatically when test functions request them as parameters. See https://docs.pytest.org/en/latest/fixture.html for more information about fixtures, and https://docs.pytest.org/en/latest/deprecations.html#calling-fixtures-directl... about how to update your code. ===================== 1 failed, 34 passed in 14.72 seconds ===================== FAIL test_connect.py (exit status: 1) + exit 1 Build step 'Execute shell' marked build as failure

See <https://ci.centos.org/job/libvirt-dbus-check/systems=libvirt-freebsd-11/304/display/redirect> ------------------------------------------ Started by upstream project "libvirt-dbus-check" build number 304 originally caused by: Started by upstream project "libvirt-dbus-syntax-check" build number 347 originally caused by: Started by upstream project "libvirt-dbus-build" build number 354 originally caused by: Started by upstream project "libvirt-glib-build" build number 351 originally caused by: Started by upstream project "libvirt-build" build number 449 originally caused by: Started by an SCM change [EnvInject] - Loading node environment variables. Building remotely on libvirt-freebsd-11 (libvirt) in workspace <https://ci.centos.org/job/libvirt-dbus-check/systems=libvirt-freebsd-11/ws/> [libvirt-dbus] $ /bin/sh -xe /tmp/jenkins1095748035940728833.sh + cd build + /usr/local/bin/gmake check Making check in data gmake[1]: Entering directory '/usr<https://ci.centos.org/job/libvirt-dbus-check/systems=libvirt-freebsd-11/ws/build/data'> gmake[1]: Nothing to be done for 'check'. gmake[1]: Leaving directory '/usr<https://ci.centos.org/job/libvirt-dbus-check/systems=libvirt-freebsd-11/ws/build/data'> Making check in docs gmake[1]: Entering directory '/usr<https://ci.centos.org/job/libvirt-dbus-check/systems=libvirt-freebsd-11/ws/build/docs'> gmake[1]: Nothing to be done for 'check'. gmake[1]: Leaving directory '/usr<https://ci.centos.org/job/libvirt-dbus-check/systems=libvirt-freebsd-11/ws/build/docs'> Making check in src gmake[1]: Entering directory '/usr<https://ci.centos.org/job/libvirt-dbus-check/systems=libvirt-freebsd-11/ws/build/src'> gmake[1]: Nothing to be done for 'check'. gmake[1]: Leaving directory '/usr<https://ci.centos.org/job/libvirt-dbus-check/systems=libvirt-freebsd-11/ws/build/src'> Making check in tests gmake[1]: Entering directory '/usr<https://ci.centos.org/job/libvirt-dbus-check/systems=libvirt-freebsd-11/ws/build/tests'> /usr/local/bin/gmake test_util gmake[2]: Entering directory '/usr<https://ci.centos.org/job/libvirt-dbus-check/systems=libvirt-freebsd-11/ws/build/tests'> CC test_util-test_util.o CCLD test_util gmake[2]: Leaving directory '/usr<https://ci.centos.org/job/libvirt-dbus-check/systems=libvirt-freebsd-11/ws/build/tests'> /usr/local/bin/gmake check-TESTS gmake[2]: Entering directory '/usr<https://ci.centos.org/job/libvirt-dbus-check/systems=libvirt-freebsd-11/ws/build/tests'> gmake[3]: Entering directory '/usr<https://ci.centos.org/job/libvirt-dbus-check/systems=libvirt-freebsd-11/ws/build/tests'> PASS: test_util PASS: test_interface.py PASS: test_domain.py PASS: test_network.py PASS: test_nodedev.py FAIL: test_connect.py PASS: test_storage.py ============================================================================ Testsuite summary for libvirt-dbus 1.4.0 ============================================================================ # TOTAL: 7 # PASS: 6 # SKIP: 0 # XFAIL: 0 # FAIL: 1 # XPASS: 0 # ERROR: 0 ============================================================================ See tests/test-suite.log Please report to libvir-list@redhat.com ============================================================================ gmake[3]: *** [Makefile:766: test-suite.log] Error 1 gmake[3]: Leaving directory '/usr<https://ci.centos.org/job/libvirt-dbus-check/systems=libvirt-freebsd-11/ws/build/tests'> gmake[2]: *** [Makefile:874: check-TESTS] Error 2 gmake[2]: Leaving directory '/usr<https://ci.centos.org/job/libvirt-dbus-check/systems=libvirt-freebsd-11/ws/build/tests'> gmake[1]: *** [Makefile:990: check-am] Error 2 gmake[1]: Leaving directory '/usr<https://ci.centos.org/job/libvirt-dbus-check/systems=libvirt-freebsd-11/ws/build/tests'> gmake: *** [Makefile:460: check-recursive] Error 1 + cat tests/test-suite.log ============================================== libvirt-dbus 1.4.0: tests/test-suite.log ============================================== # TOTAL: 7 # PASS: 6 # SKIP: 0 # XFAIL: 0 # FAIL: 1 # XPASS: 0 # ERROR: 0 .. contents:: :depth: 2 FAIL: test_connect.py ===================== ============================= test session starts ============================== platform freebsd11 -- Python 3.6.8, pytest-4.3.1, py-1.8.0, pluggy-0.7.1 rootdir: /usr<https://ci.centos.org/job/libvirt-dbus-check/systems=libvirt-freebsd-11/ws/,> inifile: collected 35 items ../../tests/test_connect.py .........................F......... [100%] =================================== FAILURES =================================== _______________ TestConnect.test_connect_node_device_create_xml ________________ Fixture "node_device_create" called directly. Fixtures are not meant to be called directly, but are created automatically when test functions request them as parameters. See https://docs.pytest.org/en/latest/fixture.html for more information about fixtures, and https://docs.pytest.org/en/latest/deprecations.html#calling-fixtures-directl... about how to update your code. ===================== 1 failed, 34 passed in 14.90 seconds ===================== FAIL test_connect.py (exit status: 1) + exit 1 Build step 'Execute shell' marked build as failure

See <https://ci.centos.org/job/libvirt-dbus-check/systems=libvirt-freebsd-11/305/display/redirect> ------------------------------------------ Started by upstream project "libvirt-dbus-check" build number 305 originally caused by: Started by upstream project "libvirt-dbus-syntax-check" build number 348 originally caused by: Started by upstream project "libvirt-dbus-build" build number 355 originally caused by: Started by upstream project "libvirt-glib-build" build number 352 originally caused by: Started by upstream project "libvirt-build" build number 450 originally caused by: Started by an SCM change Started by an SCM change Started by an SCM change Started by an SCM change [EnvInject] - Loading node environment variables. Building remotely on libvirt-freebsd-11 (libvirt) in workspace <https://ci.centos.org/job/libvirt-dbus-check/systems=libvirt-freebsd-11/ws/> [libvirt-dbus] $ /bin/sh -xe /tmp/jenkins9192564638771833528.sh + cd build + /usr/local/bin/gmake check Making check in data gmake[1]: Entering directory '/usr<https://ci.centos.org/job/libvirt-dbus-check/systems=libvirt-freebsd-11/ws/build/data'> gmake[1]: Nothing to be done for 'check'. gmake[1]: Leaving directory '/usr<https://ci.centos.org/job/libvirt-dbus-check/systems=libvirt-freebsd-11/ws/build/data'> Making check in docs gmake[1]: Entering directory '/usr<https://ci.centos.org/job/libvirt-dbus-check/systems=libvirt-freebsd-11/ws/build/docs'> gmake[1]: Nothing to be done for 'check'. gmake[1]: Leaving directory '/usr<https://ci.centos.org/job/libvirt-dbus-check/systems=libvirt-freebsd-11/ws/build/docs'> Making check in src gmake[1]: Entering directory '/usr<https://ci.centos.org/job/libvirt-dbus-check/systems=libvirt-freebsd-11/ws/build/src'> gmake[1]: Nothing to be done for 'check'. gmake[1]: Leaving directory '/usr<https://ci.centos.org/job/libvirt-dbus-check/systems=libvirt-freebsd-11/ws/build/src'> Making check in tests gmake[1]: Entering directory '/usr<https://ci.centos.org/job/libvirt-dbus-check/systems=libvirt-freebsd-11/ws/build/tests'> /usr/local/bin/gmake test_util gmake[2]: Entering directory '/usr<https://ci.centos.org/job/libvirt-dbus-check/systems=libvirt-freebsd-11/ws/build/tests'> CC test_util-test_util.o CCLD test_util gmake[2]: Leaving directory '/usr<https://ci.centos.org/job/libvirt-dbus-check/systems=libvirt-freebsd-11/ws/build/tests'> /usr/local/bin/gmake check-TESTS gmake[2]: Entering directory '/usr<https://ci.centos.org/job/libvirt-dbus-check/systems=libvirt-freebsd-11/ws/build/tests'> gmake[3]: Entering directory '/usr<https://ci.centos.org/job/libvirt-dbus-check/systems=libvirt-freebsd-11/ws/build/tests'> PASS: test_util PASS: test_interface.py PASS: test_domain.py PASS: test_network.py PASS: test_nodedev.py FAIL: test_connect.py PASS: test_storage.py ============================================================================ Testsuite summary for libvirt-dbus 1.4.0 ============================================================================ # TOTAL: 7 # PASS: 6 # SKIP: 0 # XFAIL: 0 # FAIL: 1 # XPASS: 0 # ERROR: 0 ============================================================================ See tests/test-suite.log Please report to libvir-list@redhat.com ============================================================================ gmake[3]: *** [Makefile:766: test-suite.log] Error 1 gmake[3]: Leaving directory '/usr<https://ci.centos.org/job/libvirt-dbus-check/systems=libvirt-freebsd-11/ws/build/tests'> gmake[2]: *** [Makefile:874: check-TESTS] Error 2 gmake[2]: Leaving directory '/usr<https://ci.centos.org/job/libvirt-dbus-check/systems=libvirt-freebsd-11/ws/build/tests'> gmake[1]: *** [Makefile:990: check-am] Error 2 gmake[1]: Leaving directory '/usr<https://ci.centos.org/job/libvirt-dbus-check/systems=libvirt-freebsd-11/ws/build/tests'> gmake: *** [Makefile:460: check-recursive] Error 1 + cat tests/test-suite.log ============================================== libvirt-dbus 1.4.0: tests/test-suite.log ============================================== # TOTAL: 7 # PASS: 6 # SKIP: 0 # XFAIL: 0 # FAIL: 1 # XPASS: 0 # ERROR: 0 .. contents:: :depth: 2 FAIL: test_connect.py ===================== ============================= test session starts ============================== platform freebsd11 -- Python 3.6.8, pytest-4.3.1, py-1.8.0, pluggy-0.7.1 rootdir: /usr<https://ci.centos.org/job/libvirt-dbus-check/systems=libvirt-freebsd-11/ws/,> inifile: collected 35 items ../../tests/test_connect.py .........................F......... [100%] =================================== FAILURES =================================== _______________ TestConnect.test_connect_node_device_create_xml ________________ Fixture "node_device_create" called directly. Fixtures are not meant to be called directly, but are created automatically when test functions request them as parameters. See https://docs.pytest.org/en/latest/fixture.html for more information about fixtures, and https://docs.pytest.org/en/latest/deprecations.html#calling-fixtures-directl... about how to update your code. ===================== 1 failed, 34 passed in 14.35 seconds ===================== FAIL test_connect.py (exit status: 1) + exit 1 Build step 'Execute shell' marked build as failure

See <https://ci.centos.org/job/libvirt-dbus-check/systems=libvirt-freebsd-11/306/display/redirect> ------------------------------------------ Started by upstream project "libvirt-dbus-check" build number 306 originally caused by: Started by upstream project "libvirt-dbus-syntax-check" build number 349 originally caused by: Started by upstream project "libvirt-dbus-build" build number 356 originally caused by: Started by upstream project "libvirt-glib-build" build number 353 originally caused by: Started by upstream project "libvirt-build" build number 451 originally caused by: Started by an SCM change [EnvInject] - Loading node environment variables. Building remotely on libvirt-freebsd-11 (libvirt) in workspace <https://ci.centos.org/job/libvirt-dbus-check/systems=libvirt-freebsd-11/ws/> [libvirt-dbus] $ /bin/sh -xe /tmp/jenkins1270076356684577105.sh + cd build + /usr/local/bin/gmake check Making check in data gmake[1]: Entering directory '/usr<https://ci.centos.org/job/libvirt-dbus-check/systems=libvirt-freebsd-11/ws/build/data'> gmake[1]: Nothing to be done for 'check'. gmake[1]: Leaving directory '/usr<https://ci.centos.org/job/libvirt-dbus-check/systems=libvirt-freebsd-11/ws/build/data'> Making check in docs gmake[1]: Entering directory '/usr<https://ci.centos.org/job/libvirt-dbus-check/systems=libvirt-freebsd-11/ws/build/docs'> gmake[1]: Nothing to be done for 'check'. gmake[1]: Leaving directory '/usr<https://ci.centos.org/job/libvirt-dbus-check/systems=libvirt-freebsd-11/ws/build/docs'> Making check in src gmake[1]: Entering directory '/usr<https://ci.centos.org/job/libvirt-dbus-check/systems=libvirt-freebsd-11/ws/build/src'> gmake[1]: Nothing to be done for 'check'. gmake[1]: Leaving directory '/usr<https://ci.centos.org/job/libvirt-dbus-check/systems=libvirt-freebsd-11/ws/build/src'> Making check in tests gmake[1]: Entering directory '/usr<https://ci.centos.org/job/libvirt-dbus-check/systems=libvirt-freebsd-11/ws/build/tests'> /usr/local/bin/gmake test_util gmake[2]: Entering directory '/usr<https://ci.centos.org/job/libvirt-dbus-check/systems=libvirt-freebsd-11/ws/build/tests'> CC test_util-test_util.o CCLD test_util gmake[2]: Leaving directory '/usr<https://ci.centos.org/job/libvirt-dbus-check/systems=libvirt-freebsd-11/ws/build/tests'> /usr/local/bin/gmake check-TESTS gmake[2]: Entering directory '/usr<https://ci.centos.org/job/libvirt-dbus-check/systems=libvirt-freebsd-11/ws/build/tests'> gmake[3]: Entering directory '/usr<https://ci.centos.org/job/libvirt-dbus-check/systems=libvirt-freebsd-11/ws/build/tests'> PASS: test_util PASS: test_interface.py PASS: test_domain.py PASS: test_network.py PASS: test_nodedev.py FAIL: test_connect.py PASS: test_storage.py ============================================================================ Testsuite summary for libvirt-dbus 1.4.0 ============================================================================ # TOTAL: 7 # PASS: 6 # SKIP: 0 # XFAIL: 0 # FAIL: 1 # XPASS: 0 # ERROR: 0 ============================================================================ See tests/test-suite.log Please report to libvir-list@redhat.com ============================================================================ gmake[3]: *** [Makefile:766: test-suite.log] Error 1 gmake[3]: Leaving directory '/usr<https://ci.centos.org/job/libvirt-dbus-check/systems=libvirt-freebsd-11/ws/build/tests'> gmake[2]: *** [Makefile:874: check-TESTS] Error 2 gmake[2]: Leaving directory '/usr<https://ci.centos.org/job/libvirt-dbus-check/systems=libvirt-freebsd-11/ws/build/tests'> gmake[1]: *** [Makefile:990: check-am] Error 2 gmake[1]: Leaving directory '/usr<https://ci.centos.org/job/libvirt-dbus-check/systems=libvirt-freebsd-11/ws/build/tests'> gmake: *** [Makefile:460: check-recursive] Error 1 + cat tests/test-suite.log ============================================== libvirt-dbus 1.4.0: tests/test-suite.log ============================================== # TOTAL: 7 # PASS: 6 # SKIP: 0 # XFAIL: 0 # FAIL: 1 # XPASS: 0 # ERROR: 0 .. contents:: :depth: 2 FAIL: test_connect.py ===================== ============================= test session starts ============================== platform freebsd11 -- Python 3.6.8, pytest-4.3.1, py-1.8.0, pluggy-0.7.1 rootdir: /usr<https://ci.centos.org/job/libvirt-dbus-check/systems=libvirt-freebsd-11/ws/,> inifile: collected 35 items ../../tests/test_connect.py .........................F......... [100%] =================================== FAILURES =================================== _______________ TestConnect.test_connect_node_device_create_xml ________________ Fixture "node_device_create" called directly. Fixtures are not meant to be called directly, but are created automatically when test functions request them as parameters. See https://docs.pytest.org/en/latest/fixture.html for more information about fixtures, and https://docs.pytest.org/en/latest/deprecations.html#calling-fixtures-directl... about how to update your code. ===================== 1 failed, 34 passed in 17.16 seconds ===================== FAIL test_connect.py (exit status: 1) + exit 1 Build step 'Execute shell' marked build as failure

See <https://ci.centos.org/job/libvirt-dbus-check/systems=libvirt-freebsd-11/307/display/redirect> ------------------------------------------ Started by upstream project "libvirt-dbus-check" build number 307 originally caused by: Started by upstream project "libvirt-dbus-syntax-check" build number 350 originally caused by: Started by upstream project "libvirt-dbus-build" build number 357 originally caused by: Started by upstream project "libvirt-glib-build" build number 354 originally caused by: Started by upstream project "libvirt-build" build number 452 originally caused by: Started by an SCM change [EnvInject] - Loading node environment variables. Building remotely on libvirt-freebsd-11 (libvirt) in workspace <https://ci.centos.org/job/libvirt-dbus-check/systems=libvirt-freebsd-11/ws/> [libvirt-dbus] $ /bin/sh -xe /tmp/jenkins8431665269596153539.sh + cd build + /usr/local/bin/gmake check Making check in data gmake[1]: Entering directory '/usr<https://ci.centos.org/job/libvirt-dbus-check/systems=libvirt-freebsd-11/ws/build/data'> gmake[1]: Nothing to be done for 'check'. gmake[1]: Leaving directory '/usr<https://ci.centos.org/job/libvirt-dbus-check/systems=libvirt-freebsd-11/ws/build/data'> Making check in docs gmake[1]: Entering directory '/usr<https://ci.centos.org/job/libvirt-dbus-check/systems=libvirt-freebsd-11/ws/build/docs'> gmake[1]: Nothing to be done for 'check'. gmake[1]: Leaving directory '/usr<https://ci.centos.org/job/libvirt-dbus-check/systems=libvirt-freebsd-11/ws/build/docs'> Making check in src gmake[1]: Entering directory '/usr<https://ci.centos.org/job/libvirt-dbus-check/systems=libvirt-freebsd-11/ws/build/src'> gmake[1]: Nothing to be done for 'check'. gmake[1]: Leaving directory '/usr<https://ci.centos.org/job/libvirt-dbus-check/systems=libvirt-freebsd-11/ws/build/src'> Making check in tests gmake[1]: Entering directory '/usr<https://ci.centos.org/job/libvirt-dbus-check/systems=libvirt-freebsd-11/ws/build/tests'> /usr/local/bin/gmake test_util gmake[2]: Entering directory '/usr<https://ci.centos.org/job/libvirt-dbus-check/systems=libvirt-freebsd-11/ws/build/tests'> CC test_util-test_util.o CCLD test_util gmake[2]: Leaving directory '/usr<https://ci.centos.org/job/libvirt-dbus-check/systems=libvirt-freebsd-11/ws/build/tests'> /usr/local/bin/gmake check-TESTS gmake[2]: Entering directory '/usr<https://ci.centos.org/job/libvirt-dbus-check/systems=libvirt-freebsd-11/ws/build/tests'> gmake[3]: Entering directory '/usr<https://ci.centos.org/job/libvirt-dbus-check/systems=libvirt-freebsd-11/ws/build/tests'> PASS: test_util PASS: test_interface.py PASS: test_domain.py PASS: test_network.py PASS: test_nodedev.py FAIL: test_connect.py PASS: test_storage.py ============================================================================ Testsuite summary for libvirt-dbus 1.4.0 ============================================================================ # TOTAL: 7 # PASS: 6 # SKIP: 0 # XFAIL: 0 # FAIL: 1 # XPASS: 0 # ERROR: 0 ============================================================================ See tests/test-suite.log Please report to libvir-list@redhat.com ============================================================================ gmake[3]: *** [Makefile:766: test-suite.log] Error 1 gmake[3]: Leaving directory '/usr<https://ci.centos.org/job/libvirt-dbus-check/systems=libvirt-freebsd-11/ws/build/tests'> gmake[2]: *** [Makefile:874: check-TESTS] Error 2 gmake[2]: Leaving directory '/usr<https://ci.centos.org/job/libvirt-dbus-check/systems=libvirt-freebsd-11/ws/build/tests'> gmake[1]: *** [Makefile:990: check-am] Error 2 gmake[1]: Leaving directory '/usr<https://ci.centos.org/job/libvirt-dbus-check/systems=libvirt-freebsd-11/ws/build/tests'> gmake: *** [Makefile:460: check-recursive] Error 1 + cat tests/test-suite.log ============================================== libvirt-dbus 1.4.0: tests/test-suite.log ============================================== # TOTAL: 7 # PASS: 6 # SKIP: 0 # XFAIL: 0 # FAIL: 1 # XPASS: 0 # ERROR: 0 .. contents:: :depth: 2 FAIL: test_connect.py ===================== ============================= test session starts ============================== platform freebsd11 -- Python 3.6.8, pytest-4.3.1, py-1.8.0, pluggy-0.7.1 rootdir: /usr<https://ci.centos.org/job/libvirt-dbus-check/systems=libvirt-freebsd-11/ws/,> inifile: collected 35 items ../../tests/test_connect.py .........................F......... [100%] =================================== FAILURES =================================== _______________ TestConnect.test_connect_node_device_create_xml ________________ Fixture "node_device_create" called directly. Fixtures are not meant to be called directly, but are created automatically when test functions request them as parameters. See https://docs.pytest.org/en/latest/fixture.html for more information about fixtures, and https://docs.pytest.org/en/latest/deprecations.html#calling-fixtures-directl... about how to update your code. ===================== 1 failed, 34 passed in 13.50 seconds ===================== FAIL test_connect.py (exit status: 1) + exit 1 Build step 'Execute shell' marked build as failure

See <https://ci.centos.org/job/libvirt-dbus-check/systems=libvirt-freebsd-11/308/display/redirect> ------------------------------------------ Started by upstream project "libvirt-dbus-check" build number 308 originally caused by: Started by upstream project "libvirt-dbus-syntax-check" build number 351 originally caused by: Started by upstream project "libvirt-dbus-build" build number 358 originally caused by: Started by upstream project "libvirt-glib-build" build number 355 originally caused by: Started by upstream project "libvirt-build" build number 453 originally caused by: Started by an SCM change [EnvInject] - Loading node environment variables. Building remotely on libvirt-freebsd-11 (libvirt) in workspace <https://ci.centos.org/job/libvirt-dbus-check/systems=libvirt-freebsd-11/ws/> [libvirt-dbus] $ /bin/sh -xe /tmp/jenkins8377437513315251323.sh + cd build + /usr/local/bin/gmake check Making check in data gmake[1]: Entering directory '/usr<https://ci.centos.org/job/libvirt-dbus-check/systems=libvirt-freebsd-11/ws/build/data'> gmake[1]: Nothing to be done for 'check'. gmake[1]: Leaving directory '/usr<https://ci.centos.org/job/libvirt-dbus-check/systems=libvirt-freebsd-11/ws/build/data'> Making check in docs gmake[1]: Entering directory '/usr<https://ci.centos.org/job/libvirt-dbus-check/systems=libvirt-freebsd-11/ws/build/docs'> gmake[1]: Nothing to be done for 'check'. gmake[1]: Leaving directory '/usr<https://ci.centos.org/job/libvirt-dbus-check/systems=libvirt-freebsd-11/ws/build/docs'> Making check in src gmake[1]: Entering directory '/usr<https://ci.centos.org/job/libvirt-dbus-check/systems=libvirt-freebsd-11/ws/build/src'> gmake[1]: Nothing to be done for 'check'. gmake[1]: Leaving directory '/usr<https://ci.centos.org/job/libvirt-dbus-check/systems=libvirt-freebsd-11/ws/build/src'> Making check in tests gmake[1]: Entering directory '/usr<https://ci.centos.org/job/libvirt-dbus-check/systems=libvirt-freebsd-11/ws/build/tests'> /usr/local/bin/gmake test_util gmake[2]: Entering directory '/usr<https://ci.centos.org/job/libvirt-dbus-check/systems=libvirt-freebsd-11/ws/build/tests'> CC test_util-test_util.o CCLD test_util gmake[2]: Leaving directory '/usr<https://ci.centos.org/job/libvirt-dbus-check/systems=libvirt-freebsd-11/ws/build/tests'> /usr/local/bin/gmake check-TESTS gmake[2]: Entering directory '/usr<https://ci.centos.org/job/libvirt-dbus-check/systems=libvirt-freebsd-11/ws/build/tests'> gmake[3]: Entering directory '/usr<https://ci.centos.org/job/libvirt-dbus-check/systems=libvirt-freebsd-11/ws/build/tests'> PASS: test_util PASS: test_interface.py PASS: test_domain.py PASS: test_network.py PASS: test_nodedev.py FAIL: test_connect.py PASS: test_storage.py ============================================================================ Testsuite summary for libvirt-dbus 1.4.0 ============================================================================ # TOTAL: 7 # PASS: 6 # SKIP: 0 # XFAIL: 0 # FAIL: 1 # XPASS: 0 # ERROR: 0 ============================================================================ See tests/test-suite.log Please report to libvir-list@redhat.com ============================================================================ gmake[3]: *** [Makefile:766: test-suite.log] Error 1 gmake[3]: Leaving directory '/usr<https://ci.centos.org/job/libvirt-dbus-check/systems=libvirt-freebsd-11/ws/build/tests'> gmake[2]: *** [Makefile:874: check-TESTS] Error 2 gmake[2]: Leaving directory '/usr<https://ci.centos.org/job/libvirt-dbus-check/systems=libvirt-freebsd-11/ws/build/tests'> gmake[1]: *** [Makefile:990: check-am] Error 2 gmake[1]: Leaving directory '/usr<https://ci.centos.org/job/libvirt-dbus-check/systems=libvirt-freebsd-11/ws/build/tests'> gmake: *** [Makefile:460: check-recursive] Error 1 + cat tests/test-suite.log ============================================== libvirt-dbus 1.4.0: tests/test-suite.log ============================================== # TOTAL: 7 # PASS: 6 # SKIP: 0 # XFAIL: 0 # FAIL: 1 # XPASS: 0 # ERROR: 0 .. contents:: :depth: 2 FAIL: test_connect.py ===================== ============================= test session starts ============================== platform freebsd11 -- Python 3.6.8, pytest-4.3.1, py-1.8.0, pluggy-0.7.1 rootdir: /usr<https://ci.centos.org/job/libvirt-dbus-check/systems=libvirt-freebsd-11/ws/,> inifile: collected 35 items ../../tests/test_connect.py .........................F......... [100%] =================================== FAILURES =================================== _______________ TestConnect.test_connect_node_device_create_xml ________________ Fixture "node_device_create" called directly. Fixtures are not meant to be called directly, but are created automatically when test functions request them as parameters. See https://docs.pytest.org/en/latest/fixture.html for more information about fixtures, and https://docs.pytest.org/en/latest/deprecations.html#calling-fixtures-directl... about how to update your code. ===================== 1 failed, 34 passed in 14.60 seconds ===================== FAIL test_connect.py (exit status: 1) + exit 1 Build step 'Execute shell' marked build as failure

See <https://ci.centos.org/job/libvirt-dbus-check/systems=libvirt-freebsd-11/309/display/redirect> ------------------------------------------ Started by upstream project "libvirt-dbus-check" build number 309 originally caused by: Started by upstream project "libvirt-dbus-syntax-check" build number 352 originally caused by: Started by upstream project "libvirt-dbus-build" build number 359 originally caused by: Started by upstream project "libvirt-glib-build" build number 356 originally caused by: Started by upstream project "libvirt-build" build number 454 originally caused by: Started by an SCM change [EnvInject] - Loading node environment variables. Building remotely on libvirt-freebsd-11 (libvirt) in workspace <https://ci.centos.org/job/libvirt-dbus-check/systems=libvirt-freebsd-11/ws/> [libvirt-dbus] $ /bin/sh -xe /tmp/jenkins3672668443463740207.sh + cd build + /usr/local/bin/gmake check Making check in data gmake[1]: Entering directory '/usr<https://ci.centos.org/job/libvirt-dbus-check/systems=libvirt-freebsd-11/ws/build/data'> gmake[1]: Nothing to be done for 'check'. gmake[1]: Leaving directory '/usr<https://ci.centos.org/job/libvirt-dbus-check/systems=libvirt-freebsd-11/ws/build/data'> Making check in docs gmake[1]: Entering directory '/usr<https://ci.centos.org/job/libvirt-dbus-check/systems=libvirt-freebsd-11/ws/build/docs'> gmake[1]: Nothing to be done for 'check'. gmake[1]: Leaving directory '/usr<https://ci.centos.org/job/libvirt-dbus-check/systems=libvirt-freebsd-11/ws/build/docs'> Making check in src gmake[1]: Entering directory '/usr<https://ci.centos.org/job/libvirt-dbus-check/systems=libvirt-freebsd-11/ws/build/src'> gmake[1]: Nothing to be done for 'check'. gmake[1]: Leaving directory '/usr<https://ci.centos.org/job/libvirt-dbus-check/systems=libvirt-freebsd-11/ws/build/src'> Making check in tests gmake[1]: Entering directory '/usr<https://ci.centos.org/job/libvirt-dbus-check/systems=libvirt-freebsd-11/ws/build/tests'> /usr/local/bin/gmake test_util gmake[2]: Entering directory '/usr<https://ci.centos.org/job/libvirt-dbus-check/systems=libvirt-freebsd-11/ws/build/tests'> CC test_util-test_util.o CCLD test_util gmake[2]: Leaving directory '/usr<https://ci.centos.org/job/libvirt-dbus-check/systems=libvirt-freebsd-11/ws/build/tests'> /usr/local/bin/gmake check-TESTS gmake[2]: Entering directory '/usr<https://ci.centos.org/job/libvirt-dbus-check/systems=libvirt-freebsd-11/ws/build/tests'> gmake[3]: Entering directory '/usr<https://ci.centos.org/job/libvirt-dbus-check/systems=libvirt-freebsd-11/ws/build/tests'> PASS: test_util PASS: test_interface.py PASS: test_domain.py PASS: test_network.py PASS: test_nodedev.py FAIL: test_connect.py PASS: test_storage.py ============================================================================ Testsuite summary for libvirt-dbus 1.4.0 ============================================================================ # TOTAL: 7 # PASS: 6 # SKIP: 0 # XFAIL: 0 # FAIL: 1 # XPASS: 0 # ERROR: 0 ============================================================================ See tests/test-suite.log Please report to libvir-list@redhat.com ============================================================================ gmake[3]: *** [Makefile:766: test-suite.log] Error 1 gmake[3]: Leaving directory '/usr<https://ci.centos.org/job/libvirt-dbus-check/systems=libvirt-freebsd-11/ws/build/tests'> gmake[2]: *** [Makefile:874: check-TESTS] Error 2 gmake[2]: Leaving directory '/usr<https://ci.centos.org/job/libvirt-dbus-check/systems=libvirt-freebsd-11/ws/build/tests'> gmake[1]: *** [Makefile:990: check-am] Error 2 gmake[1]: Leaving directory '/usr<https://ci.centos.org/job/libvirt-dbus-check/systems=libvirt-freebsd-11/ws/build/tests'> gmake: *** [Makefile:460: check-recursive] Error 1 + cat tests/test-suite.log ============================================== libvirt-dbus 1.4.0: tests/test-suite.log ============================================== # TOTAL: 7 # PASS: 6 # SKIP: 0 # XFAIL: 0 # FAIL: 1 # XPASS: 0 # ERROR: 0 .. contents:: :depth: 2 FAIL: test_connect.py ===================== ============================= test session starts ============================== platform freebsd11 -- Python 3.6.8, pytest-4.3.1, py-1.8.0, pluggy-0.7.1 rootdir: /usr<https://ci.centos.org/job/libvirt-dbus-check/systems=libvirt-freebsd-11/ws/,> inifile: collected 35 items ../../tests/test_connect.py .........................F......... [100%] =================================== FAILURES =================================== _______________ TestConnect.test_connect_node_device_create_xml ________________ Fixture "node_device_create" called directly. Fixtures are not meant to be called directly, but are created automatically when test functions request them as parameters. See https://docs.pytest.org/en/latest/fixture.html for more information about fixtures, and https://docs.pytest.org/en/latest/deprecations.html#calling-fixtures-directl... about how to update your code. ===================== 1 failed, 34 passed in 21.00 seconds ===================== FAIL test_connect.py (exit status: 1) + exit 1 Build step 'Execute shell' marked build as failure

See <https://ci.centos.org/job/libvirt-dbus-check/systems=libvirt-freebsd-11/310/display/redirect> ------------------------------------------ Started by upstream project "libvirt-dbus-check" build number 310 originally caused by: Started by upstream project "libvirt-dbus-syntax-check" build number 353 originally caused by: Started by upstream project "libvirt-dbus-build" build number 360 originally caused by: Started by upstream project "libvirt-glib-build" build number 357 originally caused by: Started by upstream project "libvirt-build" build number 455 originally caused by: Started by an SCM change [EnvInject] - Loading node environment variables. Building remotely on libvirt-freebsd-11 (libvirt) in workspace <https://ci.centos.org/job/libvirt-dbus-check/systems=libvirt-freebsd-11/ws/> [libvirt-dbus] $ /bin/sh -xe /tmp/jenkins8206498549567644853.sh + cd build + /usr/local/bin/gmake check Making check in data gmake[1]: Entering directory '/usr<https://ci.centos.org/job/libvirt-dbus-check/systems=libvirt-freebsd-11/ws/build/data'> gmake[1]: Nothing to be done for 'check'. gmake[1]: Leaving directory '/usr<https://ci.centos.org/job/libvirt-dbus-check/systems=libvirt-freebsd-11/ws/build/data'> Making check in docs gmake[1]: Entering directory '/usr<https://ci.centos.org/job/libvirt-dbus-check/systems=libvirt-freebsd-11/ws/build/docs'> gmake[1]: Nothing to be done for 'check'. gmake[1]: Leaving directory '/usr<https://ci.centos.org/job/libvirt-dbus-check/systems=libvirt-freebsd-11/ws/build/docs'> Making check in src gmake[1]: Entering directory '/usr<https://ci.centos.org/job/libvirt-dbus-check/systems=libvirt-freebsd-11/ws/build/src'> gmake[1]: Nothing to be done for 'check'. gmake[1]: Leaving directory '/usr<https://ci.centos.org/job/libvirt-dbus-check/systems=libvirt-freebsd-11/ws/build/src'> Making check in tests gmake[1]: Entering directory '/usr<https://ci.centos.org/job/libvirt-dbus-check/systems=libvirt-freebsd-11/ws/build/tests'> /usr/local/bin/gmake test_util gmake[2]: Entering directory '/usr<https://ci.centos.org/job/libvirt-dbus-check/systems=libvirt-freebsd-11/ws/build/tests'> CC test_util-test_util.o CCLD test_util gmake[2]: Leaving directory '/usr<https://ci.centos.org/job/libvirt-dbus-check/systems=libvirt-freebsd-11/ws/build/tests'> /usr/local/bin/gmake check-TESTS gmake[2]: Entering directory '/usr<https://ci.centos.org/job/libvirt-dbus-check/systems=libvirt-freebsd-11/ws/build/tests'> gmake[3]: Entering directory '/usr<https://ci.centos.org/job/libvirt-dbus-check/systems=libvirt-freebsd-11/ws/build/tests'> PASS: test_util PASS: test_interface.py PASS: test_domain.py PASS: test_network.py PASS: test_nodedev.py FAIL: test_connect.py PASS: test_storage.py ============================================================================ Testsuite summary for libvirt-dbus 1.4.0 ============================================================================ # TOTAL: 7 # PASS: 6 # SKIP: 0 # XFAIL: 0 # FAIL: 1 # XPASS: 0 # ERROR: 0 ============================================================================ See tests/test-suite.log Please report to libvir-list@redhat.com ============================================================================ gmake[3]: *** [Makefile:766: test-suite.log] Error 1 gmake[3]: Leaving directory '/usr<https://ci.centos.org/job/libvirt-dbus-check/systems=libvirt-freebsd-11/ws/build/tests'> gmake[2]: *** [Makefile:874: check-TESTS] Error 2 gmake[2]: Leaving directory '/usr<https://ci.centos.org/job/libvirt-dbus-check/systems=libvirt-freebsd-11/ws/build/tests'> gmake[1]: *** [Makefile:990: check-am] Error 2 gmake[1]: Leaving directory '/usr<https://ci.centos.org/job/libvirt-dbus-check/systems=libvirt-freebsd-11/ws/build/tests'> gmake: *** [Makefile:460: check-recursive] Error 1 + cat tests/test-suite.log ============================================== libvirt-dbus 1.4.0: tests/test-suite.log ============================================== # TOTAL: 7 # PASS: 6 # SKIP: 0 # XFAIL: 0 # FAIL: 1 # XPASS: 0 # ERROR: 0 .. contents:: :depth: 2 FAIL: test_connect.py ===================== ============================= test session starts ============================== platform freebsd11 -- Python 3.6.8, pytest-4.3.1, py-1.8.0, pluggy-0.7.1 rootdir: /usr<https://ci.centos.org/job/libvirt-dbus-check/systems=libvirt-freebsd-11/ws/,> inifile: collected 35 items ../../tests/test_connect.py .........................F......... [100%] =================================== FAILURES =================================== _______________ TestConnect.test_connect_node_device_create_xml ________________ Fixture "node_device_create" called directly. Fixtures are not meant to be called directly, but are created automatically when test functions request them as parameters. See https://docs.pytest.org/en/latest/fixture.html for more information about fixtures, and https://docs.pytest.org/en/latest/deprecations.html#calling-fixtures-directl... about how to update your code. ===================== 1 failed, 34 passed in 14.94 seconds ===================== FAIL test_connect.py (exit status: 1) + exit 1 Build step 'Execute shell' marked build as failure

See <https://ci.centos.org/job/libvirt-dbus-check/systems=libvirt-freebsd-11/311/display/redirect> ------------------------------------------ Started by upstream project "libvirt-dbus-check" build number 311 originally caused by: Started by upstream project "libvirt-dbus-syntax-check" build number 354 originally caused by: Started by upstream project "libvirt-dbus-build" build number 361 originally caused by: Started by upstream project "libvirt-glib-build" build number 358 originally caused by: Started by upstream project "libvirt-build" build number 456 originally caused by: Started by an SCM change Started by an SCM change Started by an SCM change Started by an SCM change Started by an SCM change Started by an SCM change [EnvInject] - Loading node environment variables. Building remotely on libvirt-freebsd-11 (libvirt) in workspace <https://ci.centos.org/job/libvirt-dbus-check/systems=libvirt-freebsd-11/ws/> [libvirt-dbus] $ /bin/sh -xe /tmp/jenkins7051647573343849191.sh + cd build + /usr/local/bin/gmake check Making check in data gmake[1]: Entering directory '/usr<https://ci.centos.org/job/libvirt-dbus-check/systems=libvirt-freebsd-11/ws/build/data'> gmake[1]: Nothing to be done for 'check'. gmake[1]: Leaving directory '/usr<https://ci.centos.org/job/libvirt-dbus-check/systems=libvirt-freebsd-11/ws/build/data'> Making check in docs gmake[1]: Entering directory '/usr<https://ci.centos.org/job/libvirt-dbus-check/systems=libvirt-freebsd-11/ws/build/docs'> gmake[1]: Nothing to be done for 'check'. gmake[1]: Leaving directory '/usr<https://ci.centos.org/job/libvirt-dbus-check/systems=libvirt-freebsd-11/ws/build/docs'> Making check in src gmake[1]: Entering directory '/usr<https://ci.centos.org/job/libvirt-dbus-check/systems=libvirt-freebsd-11/ws/build/src'> gmake[1]: Nothing to be done for 'check'. gmake[1]: Leaving directory '/usr<https://ci.centos.org/job/libvirt-dbus-check/systems=libvirt-freebsd-11/ws/build/src'> Making check in tests gmake[1]: Entering directory '/usr<https://ci.centos.org/job/libvirt-dbus-check/systems=libvirt-freebsd-11/ws/build/tests'> /usr/local/bin/gmake test_util gmake[2]: Entering directory '/usr<https://ci.centos.org/job/libvirt-dbus-check/systems=libvirt-freebsd-11/ws/build/tests'> CC test_util-test_util.o CCLD test_util gmake[2]: Leaving directory '/usr<https://ci.centos.org/job/libvirt-dbus-check/systems=libvirt-freebsd-11/ws/build/tests'> /usr/local/bin/gmake check-TESTS gmake[2]: Entering directory '/usr<https://ci.centos.org/job/libvirt-dbus-check/systems=libvirt-freebsd-11/ws/build/tests'> gmake[3]: Entering directory '/usr<https://ci.centos.org/job/libvirt-dbus-check/systems=libvirt-freebsd-11/ws/build/tests'> PASS: test_util PASS: test_interface.py PASS: test_domain.py PASS: test_nodedev.py PASS: test_network.py FAIL: test_connect.py PASS: test_storage.py ============================================================================ Testsuite summary for libvirt-dbus 1.4.0 ============================================================================ # TOTAL: 7 # PASS: 6 # SKIP: 0 # XFAIL: 0 # FAIL: 1 # XPASS: 0 # ERROR: 0 ============================================================================ See tests/test-suite.log Please report to libvir-list@redhat.com ============================================================================ gmake[3]: *** [Makefile:766: test-suite.log] Error 1 gmake[3]: Leaving directory '/usr<https://ci.centos.org/job/libvirt-dbus-check/systems=libvirt-freebsd-11/ws/build/tests'> gmake[2]: *** [Makefile:874: check-TESTS] Error 2 gmake[2]: Leaving directory '/usr<https://ci.centos.org/job/libvirt-dbus-check/systems=libvirt-freebsd-11/ws/build/tests'> gmake[1]: *** [Makefile:990: check-am] Error 2 gmake[1]: Leaving directory '/usr<https://ci.centos.org/job/libvirt-dbus-check/systems=libvirt-freebsd-11/ws/build/tests'> gmake: *** [Makefile:460: check-recursive] Error 1 + cat tests/test-suite.log ============================================== libvirt-dbus 1.4.0: tests/test-suite.log ============================================== # TOTAL: 7 # PASS: 6 # SKIP: 0 # XFAIL: 0 # FAIL: 1 # XPASS: 0 # ERROR: 0 .. contents:: :depth: 2 FAIL: test_connect.py ===================== ============================= test session starts ============================== platform freebsd11 -- Python 3.6.8, pytest-4.3.1, py-1.8.0, pluggy-0.7.1 rootdir: /usr<https://ci.centos.org/job/libvirt-dbus-check/systems=libvirt-freebsd-11/ws/,> inifile: collected 35 items ../../tests/test_connect.py .........................F......... [100%] =================================== FAILURES =================================== _______________ TestConnect.test_connect_node_device_create_xml ________________ Fixture "node_device_create" called directly. Fixtures are not meant to be called directly, but are created automatically when test functions request them as parameters. See https://docs.pytest.org/en/latest/fixture.html for more information about fixtures, and https://docs.pytest.org/en/latest/deprecations.html#calling-fixtures-directl... about how to update your code. ===================== 1 failed, 34 passed in 15.56 seconds ===================== FAIL test_connect.py (exit status: 1) + exit 1 Build step 'Execute shell' marked build as failure

See <https://ci.centos.org/job/libvirt-dbus-check/systems=libvirt-freebsd-11/312/display/redirect> ------------------------------------------ Started by upstream project "libvirt-dbus-check" build number 312 originally caused by: Started by upstream project "libvirt-dbus-syntax-check" build number 355 originally caused by: Started by upstream project "libvirt-dbus-build" build number 362 originally caused by: Started by upstream project "libvirt-glib-build" build number 359 originally caused by: Started by upstream project "libvirt-build" build number 457 originally caused by: Started by an SCM change [EnvInject] - Loading node environment variables. Building remotely on libvirt-freebsd-11 (libvirt) in workspace <https://ci.centos.org/job/libvirt-dbus-check/systems=libvirt-freebsd-11/ws/> [libvirt-dbus] $ /bin/sh -xe /tmp/jenkins8936242536697969736.sh + cd build + /usr/local/bin/gmake check Making check in data gmake[1]: Entering directory '/usr<https://ci.centos.org/job/libvirt-dbus-check/systems=libvirt-freebsd-11/ws/build/data'> gmake[1]: Nothing to be done for 'check'. gmake[1]: Leaving directory '/usr<https://ci.centos.org/job/libvirt-dbus-check/systems=libvirt-freebsd-11/ws/build/data'> Making check in docs gmake[1]: Entering directory '/usr<https://ci.centos.org/job/libvirt-dbus-check/systems=libvirt-freebsd-11/ws/build/docs'> gmake[1]: Nothing to be done for 'check'. gmake[1]: Leaving directory '/usr<https://ci.centos.org/job/libvirt-dbus-check/systems=libvirt-freebsd-11/ws/build/docs'> Making check in src gmake[1]: Entering directory '/usr<https://ci.centos.org/job/libvirt-dbus-check/systems=libvirt-freebsd-11/ws/build/src'> gmake[1]: Nothing to be done for 'check'. gmake[1]: Leaving directory '/usr<https://ci.centos.org/job/libvirt-dbus-check/systems=libvirt-freebsd-11/ws/build/src'> Making check in tests gmake[1]: Entering directory '/usr<https://ci.centos.org/job/libvirt-dbus-check/systems=libvirt-freebsd-11/ws/build/tests'> /usr/local/bin/gmake test_util gmake[2]: Entering directory '/usr<https://ci.centos.org/job/libvirt-dbus-check/systems=libvirt-freebsd-11/ws/build/tests'> CC test_util-test_util.o CCLD test_util gmake[2]: Leaving directory '/usr<https://ci.centos.org/job/libvirt-dbus-check/systems=libvirt-freebsd-11/ws/build/tests'> /usr/local/bin/gmake check-TESTS gmake[2]: Entering directory '/usr<https://ci.centos.org/job/libvirt-dbus-check/systems=libvirt-freebsd-11/ws/build/tests'> gmake[3]: Entering directory '/usr<https://ci.centos.org/job/libvirt-dbus-check/systems=libvirt-freebsd-11/ws/build/tests'> PASS: test_util PASS: test_interface.py PASS: test_domain.py PASS: test_network.py PASS: test_nodedev.py FAIL: test_connect.py PASS: test_storage.py ============================================================================ Testsuite summary for libvirt-dbus 1.4.0 ============================================================================ # TOTAL: 7 # PASS: 6 # SKIP: 0 # XFAIL: 0 # FAIL: 1 # XPASS: 0 # ERROR: 0 ============================================================================ See tests/test-suite.log Please report to libvir-list@redhat.com ============================================================================ gmake[3]: *** [Makefile:766: test-suite.log] Error 1 gmake[3]: Leaving directory '/usr<https://ci.centos.org/job/libvirt-dbus-check/systems=libvirt-freebsd-11/ws/build/tests'> gmake[2]: *** [Makefile:874: check-TESTS] Error 2 gmake[2]: Leaving directory '/usr<https://ci.centos.org/job/libvirt-dbus-check/systems=libvirt-freebsd-11/ws/build/tests'> gmake[1]: *** [Makefile:990: check-am] Error 2 gmake[1]: Leaving directory '/usr<https://ci.centos.org/job/libvirt-dbus-check/systems=libvirt-freebsd-11/ws/build/tests'> gmake: *** [Makefile:460: check-recursive] Error 1 + cat tests/test-suite.log ============================================== libvirt-dbus 1.4.0: tests/test-suite.log ============================================== # TOTAL: 7 # PASS: 6 # SKIP: 0 # XFAIL: 0 # FAIL: 1 # XPASS: 0 # ERROR: 0 .. contents:: :depth: 2 FAIL: test_connect.py ===================== ============================= test session starts ============================== platform freebsd11 -- Python 3.6.8, pytest-4.3.1, py-1.8.0, pluggy-0.7.1 rootdir: /usr<https://ci.centos.org/job/libvirt-dbus-check/systems=libvirt-freebsd-11/ws/,> inifile: collected 35 items ../../tests/test_connect.py .........................F......... [100%] =================================== FAILURES =================================== _______________ TestConnect.test_connect_node_device_create_xml ________________ Fixture "node_device_create" called directly. Fixtures are not meant to be called directly, but are created automatically when test functions request them as parameters. See https://docs.pytest.org/en/latest/fixture.html for more information about fixtures, and https://docs.pytest.org/en/latest/deprecations.html#calling-fixtures-directl... about how to update your code. ===================== 1 failed, 34 passed in 13.95 seconds ===================== FAIL test_connect.py (exit status: 1) + exit 1 Build step 'Execute shell' marked build as failure

See <https://ci.centos.org/job/libvirt-dbus-check/systems=libvirt-freebsd-11/313/display/redirect> ------------------------------------------ Started by upstream project "libvirt-dbus-check" build number 313 originally caused by: Started by upstream project "libvirt-dbus-syntax-check" build number 356 originally caused by: Started by upstream project "libvirt-dbus-build" build number 363 originally caused by: Started by upstream project "libvirt-glib-build" build number 360 originally caused by: Started by upstream project "libvirt-build" build number 458 originally caused by: Started by an SCM change [EnvInject] - Loading node environment variables. Building remotely on libvirt-freebsd-11 (libvirt) in workspace <https://ci.centos.org/job/libvirt-dbus-check/systems=libvirt-freebsd-11/ws/> [libvirt-dbus] $ /bin/sh -xe /tmp/jenkins451168515312639929.sh + cd build + /usr/local/bin/gmake check Making check in data gmake[1]: Entering directory '/usr<https://ci.centos.org/job/libvirt-dbus-check/systems=libvirt-freebsd-11/ws/build/data'> gmake[1]: Nothing to be done for 'check'. gmake[1]: Leaving directory '/usr<https://ci.centos.org/job/libvirt-dbus-check/systems=libvirt-freebsd-11/ws/build/data'> Making check in docs gmake[1]: Entering directory '/usr<https://ci.centos.org/job/libvirt-dbus-check/systems=libvirt-freebsd-11/ws/build/docs'> gmake[1]: Nothing to be done for 'check'. gmake[1]: Leaving directory '/usr<https://ci.centos.org/job/libvirt-dbus-check/systems=libvirt-freebsd-11/ws/build/docs'> Making check in src gmake[1]: Entering directory '/usr<https://ci.centos.org/job/libvirt-dbus-check/systems=libvirt-freebsd-11/ws/build/src'> gmake[1]: Nothing to be done for 'check'. gmake[1]: Leaving directory '/usr<https://ci.centos.org/job/libvirt-dbus-check/systems=libvirt-freebsd-11/ws/build/src'> Making check in tests gmake[1]: Entering directory '/usr<https://ci.centos.org/job/libvirt-dbus-check/systems=libvirt-freebsd-11/ws/build/tests'> /usr/local/bin/gmake test_util gmake[2]: Entering directory '/usr<https://ci.centos.org/job/libvirt-dbus-check/systems=libvirt-freebsd-11/ws/build/tests'> CC test_util-test_util.o CCLD test_util gmake[2]: Leaving directory '/usr<https://ci.centos.org/job/libvirt-dbus-check/systems=libvirt-freebsd-11/ws/build/tests'> /usr/local/bin/gmake check-TESTS gmake[2]: Entering directory '/usr<https://ci.centos.org/job/libvirt-dbus-check/systems=libvirt-freebsd-11/ws/build/tests'> gmake[3]: Entering directory '/usr<https://ci.centos.org/job/libvirt-dbus-check/systems=libvirt-freebsd-11/ws/build/tests'> PASS: test_util PASS: test_interface.py PASS: test_domain.py PASS: test_network.py PASS: test_nodedev.py FAIL: test_connect.py PASS: test_storage.py ============================================================================ Testsuite summary for libvirt-dbus 1.4.0 ============================================================================ # TOTAL: 7 # PASS: 6 # SKIP: 0 # XFAIL: 0 # FAIL: 1 # XPASS: 0 # ERROR: 0 ============================================================================ See tests/test-suite.log Please report to libvir-list@redhat.com ============================================================================ gmake[3]: *** [Makefile:766: test-suite.log] Error 1 gmake[3]: Leaving directory '/usr<https://ci.centos.org/job/libvirt-dbus-check/systems=libvirt-freebsd-11/ws/build/tests'> gmake[2]: *** [Makefile:874: check-TESTS] Error 2 gmake[2]: Leaving directory '/usr<https://ci.centos.org/job/libvirt-dbus-check/systems=libvirt-freebsd-11/ws/build/tests'> gmake[1]: *** [Makefile:990: check-am] Error 2 gmake[1]: Leaving directory '/usr<https://ci.centos.org/job/libvirt-dbus-check/systems=libvirt-freebsd-11/ws/build/tests'> gmake: *** [Makefile:460: check-recursive] Error 1 + cat tests/test-suite.log ============================================== libvirt-dbus 1.4.0: tests/test-suite.log ============================================== # TOTAL: 7 # PASS: 6 # SKIP: 0 # XFAIL: 0 # FAIL: 1 # XPASS: 0 # ERROR: 0 .. contents:: :depth: 2 FAIL: test_connect.py ===================== ============================= test session starts ============================== platform freebsd11 -- Python 3.6.8, pytest-4.3.1, py-1.8.0, pluggy-0.7.1 rootdir: /usr<https://ci.centos.org/job/libvirt-dbus-check/systems=libvirt-freebsd-11/ws/,> inifile: collected 35 items ../../tests/test_connect.py .........................F......... [100%] =================================== FAILURES =================================== _______________ TestConnect.test_connect_node_device_create_xml ________________ Fixture "node_device_create" called directly. Fixtures are not meant to be called directly, but are created automatically when test functions request them as parameters. See https://docs.pytest.org/en/latest/fixture.html for more information about fixtures, and https://docs.pytest.org/en/latest/deprecations.html#calling-fixtures-directl... about how to update your code. ===================== 1 failed, 34 passed in 27.73 seconds ===================== FAIL test_connect.py (exit status: 1) + exit 1 Build step 'Execute shell' marked build as failure

See <https://ci.centos.org/job/libvirt-dbus-check/systems=libvirt-freebsd-11/314/display/redirect> ------------------------------------------ Started by upstream project "libvirt-dbus-check" build number 314 originally caused by: Started by upstream project "libvirt-dbus-syntax-check" build number 357 originally caused by: Started by upstream project "libvirt-dbus-build" build number 364 originally caused by: Started by upstream project "libvirt-glib-build" build number 361 originally caused by: Started by upstream project "libvirt-build" build number 459 originally caused by: Started by an SCM change [EnvInject] - Loading node environment variables. Building remotely on libvirt-freebsd-11 (libvirt) in workspace <https://ci.centos.org/job/libvirt-dbus-check/systems=libvirt-freebsd-11/ws/> [libvirt-dbus] $ /bin/sh -xe /tmp/jenkins3636697908070745165.sh + cd build + /usr/local/bin/gmake check Making check in data gmake[1]: Entering directory '/usr<https://ci.centos.org/job/libvirt-dbus-check/systems=libvirt-freebsd-11/ws/build/data'> gmake[1]: Nothing to be done for 'check'. gmake[1]: Leaving directory '/usr<https://ci.centos.org/job/libvirt-dbus-check/systems=libvirt-freebsd-11/ws/build/data'> Making check in docs gmake[1]: Entering directory '/usr<https://ci.centos.org/job/libvirt-dbus-check/systems=libvirt-freebsd-11/ws/build/docs'> gmake[1]: Nothing to be done for 'check'. gmake[1]: Leaving directory '/usr<https://ci.centos.org/job/libvirt-dbus-check/systems=libvirt-freebsd-11/ws/build/docs'> Making check in src gmake[1]: Entering directory '/usr<https://ci.centos.org/job/libvirt-dbus-check/systems=libvirt-freebsd-11/ws/build/src'> gmake[1]: Nothing to be done for 'check'. gmake[1]: Leaving directory '/usr<https://ci.centos.org/job/libvirt-dbus-check/systems=libvirt-freebsd-11/ws/build/src'> Making check in tests gmake[1]: Entering directory '/usr<https://ci.centos.org/job/libvirt-dbus-check/systems=libvirt-freebsd-11/ws/build/tests'> /usr/local/bin/gmake test_util gmake[2]: Entering directory '/usr<https://ci.centos.org/job/libvirt-dbus-check/systems=libvirt-freebsd-11/ws/build/tests'> CC test_util-test_util.o CCLD test_util gmake[2]: Leaving directory '/usr<https://ci.centos.org/job/libvirt-dbus-check/systems=libvirt-freebsd-11/ws/build/tests'> /usr/local/bin/gmake check-TESTS gmake[2]: Entering directory '/usr<https://ci.centos.org/job/libvirt-dbus-check/systems=libvirt-freebsd-11/ws/build/tests'> gmake[3]: Entering directory '/usr<https://ci.centos.org/job/libvirt-dbus-check/systems=libvirt-freebsd-11/ws/build/tests'> PASS: test_util PASS: test_interface.py PASS: test_domain.py PASS: test_network.py PASS: test_nodedev.py FAIL: test_connect.py PASS: test_storage.py ============================================================================ Testsuite summary for libvirt-dbus 1.4.0 ============================================================================ # TOTAL: 7 # PASS: 6 # SKIP: 0 # XFAIL: 0 # FAIL: 1 # XPASS: 0 # ERROR: 0 ============================================================================ See tests/test-suite.log Please report to libvir-list@redhat.com ============================================================================ gmake[3]: *** [Makefile:766: test-suite.log] Error 1 gmake[3]: Leaving directory '/usr<https://ci.centos.org/job/libvirt-dbus-check/systems=libvirt-freebsd-11/ws/build/tests'> gmake[2]: *** [Makefile:874: check-TESTS] Error 2 gmake[2]: Leaving directory '/usr<https://ci.centos.org/job/libvirt-dbus-check/systems=libvirt-freebsd-11/ws/build/tests'> gmake[1]: *** [Makefile:990: check-am] Error 2 gmake[1]: Leaving directory '/usr<https://ci.centos.org/job/libvirt-dbus-check/systems=libvirt-freebsd-11/ws/build/tests'> gmake: *** [Makefile:460: check-recursive] Error 1 + cat tests/test-suite.log ============================================== libvirt-dbus 1.4.0: tests/test-suite.log ============================================== # TOTAL: 7 # PASS: 6 # SKIP: 0 # XFAIL: 0 # FAIL: 1 # XPASS: 0 # ERROR: 0 .. contents:: :depth: 2 FAIL: test_connect.py ===================== ============================= test session starts ============================== platform freebsd11 -- Python 3.6.8, pytest-4.3.1, py-1.8.0, pluggy-0.7.1 rootdir: /usr<https://ci.centos.org/job/libvirt-dbus-check/systems=libvirt-freebsd-11/ws/,> inifile: collected 35 items ../../tests/test_connect.py .........................F......... [100%] =================================== FAILURES =================================== _______________ TestConnect.test_connect_node_device_create_xml ________________ Fixture "node_device_create" called directly. Fixtures are not meant to be called directly, but are created automatically when test functions request them as parameters. See https://docs.pytest.org/en/latest/fixture.html for more information about fixtures, and https://docs.pytest.org/en/latest/deprecations.html#calling-fixtures-directl... about how to update your code. ===================== 1 failed, 34 passed in 14.38 seconds ===================== FAIL test_connect.py (exit status: 1) + exit 1 Build step 'Execute shell' marked build as failure

See <https://ci.centos.org/job/libvirt-dbus-check/systems=libvirt-freebsd-11/315/display/redirect> ------------------------------------------ Started by upstream project "libvirt-dbus-check" build number 315 originally caused by: Started by upstream project "libvirt-dbus-syntax-check" build number 358 originally caused by: Started by upstream project "libvirt-dbus-build" build number 365 originally caused by: Started by upstream project "libvirt-glib-build" build number 362 originally caused by: Started by upstream project "libvirt-build" build number 460 originally caused by: Started by an SCM change Started by an SCM change Started by an SCM change Started by an SCM change [EnvInject] - Loading node environment variables. Building remotely on libvirt-freebsd-11 (libvirt) in workspace <https://ci.centos.org/job/libvirt-dbus-check/systems=libvirt-freebsd-11/ws/> [libvirt-dbus] $ /bin/sh -xe /tmp/jenkins2483159069993723676.sh + cd build + /usr/local/bin/gmake check Making check in data gmake[1]: Entering directory '/usr<https://ci.centos.org/job/libvirt-dbus-check/systems=libvirt-freebsd-11/ws/build/data'> gmake[1]: Nothing to be done for 'check'. gmake[1]: Leaving directory '/usr<https://ci.centos.org/job/libvirt-dbus-check/systems=libvirt-freebsd-11/ws/build/data'> Making check in docs gmake[1]: Entering directory '/usr<https://ci.centos.org/job/libvirt-dbus-check/systems=libvirt-freebsd-11/ws/build/docs'> gmake[1]: Nothing to be done for 'check'. gmake[1]: Leaving directory '/usr<https://ci.centos.org/job/libvirt-dbus-check/systems=libvirt-freebsd-11/ws/build/docs'> Making check in src gmake[1]: Entering directory '/usr<https://ci.centos.org/job/libvirt-dbus-check/systems=libvirt-freebsd-11/ws/build/src'> gmake[1]: Nothing to be done for 'check'. gmake[1]: Leaving directory '/usr<https://ci.centos.org/job/libvirt-dbus-check/systems=libvirt-freebsd-11/ws/build/src'> Making check in tests gmake[1]: Entering directory '/usr<https://ci.centos.org/job/libvirt-dbus-check/systems=libvirt-freebsd-11/ws/build/tests'> /usr/local/bin/gmake test_util gmake[2]: Entering directory '/usr<https://ci.centos.org/job/libvirt-dbus-check/systems=libvirt-freebsd-11/ws/build/tests'> CC test_util-test_util.o CCLD test_util gmake[2]: Leaving directory '/usr<https://ci.centos.org/job/libvirt-dbus-check/systems=libvirt-freebsd-11/ws/build/tests'> /usr/local/bin/gmake check-TESTS gmake[2]: Entering directory '/usr<https://ci.centos.org/job/libvirt-dbus-check/systems=libvirt-freebsd-11/ws/build/tests'> gmake[3]: Entering directory '/usr<https://ci.centos.org/job/libvirt-dbus-check/systems=libvirt-freebsd-11/ws/build/tests'> PASS: test_util PASS: test_interface.py PASS: test_domain.py PASS: test_network.py PASS: test_nodedev.py FAIL: test_connect.py PASS: test_storage.py ============================================================================ Testsuite summary for libvirt-dbus 1.4.0 ============================================================================ # TOTAL: 7 # PASS: 6 # SKIP: 0 # XFAIL: 0 # FAIL: 1 # XPASS: 0 # ERROR: 0 ============================================================================ See tests/test-suite.log Please report to libvir-list@redhat.com ============================================================================ gmake[3]: *** [Makefile:766: test-suite.log] Error 1 gmake[3]: Leaving directory '/usr<https://ci.centos.org/job/libvirt-dbus-check/systems=libvirt-freebsd-11/ws/build/tests'> gmake[2]: *** [Makefile:874: check-TESTS] Error 2 gmake[2]: Leaving directory '/usr<https://ci.centos.org/job/libvirt-dbus-check/systems=libvirt-freebsd-11/ws/build/tests'> gmake[1]: *** [Makefile:990: check-am] Error 2 gmake[1]: Leaving directory '/usr<https://ci.centos.org/job/libvirt-dbus-check/systems=libvirt-freebsd-11/ws/build/tests'> gmake: *** [Makefile:460: check-recursive] Error 1 + cat tests/test-suite.log ============================================== libvirt-dbus 1.4.0: tests/test-suite.log ============================================== # TOTAL: 7 # PASS: 6 # SKIP: 0 # XFAIL: 0 # FAIL: 1 # XPASS: 0 # ERROR: 0 .. contents:: :depth: 2 FAIL: test_connect.py ===================== ============================= test session starts ============================== platform freebsd11 -- Python 3.6.8, pytest-4.3.1, py-1.8.0, pluggy-0.7.1 rootdir: /usr<https://ci.centos.org/job/libvirt-dbus-check/systems=libvirt-freebsd-11/ws/,> inifile: collected 35 items ../../tests/test_connect.py .........................F......... [100%] =================================== FAILURES =================================== _______________ TestConnect.test_connect_node_device_create_xml ________________ Fixture "node_device_create" called directly. Fixtures are not meant to be called directly, but are created automatically when test functions request them as parameters. See https://docs.pytest.org/en/latest/fixture.html for more information about fixtures, and https://docs.pytest.org/en/latest/deprecations.html#calling-fixtures-directl... about how to update your code. ===================== 1 failed, 34 passed in 14.76 seconds ===================== FAIL test_connect.py (exit status: 1) + exit 1 Build step 'Execute shell' marked build as failure

See <https://ci.centos.org/job/libvirt-dbus-check/systems=libvirt-freebsd-11/316/display/redirect> ------------------------------------------ Started by upstream project "libvirt-dbus-check" build number 316 originally caused by: Started by upstream project "libvirt-dbus-syntax-check" build number 359 originally caused by: Started by upstream project "libvirt-dbus-build" build number 366 originally caused by: Started by upstream project "libvirt-glib-build" build number 363 originally caused by: Started by upstream project "libvirt-build" build number 461 originally caused by: Started by an SCM change Started by an SCM change Started by an SCM change Started by an SCM change Started by an SCM change [EnvInject] - Loading node environment variables. Building remotely on libvirt-freebsd-11 (libvirt) in workspace <https://ci.centos.org/job/libvirt-dbus-check/systems=libvirt-freebsd-11/ws/> [libvirt-dbus] $ /bin/sh -xe /tmp/jenkins9118903554849339456.sh + cd build + /usr/local/bin/gmake check Making check in data gmake[1]: Entering directory '/usr<https://ci.centos.org/job/libvirt-dbus-check/systems=libvirt-freebsd-11/ws/build/data'> gmake[1]: Nothing to be done for 'check'. gmake[1]: Leaving directory '/usr<https://ci.centos.org/job/libvirt-dbus-check/systems=libvirt-freebsd-11/ws/build/data'> Making check in docs gmake[1]: Entering directory '/usr<https://ci.centos.org/job/libvirt-dbus-check/systems=libvirt-freebsd-11/ws/build/docs'> gmake[1]: Nothing to be done for 'check'. gmake[1]: Leaving directory '/usr<https://ci.centos.org/job/libvirt-dbus-check/systems=libvirt-freebsd-11/ws/build/docs'> Making check in src gmake[1]: Entering directory '/usr<https://ci.centos.org/job/libvirt-dbus-check/systems=libvirt-freebsd-11/ws/build/src'> gmake[1]: Nothing to be done for 'check'. gmake[1]: Leaving directory '/usr<https://ci.centos.org/job/libvirt-dbus-check/systems=libvirt-freebsd-11/ws/build/src'> Making check in tests gmake[1]: Entering directory '/usr<https://ci.centos.org/job/libvirt-dbus-check/systems=libvirt-freebsd-11/ws/build/tests'> /usr/local/bin/gmake test_util gmake[2]: Entering directory '/usr<https://ci.centos.org/job/libvirt-dbus-check/systems=libvirt-freebsd-11/ws/build/tests'> CC test_util-test_util.o CCLD test_util gmake[2]: Leaving directory '/usr<https://ci.centos.org/job/libvirt-dbus-check/systems=libvirt-freebsd-11/ws/build/tests'> /usr/local/bin/gmake check-TESTS gmake[2]: Entering directory '/usr<https://ci.centos.org/job/libvirt-dbus-check/systems=libvirt-freebsd-11/ws/build/tests'> gmake[3]: Entering directory '/usr<https://ci.centos.org/job/libvirt-dbus-check/systems=libvirt-freebsd-11/ws/build/tests'> PASS: test_util PASS: test_interface.py PASS: test_domain.py PASS: test_network.py PASS: test_nodedev.py FAIL: test_connect.py PASS: test_storage.py ============================================================================ Testsuite summary for libvirt-dbus 1.4.0 ============================================================================ # TOTAL: 7 # PASS: 6 # SKIP: 0 # XFAIL: 0 # FAIL: 1 # XPASS: 0 # ERROR: 0 ============================================================================ See tests/test-suite.log Please report to libvir-list@redhat.com ============================================================================ gmake[3]: *** [Makefile:766: test-suite.log] Error 1 gmake[3]: Leaving directory '/usr<https://ci.centos.org/job/libvirt-dbus-check/systems=libvirt-freebsd-11/ws/build/tests'> gmake[2]: *** [Makefile:874: check-TESTS] Error 2 gmake[2]: Leaving directory '/usr<https://ci.centos.org/job/libvirt-dbus-check/systems=libvirt-freebsd-11/ws/build/tests'> gmake[1]: *** [Makefile:990: check-am] Error 2 gmake[1]: Leaving directory '/usr<https://ci.centos.org/job/libvirt-dbus-check/systems=libvirt-freebsd-11/ws/build/tests'> gmake: *** [Makefile:460: check-recursive] Error 1 + cat tests/test-suite.log ============================================== libvirt-dbus 1.4.0: tests/test-suite.log ============================================== # TOTAL: 7 # PASS: 6 # SKIP: 0 # XFAIL: 0 # FAIL: 1 # XPASS: 0 # ERROR: 0 .. contents:: :depth: 2 FAIL: test_connect.py ===================== ============================= test session starts ============================== platform freebsd11 -- Python 3.6.8, pytest-4.3.1, py-1.8.0, pluggy-0.7.1 rootdir: /usr<https://ci.centos.org/job/libvirt-dbus-check/systems=libvirt-freebsd-11/ws/,> inifile: collected 35 items ../../tests/test_connect.py .........................F......... [100%] =================================== FAILURES =================================== _______________ TestConnect.test_connect_node_device_create_xml ________________ Fixture "node_device_create" called directly. Fixtures are not meant to be called directly, but are created automatically when test functions request them as parameters. See https://docs.pytest.org/en/latest/fixture.html for more information about fixtures, and https://docs.pytest.org/en/latest/deprecations.html#calling-fixtures-directl... about how to update your code. ===================== 1 failed, 34 passed in 15.31 seconds ===================== FAIL test_connect.py (exit status: 1) + exit 1 Build step 'Execute shell' marked build as failure

See <https://ci.centos.org/job/libvirt-dbus-check/systems=libvirt-freebsd-11/317/display/redirect> ------------------------------------------ Started by upstream project "libvirt-dbus-check" build number 317 originally caused by: Started by upstream project "libvirt-dbus-syntax-check" build number 360 originally caused by: Started by upstream project "libvirt-dbus-build" build number 367 originally caused by: Started by upstream project "libvirt-glib-build" build number 364 originally caused by: Started by upstream project "libvirt-build" build number 462 originally caused by: Started by an SCM change [EnvInject] - Loading node environment variables. Building remotely on libvirt-freebsd-11 (libvirt) in workspace <https://ci.centos.org/job/libvirt-dbus-check/systems=libvirt-freebsd-11/ws/> [libvirt-dbus] $ /bin/sh -xe /tmp/jenkins8493102190911483345.sh + cd build + /usr/local/bin/gmake check Making check in data gmake[1]: Entering directory '/usr<https://ci.centos.org/job/libvirt-dbus-check/systems=libvirt-freebsd-11/ws/build/data'> gmake[1]: Nothing to be done for 'check'. gmake[1]: Leaving directory '/usr<https://ci.centos.org/job/libvirt-dbus-check/systems=libvirt-freebsd-11/ws/build/data'> Making check in docs gmake[1]: Entering directory '/usr<https://ci.centos.org/job/libvirt-dbus-check/systems=libvirt-freebsd-11/ws/build/docs'> gmake[1]: Nothing to be done for 'check'. gmake[1]: Leaving directory '/usr<https://ci.centos.org/job/libvirt-dbus-check/systems=libvirt-freebsd-11/ws/build/docs'> Making check in src gmake[1]: Entering directory '/usr<https://ci.centos.org/job/libvirt-dbus-check/systems=libvirt-freebsd-11/ws/build/src'> gmake[1]: Nothing to be done for 'check'. gmake[1]: Leaving directory '/usr<https://ci.centos.org/job/libvirt-dbus-check/systems=libvirt-freebsd-11/ws/build/src'> Making check in tests gmake[1]: Entering directory '/usr<https://ci.centos.org/job/libvirt-dbus-check/systems=libvirt-freebsd-11/ws/build/tests'> /usr/local/bin/gmake test_util gmake[2]: Entering directory '/usr<https://ci.centos.org/job/libvirt-dbus-check/systems=libvirt-freebsd-11/ws/build/tests'> CC test_util-test_util.o CCLD test_util gmake[2]: Leaving directory '/usr<https://ci.centos.org/job/libvirt-dbus-check/systems=libvirt-freebsd-11/ws/build/tests'> /usr/local/bin/gmake check-TESTS gmake[2]: Entering directory '/usr<https://ci.centos.org/job/libvirt-dbus-check/systems=libvirt-freebsd-11/ws/build/tests'> gmake[3]: Entering directory '/usr<https://ci.centos.org/job/libvirt-dbus-check/systems=libvirt-freebsd-11/ws/build/tests'> PASS: test_util PASS: test_interface.py PASS: test_domain.py PASS: test_network.py PASS: test_nodedev.py FAIL: test_connect.py PASS: test_storage.py ============================================================================ Testsuite summary for libvirt-dbus 1.4.0 ============================================================================ # TOTAL: 7 # PASS: 6 # SKIP: 0 # XFAIL: 0 # FAIL: 1 # XPASS: 0 # ERROR: 0 ============================================================================ See tests/test-suite.log Please report to libvir-list@redhat.com ============================================================================ gmake[3]: *** [Makefile:766: test-suite.log] Error 1 gmake[3]: Leaving directory '/usr<https://ci.centos.org/job/libvirt-dbus-check/systems=libvirt-freebsd-11/ws/build/tests'> gmake[2]: *** [Makefile:874: check-TESTS] Error 2 gmake[2]: Leaving directory '/usr<https://ci.centos.org/job/libvirt-dbus-check/systems=libvirt-freebsd-11/ws/build/tests'> gmake[1]: *** [Makefile:990: check-am] Error 2 gmake[1]: Leaving directory '/usr<https://ci.centos.org/job/libvirt-dbus-check/systems=libvirt-freebsd-11/ws/build/tests'> gmake: *** [Makefile:460: check-recursive] Error 1 + cat tests/test-suite.log ============================================== libvirt-dbus 1.4.0: tests/test-suite.log ============================================== # TOTAL: 7 # PASS: 6 # SKIP: 0 # XFAIL: 0 # FAIL: 1 # XPASS: 0 # ERROR: 0 .. contents:: :depth: 2 FAIL: test_connect.py ===================== ============================= test session starts ============================== platform freebsd11 -- Python 3.6.8, pytest-4.3.1, py-1.8.0, pluggy-0.7.1 rootdir: /usr<https://ci.centos.org/job/libvirt-dbus-check/systems=libvirt-freebsd-11/ws/,> inifile: collected 35 items ../../tests/test_connect.py .........................F......... [100%] =================================== FAILURES =================================== _______________ TestConnect.test_connect_node_device_create_xml ________________ Fixture "node_device_create" called directly. Fixtures are not meant to be called directly, but are created automatically when test functions request them as parameters. See https://docs.pytest.org/en/latest/fixture.html for more information about fixtures, and https://docs.pytest.org/en/latest/deprecations.html#calling-fixtures-directl... about how to update your code. ===================== 1 failed, 34 passed in 14.19 seconds ===================== FAIL test_connect.py (exit status: 1) + exit 1 Build step 'Execute shell' marked build as failure

See <https://ci.centos.org/job/libvirt-dbus-check/systems=libvirt-freebsd-11/318/display/redirect> ------------------------------------------ Started by upstream project "libvirt-dbus-check" build number 318 originally caused by: Started by upstream project "libvirt-dbus-syntax-check" build number 361 originally caused by: Started by upstream project "libvirt-dbus-build" build number 368 originally caused by: Started by upstream project "libvirt-glib-build" build number 365 originally caused by: Started by upstream project "libvirt-build" build number 463 originally caused by: Started by an SCM change [EnvInject] - Loading node environment variables. Building remotely on libvirt-freebsd-11 (libvirt) in workspace <https://ci.centos.org/job/libvirt-dbus-check/systems=libvirt-freebsd-11/ws/> [libvirt-dbus] $ /bin/sh -xe /tmp/jenkins8962448931091141509.sh + cd build + /usr/local/bin/gmake check Making check in data gmake[1]: Entering directory '/usr<https://ci.centos.org/job/libvirt-dbus-check/systems=libvirt-freebsd-11/ws/build/data'> gmake[1]: Nothing to be done for 'check'. gmake[1]: Leaving directory '/usr<https://ci.centos.org/job/libvirt-dbus-check/systems=libvirt-freebsd-11/ws/build/data'> Making check in docs gmake[1]: Entering directory '/usr<https://ci.centos.org/job/libvirt-dbus-check/systems=libvirt-freebsd-11/ws/build/docs'> gmake[1]: Nothing to be done for 'check'. gmake[1]: Leaving directory '/usr<https://ci.centos.org/job/libvirt-dbus-check/systems=libvirt-freebsd-11/ws/build/docs'> Making check in src gmake[1]: Entering directory '/usr<https://ci.centos.org/job/libvirt-dbus-check/systems=libvirt-freebsd-11/ws/build/src'> gmake[1]: Nothing to be done for 'check'. gmake[1]: Leaving directory '/usr<https://ci.centos.org/job/libvirt-dbus-check/systems=libvirt-freebsd-11/ws/build/src'> Making check in tests gmake[1]: Entering directory '/usr<https://ci.centos.org/job/libvirt-dbus-check/systems=libvirt-freebsd-11/ws/build/tests'> /usr/local/bin/gmake test_util gmake[2]: Entering directory '/usr<https://ci.centos.org/job/libvirt-dbus-check/systems=libvirt-freebsd-11/ws/build/tests'> CC test_util-test_util.o CCLD test_util gmake[2]: Leaving directory '/usr<https://ci.centos.org/job/libvirt-dbus-check/systems=libvirt-freebsd-11/ws/build/tests'> /usr/local/bin/gmake check-TESTS gmake[2]: Entering directory '/usr<https://ci.centos.org/job/libvirt-dbus-check/systems=libvirt-freebsd-11/ws/build/tests'> gmake[3]: Entering directory '/usr<https://ci.centos.org/job/libvirt-dbus-check/systems=libvirt-freebsd-11/ws/build/tests'> PASS: test_util PASS: test_interface.py PASS: test_domain.py PASS: test_network.py PASS: test_nodedev.py FAIL: test_connect.py PASS: test_storage.py ============================================================================ Testsuite summary for libvirt-dbus 1.4.0 ============================================================================ # TOTAL: 7 # PASS: 6 # SKIP: 0 # XFAIL: 0 # FAIL: 1 # XPASS: 0 # ERROR: 0 ============================================================================ See tests/test-suite.log Please report to libvir-list@redhat.com ============================================================================ gmake[3]: *** [Makefile:766: test-suite.log] Error 1 gmake[3]: Leaving directory '/usr<https://ci.centos.org/job/libvirt-dbus-check/systems=libvirt-freebsd-11/ws/build/tests'> gmake[2]: *** [Makefile:874: check-TESTS] Error 2 gmake[2]: Leaving directory '/usr<https://ci.centos.org/job/libvirt-dbus-check/systems=libvirt-freebsd-11/ws/build/tests'> gmake[1]: *** [Makefile:990: check-am] Error 2 gmake[1]: Leaving directory '/usr<https://ci.centos.org/job/libvirt-dbus-check/systems=libvirt-freebsd-11/ws/build/tests'> gmake: *** [Makefile:460: check-recursive] Error 1 + cat tests/test-suite.log ============================================== libvirt-dbus 1.4.0: tests/test-suite.log ============================================== # TOTAL: 7 # PASS: 6 # SKIP: 0 # XFAIL: 0 # FAIL: 1 # XPASS: 0 # ERROR: 0 .. contents:: :depth: 2 FAIL: test_connect.py ===================== ============================= test session starts ============================== platform freebsd11 -- Python 3.6.8, pytest-4.3.1, py-1.8.0, pluggy-0.7.1 rootdir: /usr<https://ci.centos.org/job/libvirt-dbus-check/systems=libvirt-freebsd-11/ws/,> inifile: collected 35 items ../../tests/test_connect.py .........................F......... [100%] =================================== FAILURES =================================== _______________ TestConnect.test_connect_node_device_create_xml ________________ Fixture "node_device_create" called directly. Fixtures are not meant to be called directly, but are created automatically when test functions request them as parameters. See https://docs.pytest.org/en/latest/fixture.html for more information about fixtures, and https://docs.pytest.org/en/latest/deprecations.html#calling-fixtures-directl... about how to update your code. ===================== 1 failed, 34 passed in 14.91 seconds ===================== FAIL test_connect.py (exit status: 1) + exit 1 Build step 'Execute shell' marked build as failure

See <https://ci.centos.org/job/libvirt-dbus-check/systems=libvirt-freebsd-11/319/display/redirect> ------------------------------------------ Started by upstream project "libvirt-dbus-check" build number 319 originally caused by: Started by upstream project "libvirt-dbus-syntax-check" build number 362 originally caused by: Started by upstream project "libvirt-dbus-build" build number 369 originally caused by: Started by upstream project "libvirt-glib-build" build number 366 originally caused by: Started by upstream project "libvirt-build" build number 464 originally caused by: Started by an SCM change [EnvInject] - Loading node environment variables. Building remotely on libvirt-freebsd-11 (libvirt) in workspace <https://ci.centos.org/job/libvirt-dbus-check/systems=libvirt-freebsd-11/ws/> [libvirt-dbus] $ /bin/sh -xe /tmp/jenkins3430383904730540997.sh + cd build + /usr/local/bin/gmake check Making check in data gmake[1]: Entering directory '/usr<https://ci.centos.org/job/libvirt-dbus-check/systems=libvirt-freebsd-11/ws/build/data'> gmake[1]: Nothing to be done for 'check'. gmake[1]: Leaving directory '/usr<https://ci.centos.org/job/libvirt-dbus-check/systems=libvirt-freebsd-11/ws/build/data'> Making check in docs gmake[1]: Entering directory '/usr<https://ci.centos.org/job/libvirt-dbus-check/systems=libvirt-freebsd-11/ws/build/docs'> gmake[1]: Nothing to be done for 'check'. gmake[1]: Leaving directory '/usr<https://ci.centos.org/job/libvirt-dbus-check/systems=libvirt-freebsd-11/ws/build/docs'> Making check in src gmake[1]: Entering directory '/usr<https://ci.centos.org/job/libvirt-dbus-check/systems=libvirt-freebsd-11/ws/build/src'> gmake[1]: Nothing to be done for 'check'. gmake[1]: Leaving directory '/usr<https://ci.centos.org/job/libvirt-dbus-check/systems=libvirt-freebsd-11/ws/build/src'> Making check in tests gmake[1]: Entering directory '/usr<https://ci.centos.org/job/libvirt-dbus-check/systems=libvirt-freebsd-11/ws/build/tests'> /usr/local/bin/gmake test_util gmake[2]: Entering directory '/usr<https://ci.centos.org/job/libvirt-dbus-check/systems=libvirt-freebsd-11/ws/build/tests'> CC test_util-test_util.o CCLD test_util gmake[2]: Leaving directory '/usr<https://ci.centos.org/job/libvirt-dbus-check/systems=libvirt-freebsd-11/ws/build/tests'> /usr/local/bin/gmake check-TESTS gmake[2]: Entering directory '/usr<https://ci.centos.org/job/libvirt-dbus-check/systems=libvirt-freebsd-11/ws/build/tests'> gmake[3]: Entering directory '/usr<https://ci.centos.org/job/libvirt-dbus-check/systems=libvirt-freebsd-11/ws/build/tests'> PASS: test_util PASS: test_interface.py PASS: test_domain.py PASS: test_network.py PASS: test_nodedev.py FAIL: test_connect.py PASS: test_storage.py ============================================================================ Testsuite summary for libvirt-dbus 1.4.0 ============================================================================ # TOTAL: 7 # PASS: 6 # SKIP: 0 # XFAIL: 0 # FAIL: 1 # XPASS: 0 # ERROR: 0 ============================================================================ See tests/test-suite.log Please report to libvir-list@redhat.com ============================================================================ gmake[3]: *** [Makefile:766: test-suite.log] Error 1 gmake[3]: Leaving directory '/usr<https://ci.centos.org/job/libvirt-dbus-check/systems=libvirt-freebsd-11/ws/build/tests'> gmake[2]: *** [Makefile:874: check-TESTS] Error 2 gmake[2]: Leaving directory '/usr<https://ci.centos.org/job/libvirt-dbus-check/systems=libvirt-freebsd-11/ws/build/tests'> gmake[1]: *** [Makefile:990: check-am] Error 2 gmake[1]: Leaving directory '/usr<https://ci.centos.org/job/libvirt-dbus-check/systems=libvirt-freebsd-11/ws/build/tests'> gmake: *** [Makefile:460: check-recursive] Error 1 + cat tests/test-suite.log ============================================== libvirt-dbus 1.4.0: tests/test-suite.log ============================================== # TOTAL: 7 # PASS: 6 # SKIP: 0 # XFAIL: 0 # FAIL: 1 # XPASS: 0 # ERROR: 0 .. contents:: :depth: 2 FAIL: test_connect.py ===================== ============================= test session starts ============================== platform freebsd11 -- Python 3.6.8, pytest-4.3.1, py-1.8.0, pluggy-0.7.1 rootdir: /usr<https://ci.centos.org/job/libvirt-dbus-check/systems=libvirt-freebsd-11/ws/,> inifile: collected 35 items ../../tests/test_connect.py .........................F......... [100%] =================================== FAILURES =================================== _______________ TestConnect.test_connect_node_device_create_xml ________________ Fixture "node_device_create" called directly. Fixtures are not meant to be called directly, but are created automatically when test functions request them as parameters. See https://docs.pytest.org/en/latest/fixture.html for more information about fixtures, and https://docs.pytest.org/en/latest/deprecations.html#calling-fixtures-directl... about how to update your code. ===================== 1 failed, 34 passed in 12.46 seconds ===================== FAIL test_connect.py (exit status: 1) + exit 1 Build step 'Execute shell' marked build as failure

See <https://ci.centos.org/job/libvirt-dbus-check/systems=libvirt-freebsd-11/320/display/redirect> ------------------------------------------ Started by upstream project "libvirt-dbus-check" build number 320 originally caused by: Started by upstream project "libvirt-dbus-syntax-check" build number 363 originally caused by: Started by upstream project "libvirt-dbus-build" build number 370 originally caused by: Started by upstream project "libvirt-glib-build" build number 367 originally caused by: Started by upstream project "libvirt-build" build number 465 originally caused by: Started by an SCM change Started by an SCM change Started by an SCM change Started by an SCM change [EnvInject] - Loading node environment variables. Building remotely on libvirt-freebsd-11 (libvirt) in workspace <https://ci.centos.org/job/libvirt-dbus-check/systems=libvirt-freebsd-11/ws/> [libvirt-dbus] $ /bin/sh -xe /tmp/jenkins7117463613411477521.sh + cd build + /usr/local/bin/gmake check Making check in data gmake[1]: Entering directory '/usr<https://ci.centos.org/job/libvirt-dbus-check/systems=libvirt-freebsd-11/ws/build/data'> gmake[1]: Nothing to be done for 'check'. gmake[1]: Leaving directory '/usr<https://ci.centos.org/job/libvirt-dbus-check/systems=libvirt-freebsd-11/ws/build/data'> Making check in docs gmake[1]: Entering directory '/usr<https://ci.centos.org/job/libvirt-dbus-check/systems=libvirt-freebsd-11/ws/build/docs'> gmake[1]: Nothing to be done for 'check'. gmake[1]: Leaving directory '/usr<https://ci.centos.org/job/libvirt-dbus-check/systems=libvirt-freebsd-11/ws/build/docs'> Making check in src gmake[1]: Entering directory '/usr<https://ci.centos.org/job/libvirt-dbus-check/systems=libvirt-freebsd-11/ws/build/src'> gmake[1]: Nothing to be done for 'check'. gmake[1]: Leaving directory '/usr<https://ci.centos.org/job/libvirt-dbus-check/systems=libvirt-freebsd-11/ws/build/src'> Making check in tests gmake[1]: Entering directory '/usr<https://ci.centos.org/job/libvirt-dbus-check/systems=libvirt-freebsd-11/ws/build/tests'> /usr/local/bin/gmake test_util gmake[2]: Entering directory '/usr<https://ci.centos.org/job/libvirt-dbus-check/systems=libvirt-freebsd-11/ws/build/tests'> CC test_util-test_util.o CCLD test_util gmake[2]: Leaving directory '/usr<https://ci.centos.org/job/libvirt-dbus-check/systems=libvirt-freebsd-11/ws/build/tests'> /usr/local/bin/gmake check-TESTS gmake[2]: Entering directory '/usr<https://ci.centos.org/job/libvirt-dbus-check/systems=libvirt-freebsd-11/ws/build/tests'> gmake[3]: Entering directory '/usr<https://ci.centos.org/job/libvirt-dbus-check/systems=libvirt-freebsd-11/ws/build/tests'> PASS: test_util PASS: test_interface.py PASS: test_domain.py PASS: test_network.py PASS: test_nodedev.py FAIL: test_connect.py PASS: test_storage.py ============================================================================ Testsuite summary for libvirt-dbus 1.4.0 ============================================================================ # TOTAL: 7 # PASS: 6 # SKIP: 0 # XFAIL: 0 # FAIL: 1 # XPASS: 0 # ERROR: 0 ============================================================================ See tests/test-suite.log Please report to libvir-list@redhat.com ============================================================================ gmake[3]: *** [Makefile:766: test-suite.log] Error 1 gmake[3]: Leaving directory '/usr<https://ci.centos.org/job/libvirt-dbus-check/systems=libvirt-freebsd-11/ws/build/tests'> gmake[2]: *** [Makefile:874: check-TESTS] Error 2 gmake[2]: Leaving directory '/usr<https://ci.centos.org/job/libvirt-dbus-check/systems=libvirt-freebsd-11/ws/build/tests'> gmake[1]: *** [Makefile:990: check-am] Error 2 gmake[1]: Leaving directory '/usr<https://ci.centos.org/job/libvirt-dbus-check/systems=libvirt-freebsd-11/ws/build/tests'> gmake: *** [Makefile:460: check-recursive] Error 1 + cat tests/test-suite.log ============================================== libvirt-dbus 1.4.0: tests/test-suite.log ============================================== # TOTAL: 7 # PASS: 6 # SKIP: 0 # XFAIL: 0 # FAIL: 1 # XPASS: 0 # ERROR: 0 .. contents:: :depth: 2 FAIL: test_connect.py ===================== ============================= test session starts ============================== platform freebsd11 -- Python 3.6.8, pytest-4.3.1, py-1.8.0, pluggy-0.7.1 rootdir: /usr<https://ci.centos.org/job/libvirt-dbus-check/systems=libvirt-freebsd-11/ws/,> inifile: collected 35 items ../../tests/test_connect.py .........................F......... [100%] =================================== FAILURES =================================== _______________ TestConnect.test_connect_node_device_create_xml ________________ Fixture "node_device_create" called directly. Fixtures are not meant to be called directly, but are created automatically when test functions request them as parameters. See https://docs.pytest.org/en/latest/fixture.html for more information about fixtures, and https://docs.pytest.org/en/latest/deprecations.html#calling-fixtures-directl... about how to update your code. ===================== 1 failed, 34 passed in 13.97 seconds ===================== FAIL test_connect.py (exit status: 1) + exit 1 Build step 'Execute shell' marked build as failure

See <https://ci.centos.org/job/libvirt-dbus-check/systems=libvirt-freebsd-11/321/display/redirect> ------------------------------------------ Started by upstream project "libvirt-dbus-check" build number 321 originally caused by: Started by upstream project "libvirt-dbus-syntax-check" build number 364 originally caused by: Started by upstream project "libvirt-dbus-build" build number 371 originally caused by: Started by upstream project "libvirt-glib-build" build number 368 originally caused by: Started by upstream project "libvirt-build" build number 466 originally caused by: Started by an SCM change [EnvInject] - Loading node environment variables. Building remotely on libvirt-freebsd-11 (libvirt) in workspace <https://ci.centos.org/job/libvirt-dbus-check/systems=libvirt-freebsd-11/ws/> [libvirt-dbus] $ /bin/sh -xe /tmp/jenkins1215343482571618564.sh + cd build + /usr/local/bin/gmake check Making check in data gmake[1]: Entering directory '/usr<https://ci.centos.org/job/libvirt-dbus-check/systems=libvirt-freebsd-11/ws/build/data'> gmake[1]: Nothing to be done for 'check'. gmake[1]: Leaving directory '/usr<https://ci.centos.org/job/libvirt-dbus-check/systems=libvirt-freebsd-11/ws/build/data'> Making check in docs gmake[1]: Entering directory '/usr<https://ci.centos.org/job/libvirt-dbus-check/systems=libvirt-freebsd-11/ws/build/docs'> gmake[1]: Nothing to be done for 'check'. gmake[1]: Leaving directory '/usr<https://ci.centos.org/job/libvirt-dbus-check/systems=libvirt-freebsd-11/ws/build/docs'> Making check in src gmake[1]: Entering directory '/usr<https://ci.centos.org/job/libvirt-dbus-check/systems=libvirt-freebsd-11/ws/build/src'> gmake[1]: Nothing to be done for 'check'. gmake[1]: Leaving directory '/usr<https://ci.centos.org/job/libvirt-dbus-check/systems=libvirt-freebsd-11/ws/build/src'> Making check in tests gmake[1]: Entering directory '/usr<https://ci.centos.org/job/libvirt-dbus-check/systems=libvirt-freebsd-11/ws/build/tests'> /usr/local/bin/gmake test_util gmake[2]: Entering directory '/usr<https://ci.centos.org/job/libvirt-dbus-check/systems=libvirt-freebsd-11/ws/build/tests'> CC test_util-test_util.o CCLD test_util gmake[2]: Leaving directory '/usr<https://ci.centos.org/job/libvirt-dbus-check/systems=libvirt-freebsd-11/ws/build/tests'> /usr/local/bin/gmake check-TESTS gmake[2]: Entering directory '/usr<https://ci.centos.org/job/libvirt-dbus-check/systems=libvirt-freebsd-11/ws/build/tests'> gmake[3]: Entering directory '/usr<https://ci.centos.org/job/libvirt-dbus-check/systems=libvirt-freebsd-11/ws/build/tests'> PASS: test_util PASS: test_interface.py PASS: test_domain.py PASS: test_network.py PASS: test_nodedev.py FAIL: test_connect.py PASS: test_storage.py ============================================================================ Testsuite summary for libvirt-dbus 1.4.0 ============================================================================ # TOTAL: 7 # PASS: 6 # SKIP: 0 # XFAIL: 0 # FAIL: 1 # XPASS: 0 # ERROR: 0 ============================================================================ See tests/test-suite.log Please report to libvir-list@redhat.com ============================================================================ gmake[3]: *** [Makefile:766: test-suite.log] Error 1 gmake[3]: Leaving directory '/usr<https://ci.centos.org/job/libvirt-dbus-check/systems=libvirt-freebsd-11/ws/build/tests'> gmake[2]: *** [Makefile:874: check-TESTS] Error 2 gmake[2]: Leaving directory '/usr<https://ci.centos.org/job/libvirt-dbus-check/systems=libvirt-freebsd-11/ws/build/tests'> gmake[1]: *** [Makefile:990: check-am] Error 2 gmake[1]: Leaving directory '/usr<https://ci.centos.org/job/libvirt-dbus-check/systems=libvirt-freebsd-11/ws/build/tests'> gmake: *** [Makefile:460: check-recursive] Error 1 + cat tests/test-suite.log ============================================== libvirt-dbus 1.4.0: tests/test-suite.log ============================================== # TOTAL: 7 # PASS: 6 # SKIP: 0 # XFAIL: 0 # FAIL: 1 # XPASS: 0 # ERROR: 0 .. contents:: :depth: 2 FAIL: test_connect.py ===================== ============================= test session starts ============================== platform freebsd11 -- Python 3.6.8, pytest-4.3.1, py-1.8.0, pluggy-0.7.1 rootdir: /usr<https://ci.centos.org/job/libvirt-dbus-check/systems=libvirt-freebsd-11/ws/,> inifile: collected 35 items ../../tests/test_connect.py .........................F......... [100%] =================================== FAILURES =================================== _______________ TestConnect.test_connect_node_device_create_xml ________________ Fixture "node_device_create" called directly. Fixtures are not meant to be called directly, but are created automatically when test functions request them as parameters. See https://docs.pytest.org/en/latest/fixture.html for more information about fixtures, and https://docs.pytest.org/en/latest/deprecations.html#calling-fixtures-directl... about how to update your code. ===================== 1 failed, 34 passed in 14.49 seconds ===================== FAIL test_connect.py (exit status: 1) + exit 1 Build step 'Execute shell' marked build as failure

See <https://ci.centos.org/job/libvirt-dbus-check/systems=libvirt-freebsd-11/322/display/redirect> ------------------------------------------ Started by upstream project "libvirt-dbus-check" build number 322 originally caused by: Started by upstream project "libvirt-dbus-syntax-check" build number 365 originally caused by: Started by upstream project "libvirt-dbus-build" build number 372 originally caused by: Started by upstream project "libvirt-glib-build" build number 369 originally caused by: Started by upstream project "libvirt-build" build number 467 originally caused by: Started by an SCM change Started by an SCM change Started by an SCM change Started by an SCM change Started by an SCM change Started by an SCM change [EnvInject] - Loading node environment variables. Building remotely on libvirt-freebsd-11 (libvirt) in workspace <https://ci.centos.org/job/libvirt-dbus-check/systems=libvirt-freebsd-11/ws/> [libvirt-dbus] $ /bin/sh -xe /tmp/jenkins6625548728257983751.sh + cd build + /usr/local/bin/gmake check Making check in data gmake[1]: Entering directory '/usr<https://ci.centos.org/job/libvirt-dbus-check/systems=libvirt-freebsd-11/ws/build/data'> gmake[1]: Nothing to be done for 'check'. gmake[1]: Leaving directory '/usr<https://ci.centos.org/job/libvirt-dbus-check/systems=libvirt-freebsd-11/ws/build/data'> Making check in docs gmake[1]: Entering directory '/usr<https://ci.centos.org/job/libvirt-dbus-check/systems=libvirt-freebsd-11/ws/build/docs'> gmake[1]: Nothing to be done for 'check'. gmake[1]: Leaving directory '/usr<https://ci.centos.org/job/libvirt-dbus-check/systems=libvirt-freebsd-11/ws/build/docs'> Making check in src gmake[1]: Entering directory '/usr<https://ci.centos.org/job/libvirt-dbus-check/systems=libvirt-freebsd-11/ws/build/src'> gmake[1]: Nothing to be done for 'check'. gmake[1]: Leaving directory '/usr<https://ci.centos.org/job/libvirt-dbus-check/systems=libvirt-freebsd-11/ws/build/src'> Making check in tests gmake[1]: Entering directory '/usr<https://ci.centos.org/job/libvirt-dbus-check/systems=libvirt-freebsd-11/ws/build/tests'> /usr/local/bin/gmake test_util gmake[2]: Entering directory '/usr<https://ci.centos.org/job/libvirt-dbus-check/systems=libvirt-freebsd-11/ws/build/tests'> CC test_util-test_util.o CCLD test_util gmake[2]: Leaving directory '/usr<https://ci.centos.org/job/libvirt-dbus-check/systems=libvirt-freebsd-11/ws/build/tests'> /usr/local/bin/gmake check-TESTS gmake[2]: Entering directory '/usr<https://ci.centos.org/job/libvirt-dbus-check/systems=libvirt-freebsd-11/ws/build/tests'> gmake[3]: Entering directory '/usr<https://ci.centos.org/job/libvirt-dbus-check/systems=libvirt-freebsd-11/ws/build/tests'> PASS: test_util PASS: test_interface.py PASS: test_domain.py PASS: test_network.py PASS: test_nodedev.py FAIL: test_connect.py PASS: test_storage.py ============================================================================ Testsuite summary for libvirt-dbus 1.4.0 ============================================================================ # TOTAL: 7 # PASS: 6 # SKIP: 0 # XFAIL: 0 # FAIL: 1 # XPASS: 0 # ERROR: 0 ============================================================================ See tests/test-suite.log Please report to libvir-list@redhat.com ============================================================================ gmake[3]: *** [Makefile:766: test-suite.log] Error 1 gmake[3]: Leaving directory '/usr<https://ci.centos.org/job/libvirt-dbus-check/systems=libvirt-freebsd-11/ws/build/tests'> gmake[2]: *** [Makefile:874: check-TESTS] Error 2 gmake[2]: Leaving directory '/usr<https://ci.centos.org/job/libvirt-dbus-check/systems=libvirt-freebsd-11/ws/build/tests'> gmake[1]: *** [Makefile:990: check-am] Error 2 gmake[1]: Leaving directory '/usr<https://ci.centos.org/job/libvirt-dbus-check/systems=libvirt-freebsd-11/ws/build/tests'> gmake: *** [Makefile:460: check-recursive] Error 1 + cat tests/test-suite.log ============================================== libvirt-dbus 1.4.0: tests/test-suite.log ============================================== # TOTAL: 7 # PASS: 6 # SKIP: 0 # XFAIL: 0 # FAIL: 1 # XPASS: 0 # ERROR: 0 .. contents:: :depth: 2 FAIL: test_connect.py ===================== ============================= test session starts ============================== platform freebsd11 -- Python 3.6.8, pytest-4.3.1, py-1.8.0, pluggy-0.7.1 rootdir: /usr<https://ci.centos.org/job/libvirt-dbus-check/systems=libvirt-freebsd-11/ws/,> inifile: collected 35 items ../../tests/test_connect.py .........................F......... [100%] =================================== FAILURES =================================== _______________ TestConnect.test_connect_node_device_create_xml ________________ Fixture "node_device_create" called directly. Fixtures are not meant to be called directly, but are created automatically when test functions request them as parameters. See https://docs.pytest.org/en/latest/fixture.html for more information about fixtures, and https://docs.pytest.org/en/latest/deprecations.html#calling-fixtures-directl... about how to update your code. ===================== 1 failed, 34 passed in 13.82 seconds ===================== FAIL test_connect.py (exit status: 1) + exit 1 Build step 'Execute shell' marked build as failure

See <https://ci.centos.org/job/libvirt-dbus-check/systems=libvirt-freebsd-11/323/display/redirect> ------------------------------------------ Started by upstream project "libvirt-dbus-check" build number 323 originally caused by: Started by upstream project "libvirt-dbus-syntax-check" build number 366 originally caused by: Started by upstream project "libvirt-dbus-build" build number 373 originally caused by: Started by upstream project "libvirt-glib-build" build number 370 originally caused by: Started by upstream project "libvirt-build" build number 468 originally caused by: Started by an SCM change [EnvInject] - Loading node environment variables. Building remotely on libvirt-freebsd-11 (libvirt) in workspace <https://ci.centos.org/job/libvirt-dbus-check/systems=libvirt-freebsd-11/ws/> [libvirt-dbus] $ /bin/sh -xe /tmp/jenkins8133028999744829230.sh + cd build + /usr/local/bin/gmake check Making check in data gmake[1]: Entering directory '/usr<https://ci.centos.org/job/libvirt-dbus-check/systems=libvirt-freebsd-11/ws/build/data'> gmake[1]: Nothing to be done for 'check'. gmake[1]: Leaving directory '/usr<https://ci.centos.org/job/libvirt-dbus-check/systems=libvirt-freebsd-11/ws/build/data'> Making check in docs gmake[1]: Entering directory '/usr<https://ci.centos.org/job/libvirt-dbus-check/systems=libvirt-freebsd-11/ws/build/docs'> gmake[1]: Nothing to be done for 'check'. gmake[1]: Leaving directory '/usr<https://ci.centos.org/job/libvirt-dbus-check/systems=libvirt-freebsd-11/ws/build/docs'> Making check in src gmake[1]: Entering directory '/usr<https://ci.centos.org/job/libvirt-dbus-check/systems=libvirt-freebsd-11/ws/build/src'> gmake[1]: Nothing to be done for 'check'. gmake[1]: Leaving directory '/usr<https://ci.centos.org/job/libvirt-dbus-check/systems=libvirt-freebsd-11/ws/build/src'> Making check in tests gmake[1]: Entering directory '/usr<https://ci.centos.org/job/libvirt-dbus-check/systems=libvirt-freebsd-11/ws/build/tests'> /usr/local/bin/gmake test_util gmake[2]: Entering directory '/usr<https://ci.centos.org/job/libvirt-dbus-check/systems=libvirt-freebsd-11/ws/build/tests'> CC test_util-test_util.o CCLD test_util gmake[2]: Leaving directory '/usr<https://ci.centos.org/job/libvirt-dbus-check/systems=libvirt-freebsd-11/ws/build/tests'> /usr/local/bin/gmake check-TESTS gmake[2]: Entering directory '/usr<https://ci.centos.org/job/libvirt-dbus-check/systems=libvirt-freebsd-11/ws/build/tests'> gmake[3]: Entering directory '/usr<https://ci.centos.org/job/libvirt-dbus-check/systems=libvirt-freebsd-11/ws/build/tests'> PASS: test_util PASS: test_interface.py PASS: test_domain.py PASS: test_network.py PASS: test_nodedev.py FAIL: test_connect.py PASS: test_storage.py ============================================================================ Testsuite summary for libvirt-dbus 1.4.0 ============================================================================ # TOTAL: 7 # PASS: 6 # SKIP: 0 # XFAIL: 0 # FAIL: 1 # XPASS: 0 # ERROR: 0 ============================================================================ See tests/test-suite.log Please report to libvir-list@redhat.com ============================================================================ gmake[3]: *** [Makefile:766: test-suite.log] Error 1 gmake[3]: Leaving directory '/usr<https://ci.centos.org/job/libvirt-dbus-check/systems=libvirt-freebsd-11/ws/build/tests'> gmake[2]: *** [Makefile:874: check-TESTS] Error 2 gmake[2]: Leaving directory '/usr<https://ci.centos.org/job/libvirt-dbus-check/systems=libvirt-freebsd-11/ws/build/tests'> gmake[1]: *** [Makefile:990: check-am] Error 2 gmake[1]: Leaving directory '/usr<https://ci.centos.org/job/libvirt-dbus-check/systems=libvirt-freebsd-11/ws/build/tests'> gmake: *** [Makefile:460: check-recursive] Error 1 + cat tests/test-suite.log ============================================== libvirt-dbus 1.4.0: tests/test-suite.log ============================================== # TOTAL: 7 # PASS: 6 # SKIP: 0 # XFAIL: 0 # FAIL: 1 # XPASS: 0 # ERROR: 0 .. contents:: :depth: 2 FAIL: test_connect.py ===================== ============================= test session starts ============================== platform freebsd11 -- Python 3.6.8, pytest-4.3.1, py-1.8.0, pluggy-0.7.1 rootdir: /usr<https://ci.centos.org/job/libvirt-dbus-check/systems=libvirt-freebsd-11/ws/,> inifile: collected 35 items ../../tests/test_connect.py .........................F......... [100%] =================================== FAILURES =================================== _______________ TestConnect.test_connect_node_device_create_xml ________________ Fixture "node_device_create" called directly. Fixtures are not meant to be called directly, but are created automatically when test functions request them as parameters. See https://docs.pytest.org/en/latest/fixture.html for more information about fixtures, and https://docs.pytest.org/en/latest/deprecations.html#calling-fixtures-directl... about how to update your code. ===================== 1 failed, 34 passed in 13.11 seconds ===================== FAIL test_connect.py (exit status: 1) + exit 1 Build step 'Execute shell' marked build as failure

See <https://ci.centos.org/job/libvirt-dbus-check/systems=libvirt-freebsd-11/324/display/redirect> ------------------------------------------ Started by upstream project "libvirt-dbus-check" build number 324 originally caused by: Started by upstream project "libvirt-dbus-syntax-check" build number 367 originally caused by: Started by upstream project "libvirt-dbus-build" build number 374 originally caused by: Started by upstream project "libvirt-glib-build" build number 371 originally caused by: Started by upstream project "libvirt-build" build number 469 originally caused by: Started by an SCM change [EnvInject] - Loading node environment variables. Building remotely on libvirt-freebsd-11 (libvirt) in workspace <https://ci.centos.org/job/libvirt-dbus-check/systems=libvirt-freebsd-11/ws/> [libvirt-dbus] $ /bin/sh -xe /tmp/jenkins5989796566758429304.sh + cd build + /usr/local/bin/gmake check Making check in data gmake[1]: Entering directory '/usr<https://ci.centos.org/job/libvirt-dbus-check/systems=libvirt-freebsd-11/ws/build/data'> gmake[1]: Nothing to be done for 'check'. gmake[1]: Leaving directory '/usr<https://ci.centos.org/job/libvirt-dbus-check/systems=libvirt-freebsd-11/ws/build/data'> Making check in docs gmake[1]: Entering directory '/usr<https://ci.centos.org/job/libvirt-dbus-check/systems=libvirt-freebsd-11/ws/build/docs'> gmake[1]: Nothing to be done for 'check'. gmake[1]: Leaving directory '/usr<https://ci.centos.org/job/libvirt-dbus-check/systems=libvirt-freebsd-11/ws/build/docs'> Making check in src gmake[1]: Entering directory '/usr<https://ci.centos.org/job/libvirt-dbus-check/systems=libvirt-freebsd-11/ws/build/src'> gmake[1]: Nothing to be done for 'check'. gmake[1]: Leaving directory '/usr<https://ci.centos.org/job/libvirt-dbus-check/systems=libvirt-freebsd-11/ws/build/src'> Making check in tests gmake[1]: Entering directory '/usr<https://ci.centos.org/job/libvirt-dbus-check/systems=libvirt-freebsd-11/ws/build/tests'> /usr/local/bin/gmake test_util gmake[2]: Entering directory '/usr<https://ci.centos.org/job/libvirt-dbus-check/systems=libvirt-freebsd-11/ws/build/tests'> CC test_util-test_util.o CCLD test_util gmake[2]: Leaving directory '/usr<https://ci.centos.org/job/libvirt-dbus-check/systems=libvirt-freebsd-11/ws/build/tests'> /usr/local/bin/gmake check-TESTS gmake[2]: Entering directory '/usr<https://ci.centos.org/job/libvirt-dbus-check/systems=libvirt-freebsd-11/ws/build/tests'> gmake[3]: Entering directory '/usr<https://ci.centos.org/job/libvirt-dbus-check/systems=libvirt-freebsd-11/ws/build/tests'> PASS: test_util PASS: test_interface.py PASS: test_domain.py PASS: test_network.py PASS: test_nodedev.py FAIL: test_connect.py PASS: test_storage.py ============================================================================ Testsuite summary for libvirt-dbus 1.4.0 ============================================================================ # TOTAL: 7 # PASS: 6 # SKIP: 0 # XFAIL: 0 # FAIL: 1 # XPASS: 0 # ERROR: 0 ============================================================================ See tests/test-suite.log Please report to libvir-list@redhat.com ============================================================================ gmake[3]: *** [Makefile:766: test-suite.log] Error 1 gmake[3]: Leaving directory '/usr<https://ci.centos.org/job/libvirt-dbus-check/systems=libvirt-freebsd-11/ws/build/tests'> gmake[2]: *** [Makefile:874: check-TESTS] Error 2 gmake[2]: Leaving directory '/usr<https://ci.centos.org/job/libvirt-dbus-check/systems=libvirt-freebsd-11/ws/build/tests'> gmake[1]: *** [Makefile:990: check-am] Error 2 gmake[1]: Leaving directory '/usr<https://ci.centos.org/job/libvirt-dbus-check/systems=libvirt-freebsd-11/ws/build/tests'> gmake: *** [Makefile:460: check-recursive] Error 1 + cat tests/test-suite.log ============================================== libvirt-dbus 1.4.0: tests/test-suite.log ============================================== # TOTAL: 7 # PASS: 6 # SKIP: 0 # XFAIL: 0 # FAIL: 1 # XPASS: 0 # ERROR: 0 .. contents:: :depth: 2 FAIL: test_connect.py ===================== ============================= test session starts ============================== platform freebsd11 -- Python 3.6.8, pytest-4.3.1, py-1.8.0, pluggy-0.7.1 rootdir: /usr<https://ci.centos.org/job/libvirt-dbus-check/systems=libvirt-freebsd-11/ws/,> inifile: collected 35 items ../../tests/test_connect.py .........................F......... [100%] =================================== FAILURES =================================== _______________ TestConnect.test_connect_node_device_create_xml ________________ Fixture "node_device_create" called directly. Fixtures are not meant to be called directly, but are created automatically when test functions request them as parameters. See https://docs.pytest.org/en/latest/fixture.html for more information about fixtures, and https://docs.pytest.org/en/latest/deprecations.html#calling-fixtures-directl... about how to update your code. ===================== 1 failed, 34 passed in 15.36 seconds ===================== FAIL test_connect.py (exit status: 1) + exit 1 Build step 'Execute shell' marked build as failure

See <https://ci.centos.org/job/libvirt-dbus-check/systems=libvirt-freebsd-11/325/display/redirect> ------------------------------------------ Started by upstream project "libvirt-dbus-check" build number 325 originally caused by: Started by upstream project "libvirt-dbus-syntax-check" build number 368 originally caused by: Started by upstream project "libvirt-dbus-build" build number 375 originally caused by: Started by upstream project "libvirt-glib-build" build number 372 originally caused by: Started by upstream project "libvirt-build" build number 470 originally caused by: Started by an SCM change Started by an SCM change Started by an SCM change Started by an SCM change Started by an SCM change Started by an SCM change [EnvInject] - Loading node environment variables. Building remotely on libvirt-freebsd-11 (libvirt) in workspace <https://ci.centos.org/job/libvirt-dbus-check/systems=libvirt-freebsd-11/ws/> [libvirt-dbus] $ /bin/sh -xe /tmp/jenkins4941659171232190167.sh + cd build + /usr/local/bin/gmake check Making check in data gmake[1]: Entering directory '/usr<https://ci.centos.org/job/libvirt-dbus-check/systems=libvirt-freebsd-11/ws/build/data'> gmake[1]: Nothing to be done for 'check'. gmake[1]: Leaving directory '/usr<https://ci.centos.org/job/libvirt-dbus-check/systems=libvirt-freebsd-11/ws/build/data'> Making check in docs gmake[1]: Entering directory '/usr<https://ci.centos.org/job/libvirt-dbus-check/systems=libvirt-freebsd-11/ws/build/docs'> gmake[1]: Nothing to be done for 'check'. gmake[1]: Leaving directory '/usr<https://ci.centos.org/job/libvirt-dbus-check/systems=libvirt-freebsd-11/ws/build/docs'> Making check in src gmake[1]: Entering directory '/usr<https://ci.centos.org/job/libvirt-dbus-check/systems=libvirt-freebsd-11/ws/build/src'> gmake[1]: Nothing to be done for 'check'. gmake[1]: Leaving directory '/usr<https://ci.centos.org/job/libvirt-dbus-check/systems=libvirt-freebsd-11/ws/build/src'> Making check in tests gmake[1]: Entering directory '/usr<https://ci.centos.org/job/libvirt-dbus-check/systems=libvirt-freebsd-11/ws/build/tests'> /usr/local/bin/gmake test_util gmake[2]: Entering directory '/usr<https://ci.centos.org/job/libvirt-dbus-check/systems=libvirt-freebsd-11/ws/build/tests'> CC test_util-test_util.o CCLD test_util gmake[2]: Leaving directory '/usr<https://ci.centos.org/job/libvirt-dbus-check/systems=libvirt-freebsd-11/ws/build/tests'> /usr/local/bin/gmake check-TESTS gmake[2]: Entering directory '/usr<https://ci.centos.org/job/libvirt-dbus-check/systems=libvirt-freebsd-11/ws/build/tests'> gmake[3]: Entering directory '/usr<https://ci.centos.org/job/libvirt-dbus-check/systems=libvirt-freebsd-11/ws/build/tests'> PASS: test_util PASS: test_interface.py PASS: test_domain.py PASS: test_network.py PASS: test_nodedev.py FAIL: test_connect.py PASS: test_storage.py ============================================================================ Testsuite summary for libvirt-dbus 1.4.0 ============================================================================ # TOTAL: 7 # PASS: 6 # SKIP: 0 # XFAIL: 0 # FAIL: 1 # XPASS: 0 # ERROR: 0 ============================================================================ See tests/test-suite.log Please report to libvir-list@redhat.com ============================================================================ gmake[3]: *** [Makefile:766: test-suite.log] Error 1 gmake[3]: Leaving directory '/usr<https://ci.centos.org/job/libvirt-dbus-check/systems=libvirt-freebsd-11/ws/build/tests'> gmake[2]: *** [Makefile:874: check-TESTS] Error 2 gmake[2]: Leaving directory '/usr<https://ci.centos.org/job/libvirt-dbus-check/systems=libvirt-freebsd-11/ws/build/tests'> gmake[1]: *** [Makefile:990: check-am] Error 2 gmake[1]: Leaving directory '/usr<https://ci.centos.org/job/libvirt-dbus-check/systems=libvirt-freebsd-11/ws/build/tests'> gmake: *** [Makefile:460: check-recursive] Error 1 + cat tests/test-suite.log ============================================== libvirt-dbus 1.4.0: tests/test-suite.log ============================================== # TOTAL: 7 # PASS: 6 # SKIP: 0 # XFAIL: 0 # FAIL: 1 # XPASS: 0 # ERROR: 0 .. contents:: :depth: 2 FAIL: test_connect.py ===================== ============================= test session starts ============================== platform freebsd11 -- Python 3.6.8, pytest-4.3.1, py-1.8.0, pluggy-0.7.1 rootdir: /usr<https://ci.centos.org/job/libvirt-dbus-check/systems=libvirt-freebsd-11/ws/,> inifile: collected 35 items ../../tests/test_connect.py .........................F......... [100%] =================================== FAILURES =================================== _______________ TestConnect.test_connect_node_device_create_xml ________________ Fixture "node_device_create" called directly. Fixtures are not meant to be called directly, but are created automatically when test functions request them as parameters. See https://docs.pytest.org/en/latest/fixture.html for more information about fixtures, and https://docs.pytest.org/en/latest/deprecations.html#calling-fixtures-directl... about how to update your code. ===================== 1 failed, 34 passed in 12.45 seconds ===================== FAIL test_connect.py (exit status: 1) + exit 1 Build step 'Execute shell' marked build as failure

See <https://ci.centos.org/job/libvirt-dbus-check/systems=libvirt-freebsd-11/326/display/redirect> ------------------------------------------ Started by upstream project "libvirt-dbus-check" build number 326 originally caused by: Started by upstream project "libvirt-dbus-syntax-check" build number 369 originally caused by: Started by upstream project "libvirt-dbus-build" build number 376 originally caused by: Started by upstream project "libvirt-glib-build" build number 373 originally caused by: Started by upstream project "libvirt-build" build number 471 originally caused by: Started by an SCM change Started by an SCM change Started by an SCM change Started by an SCM change Started by an SCM change Started by an SCM change [EnvInject] - Loading node environment variables. Building remotely on libvirt-freebsd-11 (libvirt) in workspace <https://ci.centos.org/job/libvirt-dbus-check/systems=libvirt-freebsd-11/ws/> [libvirt-dbus] $ /bin/sh -xe /tmp/jenkins4336441615771290503.sh + cd build + /usr/local/bin/gmake check Making check in data gmake[1]: Entering directory '/usr<https://ci.centos.org/job/libvirt-dbus-check/systems=libvirt-freebsd-11/ws/build/data'> gmake[1]: Nothing to be done for 'check'. gmake[1]: Leaving directory '/usr<https://ci.centos.org/job/libvirt-dbus-check/systems=libvirt-freebsd-11/ws/build/data'> Making check in docs gmake[1]: Entering directory '/usr<https://ci.centos.org/job/libvirt-dbus-check/systems=libvirt-freebsd-11/ws/build/docs'> gmake[1]: Nothing to be done for 'check'. gmake[1]: Leaving directory '/usr<https://ci.centos.org/job/libvirt-dbus-check/systems=libvirt-freebsd-11/ws/build/docs'> Making check in src gmake[1]: Entering directory '/usr<https://ci.centos.org/job/libvirt-dbus-check/systems=libvirt-freebsd-11/ws/build/src'> gmake[1]: Nothing to be done for 'check'. gmake[1]: Leaving directory '/usr<https://ci.centos.org/job/libvirt-dbus-check/systems=libvirt-freebsd-11/ws/build/src'> Making check in tests gmake[1]: Entering directory '/usr<https://ci.centos.org/job/libvirt-dbus-check/systems=libvirt-freebsd-11/ws/build/tests'> /usr/local/bin/gmake test_util gmake[2]: Entering directory '/usr<https://ci.centos.org/job/libvirt-dbus-check/systems=libvirt-freebsd-11/ws/build/tests'> CC test_util-test_util.o CCLD test_util gmake[2]: Leaving directory '/usr<https://ci.centos.org/job/libvirt-dbus-check/systems=libvirt-freebsd-11/ws/build/tests'> /usr/local/bin/gmake check-TESTS gmake[2]: Entering directory '/usr<https://ci.centos.org/job/libvirt-dbus-check/systems=libvirt-freebsd-11/ws/build/tests'> gmake[3]: Entering directory '/usr<https://ci.centos.org/job/libvirt-dbus-check/systems=libvirt-freebsd-11/ws/build/tests'> PASS: test_util PASS: test_interface.py PASS: test_domain.py PASS: test_network.py PASS: test_nodedev.py FAIL: test_connect.py PASS: test_storage.py ============================================================================ Testsuite summary for libvirt-dbus 1.4.0 ============================================================================ # TOTAL: 7 # PASS: 6 # SKIP: 0 # XFAIL: 0 # FAIL: 1 # XPASS: 0 # ERROR: 0 ============================================================================ See tests/test-suite.log Please report to libvir-list@redhat.com ============================================================================ gmake[3]: *** [Makefile:766: test-suite.log] Error 1 gmake[3]: Leaving directory '/usr<https://ci.centos.org/job/libvirt-dbus-check/systems=libvirt-freebsd-11/ws/build/tests'> gmake[2]: *** [Makefile:874: check-TESTS] Error 2 gmake[2]: Leaving directory '/usr<https://ci.centos.org/job/libvirt-dbus-check/systems=libvirt-freebsd-11/ws/build/tests'> gmake[1]: *** [Makefile:990: check-am] Error 2 gmake[1]: Leaving directory '/usr<https://ci.centos.org/job/libvirt-dbus-check/systems=libvirt-freebsd-11/ws/build/tests'> gmake: *** [Makefile:460: check-recursive] Error 1 + cat tests/test-suite.log ============================================== libvirt-dbus 1.4.0: tests/test-suite.log ============================================== # TOTAL: 7 # PASS: 6 # SKIP: 0 # XFAIL: 0 # FAIL: 1 # XPASS: 0 # ERROR: 0 .. contents:: :depth: 2 FAIL: test_connect.py ===================== ============================= test session starts ============================== platform freebsd11 -- Python 3.6.8, pytest-4.3.1, py-1.8.0, pluggy-0.7.1 rootdir: /usr<https://ci.centos.org/job/libvirt-dbus-check/systems=libvirt-freebsd-11/ws/,> inifile: collected 35 items ../../tests/test_connect.py .........................F......... [100%] =================================== FAILURES =================================== _______________ TestConnect.test_connect_node_device_create_xml ________________ Fixture "node_device_create" called directly. Fixtures are not meant to be called directly, but are created automatically when test functions request them as parameters. See https://docs.pytest.org/en/latest/fixture.html for more information about fixtures, and https://docs.pytest.org/en/latest/deprecations.html#calling-fixtures-directl... about how to update your code. ===================== 1 failed, 34 passed in 14.66 seconds ===================== FAIL test_connect.py (exit status: 1) + exit 1 Build step 'Execute shell' marked build as failure

See <https://ci.centos.org/job/libvirt-dbus-check/systems=libvirt-freebsd-11/327/display/redirect> ------------------------------------------ Started by upstream project "libvirt-dbus-check" build number 327 originally caused by: Started by upstream project "libvirt-dbus-syntax-check" build number 370 originally caused by: Started by upstream project "libvirt-dbus-build" build number 377 originally caused by: Started by upstream project "libvirt-glib-build" build number 374 originally caused by: Started by upstream project "libvirt-build" build number 472 originally caused by: Started by an SCM change [EnvInject] - Loading node environment variables. Building remotely on libvirt-freebsd-11 (libvirt) in workspace <https://ci.centos.org/job/libvirt-dbus-check/systems=libvirt-freebsd-11/ws/> [libvirt-dbus] $ /bin/sh -xe /tmp/jenkins6304580475708917077.sh + cd build + /usr/local/bin/gmake check Making check in data gmake[1]: Entering directory '/usr<https://ci.centos.org/job/libvirt-dbus-check/systems=libvirt-freebsd-11/ws/build/data'> gmake[1]: Nothing to be done for 'check'. gmake[1]: Leaving directory '/usr<https://ci.centos.org/job/libvirt-dbus-check/systems=libvirt-freebsd-11/ws/build/data'> Making check in docs gmake[1]: Entering directory '/usr<https://ci.centos.org/job/libvirt-dbus-check/systems=libvirt-freebsd-11/ws/build/docs'> gmake[1]: Nothing to be done for 'check'. gmake[1]: Leaving directory '/usr<https://ci.centos.org/job/libvirt-dbus-check/systems=libvirt-freebsd-11/ws/build/docs'> Making check in src gmake[1]: Entering directory '/usr<https://ci.centos.org/job/libvirt-dbus-check/systems=libvirt-freebsd-11/ws/build/src'> gmake[1]: Nothing to be done for 'check'. gmake[1]: Leaving directory '/usr<https://ci.centos.org/job/libvirt-dbus-check/systems=libvirt-freebsd-11/ws/build/src'> Making check in tests gmake[1]: Entering directory '/usr<https://ci.centos.org/job/libvirt-dbus-check/systems=libvirt-freebsd-11/ws/build/tests'> /usr/local/bin/gmake test_util gmake[2]: Entering directory '/usr<https://ci.centos.org/job/libvirt-dbus-check/systems=libvirt-freebsd-11/ws/build/tests'> CC test_util-test_util.o CCLD test_util gmake[2]: Leaving directory '/usr<https://ci.centos.org/job/libvirt-dbus-check/systems=libvirt-freebsd-11/ws/build/tests'> /usr/local/bin/gmake check-TESTS gmake[2]: Entering directory '/usr<https://ci.centos.org/job/libvirt-dbus-check/systems=libvirt-freebsd-11/ws/build/tests'> gmake[3]: Entering directory '/usr<https://ci.centos.org/job/libvirt-dbus-check/systems=libvirt-freebsd-11/ws/build/tests'> PASS: test_util PASS: test_interface.py PASS: test_domain.py PASS: test_network.py PASS: test_nodedev.py FAIL: test_connect.py PASS: test_storage.py ============================================================================ Testsuite summary for libvirt-dbus 1.4.0 ============================================================================ # TOTAL: 7 # PASS: 6 # SKIP: 0 # XFAIL: 0 # FAIL: 1 # XPASS: 0 # ERROR: 0 ============================================================================ See tests/test-suite.log Please report to libvir-list@redhat.com ============================================================================ gmake[3]: *** [Makefile:766: test-suite.log] Error 1 gmake[3]: Leaving directory '/usr<https://ci.centos.org/job/libvirt-dbus-check/systems=libvirt-freebsd-11/ws/build/tests'> gmake[2]: *** [Makefile:874: check-TESTS] Error 2 gmake[2]: Leaving directory '/usr<https://ci.centos.org/job/libvirt-dbus-check/systems=libvirt-freebsd-11/ws/build/tests'> gmake[1]: *** [Makefile:990: check-am] Error 2 gmake[1]: Leaving directory '/usr<https://ci.centos.org/job/libvirt-dbus-check/systems=libvirt-freebsd-11/ws/build/tests'> gmake: *** [Makefile:460: check-recursive] Error 1 + cat tests/test-suite.log ============================================== libvirt-dbus 1.4.0: tests/test-suite.log ============================================== # TOTAL: 7 # PASS: 6 # SKIP: 0 # XFAIL: 0 # FAIL: 1 # XPASS: 0 # ERROR: 0 .. contents:: :depth: 2 FAIL: test_connect.py ===================== ============================= test session starts ============================== platform freebsd11 -- Python 3.6.8, pytest-4.3.1, py-1.8.0, pluggy-0.7.1 rootdir: /usr<https://ci.centos.org/job/libvirt-dbus-check/systems=libvirt-freebsd-11/ws/,> inifile: collected 35 items ../../tests/test_connect.py ..................F......F......... [100%] =================================== FAILURES =================================== _________________ TestConnect.test_connect_get_cpu_model_names _________________ self = <test_connect.TestConnect object at 0x80940ff28> def test_connect_get_cpu_model_names(self): arch = "x86_64"
assert isinstance(self.connect.GetCPUModelNames(arch, 0), dbus.Array)
../../tests/test_connect.py:122: _ _ _ _ _ _ _ _ _ _ _ _ _ _ _ _ _ _ _ _ _ _ _ _ _ _ _ _ _ _ _ _ _ _ _ _ _ _ _ _ /usr/local/lib/python3.6/site-packages/dbus/proxies.py:70: in __call__ return self._proxy_method(*args, **keywords) /usr/local/lib/python3.6/site-packages/dbus/proxies.py:145: in __call__ **keywords) _ _ _ _ _ _ _ _ _ _ _ _ _ _ _ _ _ _ _ _ _ _ _ _ _ _ _ _ _ _ _ _ _ _ _ _ _ _ _ _ self = <dbus._dbus.SessionBus (session) at 0x8090b54c0> bus_name = dbus.String(':1.19'), object_path = '/org/libvirt/Test' dbus_interface = 'org.libvirt.Connect', method = 'GetCPUModelNames' signature = 'su', args = ('x86_64', 0), timeout = -1.0, byte_arrays = False kwargs = {}, get_args_opts = {'byte_arrays': False} message = <dbus.lowlevel.MethodCallMessage path: /org/libvirt/Test, iface: org.libvirt.Connect, member: GetCPUModelNames dest: :1.19> def call_blocking(self, bus_name, object_path, dbus_interface, method, signature, args, timeout=-1.0, byte_arrays=False, **kwargs): """Call the given method, synchronously. :Since: 0.81.0 """ if object_path == LOCAL_PATH: raise DBusException('Methods may not be called on the reserved ' 'path %s' % LOCAL_PATH) if dbus_interface == LOCAL_IFACE: raise DBusException('Methods may not be called on the reserved ' 'interface %s' % LOCAL_IFACE) # no need to validate other args - MethodCallMessage ctor will do get_args_opts = dict(byte_arrays=byte_arrays) if is_py2: get_args_opts['utf8_strings'] = kwargs.get('utf8_strings', False) elif 'utf8_strings' in kwargs: raise TypeError("unexpected keyword argument 'utf8_strings'") message = MethodCallMessage(destination=bus_name, path=object_path, interface=dbus_interface, method=method) # Add the arguments to the function try: message.append(signature=signature, *args) except Exception as e: logging.basicConfig() _logger.error('Unable to set arguments %r according to ' 'signature %r: %s: %s', args, signature, e.__class__, e) raise # make a blocking call reply_message = self.send_message_with_reply_and_block(
message, timeout)
E dbus.exceptions.DBusException: org.libvirt.Error: XML error: failed to parse xml document '/home/jenkins/build/libvirt/share/libvirt/cpu_map/x86_Cascadelake-Server.xml' /usr/local/lib/python3.6/site-packages/dbus/connection.py:651: DBusException ----------------------------- Captured stderr call ----------------------------- I/O warning : failed to load external entity "/home/jenkins/build/libvirt/share/libvirt/cpu_map/x86_Cascadelake-Server.xml" _______________ TestConnect.test_connect_node_device_create_xml ________________ Fixture "node_device_create" called directly. Fixtures are not meant to be called directly, but are created automatically when test functions request them as parameters. See https://docs.pytest.org/en/latest/fixture.html for more information about fixtures, and https://docs.pytest.org/en/latest/deprecations.html#calling-fixtures-directl... about how to update your code. ===================== 2 failed, 33 passed in 14.93 seconds ===================== FAIL test_connect.py (exit status: 1) + exit 1 Build step 'Execute shell' marked build as failure

See <https://ci.centos.org/job/libvirt-dbus-check/systems=libvirt-freebsd-11/328/display/redirect> ------------------------------------------ Started by upstream project "libvirt-dbus-check" build number 328 originally caused by: Started by upstream project "libvirt-dbus-syntax-check" build number 371 originally caused by: Started by upstream project "libvirt-dbus-build" build number 378 originally caused by: Started by upstream project "libvirt-glib-build" build number 375 originally caused by: Started by upstream project "libvirt-build" build number 473 originally caused by: Started by an SCM change Started by an SCM change [EnvInject] - Loading node environment variables. Building remotely on libvirt-freebsd-11 (libvirt) in workspace <https://ci.centos.org/job/libvirt-dbus-check/systems=libvirt-freebsd-11/ws/> [libvirt-dbus] $ /bin/sh -xe /tmp/jenkins8936013339632567105.sh + cd build + /usr/local/bin/gmake check Making check in data gmake[1]: Entering directory '/usr<https://ci.centos.org/job/libvirt-dbus-check/systems=libvirt-freebsd-11/ws/build/data'> gmake[1]: Nothing to be done for 'check'. gmake[1]: Leaving directory '/usr<https://ci.centos.org/job/libvirt-dbus-check/systems=libvirt-freebsd-11/ws/build/data'> Making check in docs gmake[1]: Entering directory '/usr<https://ci.centos.org/job/libvirt-dbus-check/systems=libvirt-freebsd-11/ws/build/docs'> gmake[1]: Nothing to be done for 'check'. gmake[1]: Leaving directory '/usr<https://ci.centos.org/job/libvirt-dbus-check/systems=libvirt-freebsd-11/ws/build/docs'> Making check in src gmake[1]: Entering directory '/usr<https://ci.centos.org/job/libvirt-dbus-check/systems=libvirt-freebsd-11/ws/build/src'> gmake[1]: Nothing to be done for 'check'. gmake[1]: Leaving directory '/usr<https://ci.centos.org/job/libvirt-dbus-check/systems=libvirt-freebsd-11/ws/build/src'> Making check in tests gmake[1]: Entering directory '/usr<https://ci.centos.org/job/libvirt-dbus-check/systems=libvirt-freebsd-11/ws/build/tests'> /usr/local/bin/gmake test_util gmake[2]: Entering directory '/usr<https://ci.centos.org/job/libvirt-dbus-check/systems=libvirt-freebsd-11/ws/build/tests'> CC test_util-test_util.o CCLD test_util gmake[2]: Leaving directory '/usr<https://ci.centos.org/job/libvirt-dbus-check/systems=libvirt-freebsd-11/ws/build/tests'> /usr/local/bin/gmake check-TESTS gmake[2]: Entering directory '/usr<https://ci.centos.org/job/libvirt-dbus-check/systems=libvirt-freebsd-11/ws/build/tests'> gmake[3]: Entering directory '/usr<https://ci.centos.org/job/libvirt-dbus-check/systems=libvirt-freebsd-11/ws/build/tests'> PASS: test_util PASS: test_interface.py PASS: test_domain.py PASS: test_network.py PASS: test_nodedev.py FAIL: test_connect.py PASS: test_storage.py ============================================================================ Testsuite summary for libvirt-dbus 1.4.0 ============================================================================ # TOTAL: 7 # PASS: 6 # SKIP: 0 # XFAIL: 0 # FAIL: 1 # XPASS: 0 # ERROR: 0 ============================================================================ See tests/test-suite.log Please report to libvir-list@redhat.com ============================================================================ gmake[3]: *** [Makefile:766: test-suite.log] Error 1 gmake[3]: Leaving directory '/usr<https://ci.centos.org/job/libvirt-dbus-check/systems=libvirt-freebsd-11/ws/build/tests'> gmake[2]: *** [Makefile:874: check-TESTS] Error 2 gmake[2]: Leaving directory '/usr<https://ci.centos.org/job/libvirt-dbus-check/systems=libvirt-freebsd-11/ws/build/tests'> gmake[1]: *** [Makefile:990: check-am] Error 2 gmake[1]: Leaving directory '/usr<https://ci.centos.org/job/libvirt-dbus-check/systems=libvirt-freebsd-11/ws/build/tests'> gmake: *** [Makefile:460: check-recursive] Error 1 + cat tests/test-suite.log ============================================== libvirt-dbus 1.4.0: tests/test-suite.log ============================================== # TOTAL: 7 # PASS: 6 # SKIP: 0 # XFAIL: 0 # FAIL: 1 # XPASS: 0 # ERROR: 0 .. contents:: :depth: 2 FAIL: test_connect.py ===================== ============================= test session starts ============================== platform freebsd11 -- Python 3.6.8, pytest-4.3.1, py-1.8.0, pluggy-0.7.1 rootdir: /usr<https://ci.centos.org/job/libvirt-dbus-check/systems=libvirt-freebsd-11/ws/,> inifile: collected 35 items ../../tests/test_connect.py ..................F......F......... [100%] =================================== FAILURES =================================== _________________ TestConnect.test_connect_get_cpu_model_names _________________ self = <test_connect.TestConnect object at 0x8093ee2b0> def test_connect_get_cpu_model_names(self): arch = "x86_64"
assert isinstance(self.connect.GetCPUModelNames(arch, 0), dbus.Array)
../../tests/test_connect.py:122: _ _ _ _ _ _ _ _ _ _ _ _ _ _ _ _ _ _ _ _ _ _ _ _ _ _ _ _ _ _ _ _ _ _ _ _ _ _ _ _ /usr/local/lib/python3.6/site-packages/dbus/proxies.py:70: in __call__ return self._proxy_method(*args, **keywords) /usr/local/lib/python3.6/site-packages/dbus/proxies.py:145: in __call__ **keywords) _ _ _ _ _ _ _ _ _ _ _ _ _ _ _ _ _ _ _ _ _ _ _ _ _ _ _ _ _ _ _ _ _ _ _ _ _ _ _ _ self = <dbus._dbus.SessionBus (session) at 0x8094a54c0> bus_name = dbus.String(':1.19'), object_path = '/org/libvirt/Test' dbus_interface = 'org.libvirt.Connect', method = 'GetCPUModelNames' signature = 'su', args = ('x86_64', 0), timeout = -1.0, byte_arrays = False kwargs = {}, get_args_opts = {'byte_arrays': False} message = <dbus.lowlevel.MethodCallMessage path: /org/libvirt/Test, iface: org.libvirt.Connect, member: GetCPUModelNames dest: :1.19> def call_blocking(self, bus_name, object_path, dbus_interface, method, signature, args, timeout=-1.0, byte_arrays=False, **kwargs): """Call the given method, synchronously. :Since: 0.81.0 """ if object_path == LOCAL_PATH: raise DBusException('Methods may not be called on the reserved ' 'path %s' % LOCAL_PATH) if dbus_interface == LOCAL_IFACE: raise DBusException('Methods may not be called on the reserved ' 'interface %s' % LOCAL_IFACE) # no need to validate other args - MethodCallMessage ctor will do get_args_opts = dict(byte_arrays=byte_arrays) if is_py2: get_args_opts['utf8_strings'] = kwargs.get('utf8_strings', False) elif 'utf8_strings' in kwargs: raise TypeError("unexpected keyword argument 'utf8_strings'") message = MethodCallMessage(destination=bus_name, path=object_path, interface=dbus_interface, method=method) # Add the arguments to the function try: message.append(signature=signature, *args) except Exception as e: logging.basicConfig() _logger.error('Unable to set arguments %r according to ' 'signature %r: %s: %s', args, signature, e.__class__, e) raise # make a blocking call reply_message = self.send_message_with_reply_and_block(
message, timeout)
E dbus.exceptions.DBusException: org.libvirt.Error: XML error: failed to parse xml document '/home/jenkins/build/libvirt/share/libvirt/cpu_map/x86_Cascadelake-Server.xml' /usr/local/lib/python3.6/site-packages/dbus/connection.py:651: DBusException ----------------------------- Captured stderr call ----------------------------- I/O warning : failed to load external entity "/home/jenkins/build/libvirt/share/libvirt/cpu_map/x86_Cascadelake-Server.xml" _______________ TestConnect.test_connect_node_device_create_xml ________________ Fixture "node_device_create" called directly. Fixtures are not meant to be called directly, but are created automatically when test functions request them as parameters. See https://docs.pytest.org/en/latest/fixture.html for more information about fixtures, and https://docs.pytest.org/en/latest/deprecations.html#calling-fixtures-directl... about how to update your code. ===================== 2 failed, 33 passed in 15.87 seconds ===================== FAIL test_connect.py (exit status: 1) + exit 1 Build step 'Execute shell' marked build as failure

See <https://ci.centos.org/job/libvirt-dbus-check/systems=libvirt-freebsd-11/329/display/redirect> ------------------------------------------ Started by upstream project "libvirt-dbus-check" build number 329 originally caused by: Started by upstream project "libvirt-dbus-syntax-check" build number 372 originally caused by: Started by upstream project "libvirt-dbus-build" build number 379 originally caused by: Started by upstream project "libvirt-glib-build" build number 376 originally caused by: Started by upstream project "libvirt-build" build number 474 originally caused by: Started by an SCM change [EnvInject] - Loading node environment variables. Building remotely on libvirt-freebsd-11 (libvirt) in workspace <https://ci.centos.org/job/libvirt-dbus-check/systems=libvirt-freebsd-11/ws/> [libvirt-dbus] $ /bin/sh -xe /tmp/jenkins4558073632984058128.sh + cd build + /usr/local/bin/gmake check Making check in data gmake[1]: Entering directory '/usr<https://ci.centos.org/job/libvirt-dbus-check/systems=libvirt-freebsd-11/ws/build/data'> gmake[1]: Nothing to be done for 'check'. gmake[1]: Leaving directory '/usr<https://ci.centos.org/job/libvirt-dbus-check/systems=libvirt-freebsd-11/ws/build/data'> Making check in docs gmake[1]: Entering directory '/usr<https://ci.centos.org/job/libvirt-dbus-check/systems=libvirt-freebsd-11/ws/build/docs'> gmake[1]: Nothing to be done for 'check'. gmake[1]: Leaving directory '/usr<https://ci.centos.org/job/libvirt-dbus-check/systems=libvirt-freebsd-11/ws/build/docs'> Making check in src gmake[1]: Entering directory '/usr<https://ci.centos.org/job/libvirt-dbus-check/systems=libvirt-freebsd-11/ws/build/src'> gmake[1]: Nothing to be done for 'check'. gmake[1]: Leaving directory '/usr<https://ci.centos.org/job/libvirt-dbus-check/systems=libvirt-freebsd-11/ws/build/src'> Making check in tests gmake[1]: Entering directory '/usr<https://ci.centos.org/job/libvirt-dbus-check/systems=libvirt-freebsd-11/ws/build/tests'> /usr/local/bin/gmake test_util gmake[2]: Entering directory '/usr<https://ci.centos.org/job/libvirt-dbus-check/systems=libvirt-freebsd-11/ws/build/tests'> CC test_util-test_util.o CCLD test_util gmake[2]: Leaving directory '/usr<https://ci.centos.org/job/libvirt-dbus-check/systems=libvirt-freebsd-11/ws/build/tests'> /usr/local/bin/gmake check-TESTS gmake[2]: Entering directory '/usr<https://ci.centos.org/job/libvirt-dbus-check/systems=libvirt-freebsd-11/ws/build/tests'> gmake[3]: Entering directory '/usr<https://ci.centos.org/job/libvirt-dbus-check/systems=libvirt-freebsd-11/ws/build/tests'> PASS: test_util PASS: test_interface.py PASS: test_domain.py PASS: test_network.py PASS: test_nodedev.py FAIL: test_connect.py PASS: test_storage.py ============================================================================ Testsuite summary for libvirt-dbus 1.4.0 ============================================================================ # TOTAL: 7 # PASS: 6 # SKIP: 0 # XFAIL: 0 # FAIL: 1 # XPASS: 0 # ERROR: 0 ============================================================================ See tests/test-suite.log Please report to libvir-list@redhat.com ============================================================================ gmake[3]: *** [Makefile:766: test-suite.log] Error 1 gmake[3]: Leaving directory '/usr<https://ci.centos.org/job/libvirt-dbus-check/systems=libvirt-freebsd-11/ws/build/tests'> gmake[2]: *** [Makefile:874: check-TESTS] Error 2 gmake[2]: Leaving directory '/usr<https://ci.centos.org/job/libvirt-dbus-check/systems=libvirt-freebsd-11/ws/build/tests'> gmake[1]: *** [Makefile:990: check-am] Error 2 gmake[1]: Leaving directory '/usr<https://ci.centos.org/job/libvirt-dbus-check/systems=libvirt-freebsd-11/ws/build/tests'> gmake: *** [Makefile:460: check-recursive] Error 1 + cat tests/test-suite.log ============================================== libvirt-dbus 1.4.0: tests/test-suite.log ============================================== # TOTAL: 7 # PASS: 6 # SKIP: 0 # XFAIL: 0 # FAIL: 1 # XPASS: 0 # ERROR: 0 .. contents:: :depth: 2 FAIL: test_connect.py ===================== ============================= test session starts ============================== platform freebsd11 -- Python 3.6.8, pytest-4.3.1, py-1.8.0, pluggy-0.7.1 rootdir: /usr<https://ci.centos.org/job/libvirt-dbus-check/systems=libvirt-freebsd-11/ws/,> inifile: collected 35 items ../../tests/test_connect.py .........................F......... [100%] =================================== FAILURES =================================== _______________ TestConnect.test_connect_node_device_create_xml ________________ Fixture "node_device_create" called directly. Fixtures are not meant to be called directly, but are created automatically when test functions request them as parameters. See https://docs.pytest.org/en/latest/fixture.html for more information about fixtures, and https://docs.pytest.org/en/latest/deprecations.html#calling-fixtures-directl... about how to update your code. ===================== 1 failed, 34 passed in 15.25 seconds ===================== FAIL test_connect.py (exit status: 1) + exit 1 Build step 'Execute shell' marked build as failure

See <https://ci.centos.org/job/libvirt-dbus-check/systems=libvirt-freebsd-11/330/display/redirect> ------------------------------------------ Started by upstream project "libvirt-dbus-check" build number 330 originally caused by: Started by upstream project "libvirt-dbus-syntax-check" build number 373 originally caused by: Started by upstream project "libvirt-dbus-build" build number 380 originally caused by: Started by upstream project "libvirt-glib-build" build number 377 originally caused by: Started by upstream project "libvirt-build" build number 475 originally caused by: Started by an SCM change [EnvInject] - Loading node environment variables. Building remotely on libvirt-freebsd-11 (libvirt) in workspace <https://ci.centos.org/job/libvirt-dbus-check/systems=libvirt-freebsd-11/ws/> [libvirt-dbus] $ /bin/sh -xe /tmp/jenkins210321161955835574.sh + cd build + /usr/local/bin/gmake check Making check in data gmake[1]: Entering directory '/usr<https://ci.centos.org/job/libvirt-dbus-check/systems=libvirt-freebsd-11/ws/build/data'> gmake[1]: Nothing to be done for 'check'. gmake[1]: Leaving directory '/usr<https://ci.centos.org/job/libvirt-dbus-check/systems=libvirt-freebsd-11/ws/build/data'> Making check in docs gmake[1]: Entering directory '/usr<https://ci.centos.org/job/libvirt-dbus-check/systems=libvirt-freebsd-11/ws/build/docs'> gmake[1]: Nothing to be done for 'check'. gmake[1]: Leaving directory '/usr<https://ci.centos.org/job/libvirt-dbus-check/systems=libvirt-freebsd-11/ws/build/docs'> Making check in src gmake[1]: Entering directory '/usr<https://ci.centos.org/job/libvirt-dbus-check/systems=libvirt-freebsd-11/ws/build/src'> gmake[1]: Nothing to be done for 'check'. gmake[1]: Leaving directory '/usr<https://ci.centos.org/job/libvirt-dbus-check/systems=libvirt-freebsd-11/ws/build/src'> Making check in tests gmake[1]: Entering directory '/usr<https://ci.centos.org/job/libvirt-dbus-check/systems=libvirt-freebsd-11/ws/build/tests'> /usr/local/bin/gmake test_util gmake[2]: Entering directory '/usr<https://ci.centos.org/job/libvirt-dbus-check/systems=libvirt-freebsd-11/ws/build/tests'> CC test_util-test_util.o CCLD test_util gmake[2]: Leaving directory '/usr<https://ci.centos.org/job/libvirt-dbus-check/systems=libvirt-freebsd-11/ws/build/tests'> /usr/local/bin/gmake check-TESTS gmake[2]: Entering directory '/usr<https://ci.centos.org/job/libvirt-dbus-check/systems=libvirt-freebsd-11/ws/build/tests'> gmake[3]: Entering directory '/usr<https://ci.centos.org/job/libvirt-dbus-check/systems=libvirt-freebsd-11/ws/build/tests'> PASS: test_util PASS: test_interface.py PASS: test_domain.py PASS: test_network.py PASS: test_nodedev.py FAIL: test_connect.py PASS: test_storage.py ============================================================================ Testsuite summary for libvirt-dbus 1.4.0 ============================================================================ # TOTAL: 7 # PASS: 6 # SKIP: 0 # XFAIL: 0 # FAIL: 1 # XPASS: 0 # ERROR: 0 ============================================================================ See tests/test-suite.log Please report to libvir-list@redhat.com ============================================================================ gmake[3]: *** [Makefile:766: test-suite.log] Error 1 gmake[3]: Leaving directory '/usr<https://ci.centos.org/job/libvirt-dbus-check/systems=libvirt-freebsd-11/ws/build/tests'> gmake[2]: *** [Makefile:874: check-TESTS] Error 2 gmake[2]: Leaving directory '/usr<https://ci.centos.org/job/libvirt-dbus-check/systems=libvirt-freebsd-11/ws/build/tests'> gmake[1]: *** [Makefile:990: check-am] Error 2 gmake[1]: Leaving directory '/usr<https://ci.centos.org/job/libvirt-dbus-check/systems=libvirt-freebsd-11/ws/build/tests'> gmake: *** [Makefile:460: check-recursive] Error 1 + cat tests/test-suite.log ============================================== libvirt-dbus 1.4.0: tests/test-suite.log ============================================== # TOTAL: 7 # PASS: 6 # SKIP: 0 # XFAIL: 0 # FAIL: 1 # XPASS: 0 # ERROR: 0 .. contents:: :depth: 2 FAIL: test_connect.py ===================== ============================= test session starts ============================== platform freebsd11 -- Python 3.6.8, pytest-4.3.1, py-1.8.0, pluggy-0.7.1 rootdir: /usr<https://ci.centos.org/job/libvirt-dbus-check/systems=libvirt-freebsd-11/ws/,> inifile: collected 35 items ../../tests/test_connect.py .........................F......... [100%] =================================== FAILURES =================================== _______________ TestConnect.test_connect_node_device_create_xml ________________ Fixture "node_device_create" called directly. Fixtures are not meant to be called directly, but are created automatically when test functions request them as parameters. See https://docs.pytest.org/en/latest/fixture.html for more information about fixtures, and https://docs.pytest.org/en/latest/deprecations.html#calling-fixtures-directl... about how to update your code. ===================== 1 failed, 34 passed in 15.13 seconds ===================== FAIL test_connect.py (exit status: 1) + exit 1 Build step 'Execute shell' marked build as failure

See <https://ci.centos.org/job/libvirt-dbus-check/systems=libvirt-freebsd-11/331/display/redirect> ------------------------------------------ Started by upstream project "libvirt-dbus-check" build number 331 originally caused by: Started by upstream project "libvirt-dbus-syntax-check" build number 374 originally caused by: Started by upstream project "libvirt-dbus-build" build number 381 originally caused by: Started by upstream project "libvirt-glib-build" build number 378 originally caused by: Started by upstream project "libvirt-build" build number 476 originally caused by: Started by an SCM change [EnvInject] - Loading node environment variables. Building remotely on libvirt-freebsd-11 (libvirt) in workspace <https://ci.centos.org/job/libvirt-dbus-check/systems=libvirt-freebsd-11/ws/> [libvirt-dbus] $ /bin/sh -xe /tmp/jenkins5616156316351357101.sh + cd build + /usr/local/bin/gmake check Making check in data gmake[1]: Entering directory '/usr<https://ci.centos.org/job/libvirt-dbus-check/systems=libvirt-freebsd-11/ws/build/data'> gmake[1]: Nothing to be done for 'check'. gmake[1]: Leaving directory '/usr<https://ci.centos.org/job/libvirt-dbus-check/systems=libvirt-freebsd-11/ws/build/data'> Making check in docs gmake[1]: Entering directory '/usr<https://ci.centos.org/job/libvirt-dbus-check/systems=libvirt-freebsd-11/ws/build/docs'> gmake[1]: Nothing to be done for 'check'. gmake[1]: Leaving directory '/usr<https://ci.centos.org/job/libvirt-dbus-check/systems=libvirt-freebsd-11/ws/build/docs'> Making check in src gmake[1]: Entering directory '/usr<https://ci.centos.org/job/libvirt-dbus-check/systems=libvirt-freebsd-11/ws/build/src'> gmake[1]: Nothing to be done for 'check'. gmake[1]: Leaving directory '/usr<https://ci.centos.org/job/libvirt-dbus-check/systems=libvirt-freebsd-11/ws/build/src'> Making check in tests gmake[1]: Entering directory '/usr<https://ci.centos.org/job/libvirt-dbus-check/systems=libvirt-freebsd-11/ws/build/tests'> /usr/local/bin/gmake test_util gmake[2]: Entering directory '/usr<https://ci.centos.org/job/libvirt-dbus-check/systems=libvirt-freebsd-11/ws/build/tests'> CC test_util-test_util.o CCLD test_util gmake[2]: Leaving directory '/usr<https://ci.centos.org/job/libvirt-dbus-check/systems=libvirt-freebsd-11/ws/build/tests'> /usr/local/bin/gmake check-TESTS gmake[2]: Entering directory '/usr<https://ci.centos.org/job/libvirt-dbus-check/systems=libvirt-freebsd-11/ws/build/tests'> gmake[3]: Entering directory '/usr<https://ci.centos.org/job/libvirt-dbus-check/systems=libvirt-freebsd-11/ws/build/tests'> PASS: test_util PASS: test_interface.py PASS: test_domain.py PASS: test_network.py PASS: test_nodedev.py FAIL: test_connect.py PASS: test_storage.py ============================================================================ Testsuite summary for libvirt-dbus 1.4.0 ============================================================================ # TOTAL: 7 # PASS: 6 # SKIP: 0 # XFAIL: 0 # FAIL: 1 # XPASS: 0 # ERROR: 0 ============================================================================ See tests/test-suite.log Please report to libvir-list@redhat.com ============================================================================ gmake[3]: *** [Makefile:766: test-suite.log] Error 1 gmake[3]: Leaving directory '/usr<https://ci.centos.org/job/libvirt-dbus-check/systems=libvirt-freebsd-11/ws/build/tests'> gmake[2]: *** [Makefile:874: check-TESTS] Error 2 gmake[2]: Leaving directory '/usr<https://ci.centos.org/job/libvirt-dbus-check/systems=libvirt-freebsd-11/ws/build/tests'> gmake[1]: *** [Makefile:990: check-am] Error 2 gmake[1]: Leaving directory '/usr<https://ci.centos.org/job/libvirt-dbus-check/systems=libvirt-freebsd-11/ws/build/tests'> gmake: *** [Makefile:460: check-recursive] Error 1 + cat tests/test-suite.log ============================================== libvirt-dbus 1.4.0: tests/test-suite.log ============================================== # TOTAL: 7 # PASS: 6 # SKIP: 0 # XFAIL: 0 # FAIL: 1 # XPASS: 0 # ERROR: 0 .. contents:: :depth: 2 FAIL: test_connect.py ===================== ============================= test session starts ============================== platform freebsd11 -- Python 3.6.8, pytest-4.3.1, py-1.8.0, pluggy-0.7.1 rootdir: /usr<https://ci.centos.org/job/libvirt-dbus-check/systems=libvirt-freebsd-11/ws/,> inifile: collected 35 items ../../tests/test_connect.py .........................F......... [100%] =================================== FAILURES =================================== _______________ TestConnect.test_connect_node_device_create_xml ________________ Fixture "node_device_create" called directly. Fixtures are not meant to be called directly, but are created automatically when test functions request them as parameters. See https://docs.pytest.org/en/latest/fixture.html for more information about fixtures, and https://docs.pytest.org/en/latest/deprecations.html#calling-fixtures-directl... about how to update your code. ===================== 1 failed, 34 passed in 12.46 seconds ===================== FAIL test_connect.py (exit status: 1) + exit 1 Build step 'Execute shell' marked build as failure

See <https://ci.centos.org/job/libvirt-dbus-check/systems=libvirt-freebsd-11/332/display/redirect> ------------------------------------------ Started by upstream project "libvirt-dbus-check" build number 332 originally caused by: Started by upstream project "libvirt-dbus-syntax-check" build number 375 originally caused by: Started by upstream project "libvirt-dbus-build" build number 382 originally caused by: Started by upstream project "libvirt-glib-build" build number 380 originally caused by: Started by upstream project "libvirt-build" build number 478 originally caused by: Started by an SCM change Started by an SCM change [EnvInject] - Loading node environment variables. Building remotely on libvirt-freebsd-11 (libvirt) in workspace <https://ci.centos.org/job/libvirt-dbus-check/systems=libvirt-freebsd-11/ws/> [libvirt-dbus] $ /bin/sh -xe /tmp/jenkins1810892081648525699.sh + cd build + /usr/local/bin/gmake check Making check in data gmake[1]: Entering directory '/usr<https://ci.centos.org/job/libvirt-dbus-check/systems=libvirt-freebsd-11/ws/build/data'> gmake[1]: Nothing to be done for 'check'. gmake[1]: Leaving directory '/usr<https://ci.centos.org/job/libvirt-dbus-check/systems=libvirt-freebsd-11/ws/build/data'> Making check in docs gmake[1]: Entering directory '/usr<https://ci.centos.org/job/libvirt-dbus-check/systems=libvirt-freebsd-11/ws/build/docs'> gmake[1]: Nothing to be done for 'check'. gmake[1]: Leaving directory '/usr<https://ci.centos.org/job/libvirt-dbus-check/systems=libvirt-freebsd-11/ws/build/docs'> Making check in src gmake[1]: Entering directory '/usr<https://ci.centos.org/job/libvirt-dbus-check/systems=libvirt-freebsd-11/ws/build/src'> gmake[1]: Nothing to be done for 'check'. gmake[1]: Leaving directory '/usr<https://ci.centos.org/job/libvirt-dbus-check/systems=libvirt-freebsd-11/ws/build/src'> Making check in tests gmake[1]: Entering directory '/usr<https://ci.centos.org/job/libvirt-dbus-check/systems=libvirt-freebsd-11/ws/build/tests'> /usr/local/bin/gmake test_util gmake[2]: Entering directory '/usr<https://ci.centos.org/job/libvirt-dbus-check/systems=libvirt-freebsd-11/ws/build/tests'> CC test_util-test_util.o CCLD test_util gmake[2]: Leaving directory '/usr<https://ci.centos.org/job/libvirt-dbus-check/systems=libvirt-freebsd-11/ws/build/tests'> /usr/local/bin/gmake check-TESTS gmake[2]: Entering directory '/usr<https://ci.centos.org/job/libvirt-dbus-check/systems=libvirt-freebsd-11/ws/build/tests'> gmake[3]: Entering directory '/usr<https://ci.centos.org/job/libvirt-dbus-check/systems=libvirt-freebsd-11/ws/build/tests'> PASS: test_util PASS: test_interface.py PASS: test_domain.py PASS: test_network.py PASS: test_nodedev.py FAIL: test_connect.py PASS: test_storage.py ============================================================================ Testsuite summary for libvirt-dbus 1.4.0 ============================================================================ # TOTAL: 7 # PASS: 6 # SKIP: 0 # XFAIL: 0 # FAIL: 1 # XPASS: 0 # ERROR: 0 ============================================================================ See tests/test-suite.log Please report to libvir-list@redhat.com ============================================================================ gmake[3]: *** [Makefile:766: test-suite.log] Error 1 gmake[3]: Leaving directory '/usr<https://ci.centos.org/job/libvirt-dbus-check/systems=libvirt-freebsd-11/ws/build/tests'> gmake[2]: *** [Makefile:874: check-TESTS] Error 2 gmake[2]: Leaving directory '/usr<https://ci.centos.org/job/libvirt-dbus-check/systems=libvirt-freebsd-11/ws/build/tests'> gmake[1]: *** [Makefile:990: check-am] Error 2 gmake[1]: Leaving directory '/usr<https://ci.centos.org/job/libvirt-dbus-check/systems=libvirt-freebsd-11/ws/build/tests'> gmake: *** [Makefile:460: check-recursive] Error 1 + cat tests/test-suite.log ============================================== libvirt-dbus 1.4.0: tests/test-suite.log ============================================== # TOTAL: 7 # PASS: 6 # SKIP: 0 # XFAIL: 0 # FAIL: 1 # XPASS: 0 # ERROR: 0 .. contents:: :depth: 2 FAIL: test_connect.py ===================== ============================= test session starts ============================== platform freebsd11 -- Python 3.6.8, pytest-4.3.1, py-1.8.0, pluggy-0.7.1 rootdir: /usr<https://ci.centos.org/job/libvirt-dbus-check/systems=libvirt-freebsd-11/ws/,> inifile: collected 35 items ../../tests/test_connect.py .........................F......... [100%] =================================== FAILURES =================================== _______________ TestConnect.test_connect_node_device_create_xml ________________ Fixture "node_device_create" called directly. Fixtures are not meant to be called directly, but are created automatically when test functions request them as parameters. See https://docs.pytest.org/en/latest/fixture.html for more information about fixtures, and https://docs.pytest.org/en/latest/deprecations.html#calling-fixtures-directl... about how to update your code. ===================== 1 failed, 34 passed in 17.01 seconds ===================== FAIL test_connect.py (exit status: 1) + exit 1 Build step 'Execute shell' marked build as failure

See <https://ci.centos.org/job/libvirt-dbus-check/systems=libvirt-freebsd-11/333/display/redirect> ------------------------------------------ Started by upstream project "libvirt-dbus-check" build number 333 originally caused by: Started by upstream project "libvirt-dbus-syntax-check" build number 376 originally caused by: Started by upstream project "libvirt-dbus-build" build number 383 originally caused by: Started by upstream project "libvirt-glib-build" build number 381 originally caused by: Started by upstream project "libvirt-build" build number 479 originally caused by: Started by an SCM change Started by an SCM change Started by an SCM change Started by an SCM change Started by an SCM change Started by an SCM change Started by an SCM change [EnvInject] - Loading node environment variables. Building remotely on libvirt-freebsd-11 (libvirt) in workspace <https://ci.centos.org/job/libvirt-dbus-check/systems=libvirt-freebsd-11/ws/> [libvirt-dbus] $ /bin/sh -xe /tmp/jenkins2295235890849350578.sh + cd build + /usr/local/bin/gmake check Making check in data gmake[1]: Entering directory '/usr<https://ci.centos.org/job/libvirt-dbus-check/systems=libvirt-freebsd-11/ws/build/data'> gmake[1]: Nothing to be done for 'check'. gmake[1]: Leaving directory '/usr<https://ci.centos.org/job/libvirt-dbus-check/systems=libvirt-freebsd-11/ws/build/data'> Making check in docs gmake[1]: Entering directory '/usr<https://ci.centos.org/job/libvirt-dbus-check/systems=libvirt-freebsd-11/ws/build/docs'> gmake[1]: Nothing to be done for 'check'. gmake[1]: Leaving directory '/usr<https://ci.centos.org/job/libvirt-dbus-check/systems=libvirt-freebsd-11/ws/build/docs'> Making check in src gmake[1]: Entering directory '/usr<https://ci.centos.org/job/libvirt-dbus-check/systems=libvirt-freebsd-11/ws/build/src'> gmake[1]: Nothing to be done for 'check'. gmake[1]: Leaving directory '/usr<https://ci.centos.org/job/libvirt-dbus-check/systems=libvirt-freebsd-11/ws/build/src'> Making check in tests gmake[1]: Entering directory '/usr<https://ci.centos.org/job/libvirt-dbus-check/systems=libvirt-freebsd-11/ws/build/tests'> /usr/local/bin/gmake test_util gmake[2]: Entering directory '/usr<https://ci.centos.org/job/libvirt-dbus-check/systems=libvirt-freebsd-11/ws/build/tests'> CC test_util-test_util.o CCLD test_util gmake[2]: Leaving directory '/usr<https://ci.centos.org/job/libvirt-dbus-check/systems=libvirt-freebsd-11/ws/build/tests'> /usr/local/bin/gmake check-TESTS gmake[2]: Entering directory '/usr<https://ci.centos.org/job/libvirt-dbus-check/systems=libvirt-freebsd-11/ws/build/tests'> gmake[3]: Entering directory '/usr<https://ci.centos.org/job/libvirt-dbus-check/systems=libvirt-freebsd-11/ws/build/tests'> PASS: test_util PASS: test_interface.py PASS: test_domain.py PASS: test_network.py PASS: test_nodedev.py FAIL: test_connect.py PASS: test_storage.py ============================================================================ Testsuite summary for libvirt-dbus 1.4.0 ============================================================================ # TOTAL: 7 # PASS: 6 # SKIP: 0 # XFAIL: 0 # FAIL: 1 # XPASS: 0 # ERROR: 0 ============================================================================ See tests/test-suite.log Please report to libvir-list@redhat.com ============================================================================ gmake[3]: *** [Makefile:766: test-suite.log] Error 1 gmake[3]: Leaving directory '/usr<https://ci.centos.org/job/libvirt-dbus-check/systems=libvirt-freebsd-11/ws/build/tests'> gmake[2]: *** [Makefile:874: check-TESTS] Error 2 gmake[2]: Leaving directory '/usr<https://ci.centos.org/job/libvirt-dbus-check/systems=libvirt-freebsd-11/ws/build/tests'> gmake[1]: *** [Makefile:990: check-am] Error 2 gmake[1]: Leaving directory '/usr<https://ci.centos.org/job/libvirt-dbus-check/systems=libvirt-freebsd-11/ws/build/tests'> gmake: *** [Makefile:460: check-recursive] Error 1 + cat tests/test-suite.log ============================================== libvirt-dbus 1.4.0: tests/test-suite.log ============================================== # TOTAL: 7 # PASS: 6 # SKIP: 0 # XFAIL: 0 # FAIL: 1 # XPASS: 0 # ERROR: 0 .. contents:: :depth: 2 FAIL: test_connect.py ===================== ============================= test session starts ============================== platform freebsd11 -- Python 3.6.8, pytest-4.3.1, py-1.8.0, pluggy-0.7.1 rootdir: /usr<https://ci.centos.org/job/libvirt-dbus-check/systems=libvirt-freebsd-11/ws/,> inifile: collected 35 items ../../tests/test_connect.py .........................F......... [100%] =================================== FAILURES =================================== _______________ TestConnect.test_connect_node_device_create_xml ________________ Fixture "node_device_create" called directly. Fixtures are not meant to be called directly, but are created automatically when test functions request them as parameters. See https://docs.pytest.org/en/latest/fixture.html for more information about fixtures, and https://docs.pytest.org/en/latest/deprecations.html#calling-fixtures-directl... about how to update your code. ===================== 1 failed, 34 passed in 13.84 seconds ===================== FAIL test_connect.py (exit status: 1) + exit 1 Build step 'Execute shell' marked build as failure

See <https://ci.centos.org/job/libvirt-dbus-check/systems=libvirt-freebsd-11/334/display/redirect> ------------------------------------------ Started by upstream project "libvirt-dbus-check" build number 334 originally caused by: Started by upstream project "libvirt-dbus-syntax-check" build number 377 originally caused by: Started by upstream project "libvirt-dbus-build" build number 384 originally caused by: Started by upstream project "libvirt-glib-build" build number 382 originally caused by: Started by upstream project "libvirt-build" build number 480 originally caused by: Started by an SCM change Started by an SCM change Started by an SCM change Started by an SCM change Started by an SCM change Started by an SCM change Started by an SCM change Started by an SCM change [EnvInject] - Loading node environment variables. Building remotely on libvirt-freebsd-11 (libvirt) in workspace <https://ci.centos.org/job/libvirt-dbus-check/systems=libvirt-freebsd-11/ws/> [libvirt-dbus] $ /bin/sh -xe /tmp/jenkins1647561146439296418.sh + cd build + /usr/local/bin/gmake check Making check in data gmake[1]: Entering directory '/usr<https://ci.centos.org/job/libvirt-dbus-check/systems=libvirt-freebsd-11/ws/build/data'> gmake[1]: Nothing to be done for 'check'. gmake[1]: Leaving directory '/usr<https://ci.centos.org/job/libvirt-dbus-check/systems=libvirt-freebsd-11/ws/build/data'> Making check in docs gmake[1]: Entering directory '/usr<https://ci.centos.org/job/libvirt-dbus-check/systems=libvirt-freebsd-11/ws/build/docs'> gmake[1]: Nothing to be done for 'check'. gmake[1]: Leaving directory '/usr<https://ci.centos.org/job/libvirt-dbus-check/systems=libvirt-freebsd-11/ws/build/docs'> Making check in src gmake[1]: Entering directory '/usr<https://ci.centos.org/job/libvirt-dbus-check/systems=libvirt-freebsd-11/ws/build/src'> gmake[1]: Nothing to be done for 'check'. gmake[1]: Leaving directory '/usr<https://ci.centos.org/job/libvirt-dbus-check/systems=libvirt-freebsd-11/ws/build/src'> Making check in tests gmake[1]: Entering directory '/usr<https://ci.centos.org/job/libvirt-dbus-check/systems=libvirt-freebsd-11/ws/build/tests'> /usr/local/bin/gmake test_util gmake[2]: Entering directory '/usr<https://ci.centos.org/job/libvirt-dbus-check/systems=libvirt-freebsd-11/ws/build/tests'> CC test_util-test_util.o CCLD test_util gmake[2]: Leaving directory '/usr<https://ci.centos.org/job/libvirt-dbus-check/systems=libvirt-freebsd-11/ws/build/tests'> /usr/local/bin/gmake check-TESTS gmake[2]: Entering directory '/usr<https://ci.centos.org/job/libvirt-dbus-check/systems=libvirt-freebsd-11/ws/build/tests'> gmake[3]: Entering directory '/usr<https://ci.centos.org/job/libvirt-dbus-check/systems=libvirt-freebsd-11/ws/build/tests'> PASS: test_util PASS: test_interface.py PASS: test_domain.py PASS: test_nodedev.py PASS: test_network.py FAIL: test_connect.py PASS: test_storage.py ============================================================================ Testsuite summary for libvirt-dbus 1.4.0 ============================================================================ # TOTAL: 7 # PASS: 6 # SKIP: 0 # XFAIL: 0 # FAIL: 1 # XPASS: 0 # ERROR: 0 ============================================================================ See tests/test-suite.log Please report to libvir-list@redhat.com ============================================================================ gmake[3]: *** [Makefile:766: test-suite.log] Error 1 gmake[3]: Leaving directory '/usr<https://ci.centos.org/job/libvirt-dbus-check/systems=libvirt-freebsd-11/ws/build/tests'> gmake[2]: *** [Makefile:874: check-TESTS] Error 2 gmake[2]: Leaving directory '/usr<https://ci.centos.org/job/libvirt-dbus-check/systems=libvirt-freebsd-11/ws/build/tests'> gmake[1]: *** [Makefile:990: check-am] Error 2 gmake[1]: Leaving directory '/usr<https://ci.centos.org/job/libvirt-dbus-check/systems=libvirt-freebsd-11/ws/build/tests'> gmake: *** [Makefile:460: check-recursive] Error 1 + cat tests/test-suite.log ============================================== libvirt-dbus 1.4.0: tests/test-suite.log ============================================== # TOTAL: 7 # PASS: 6 # SKIP: 0 # XFAIL: 0 # FAIL: 1 # XPASS: 0 # ERROR: 0 .. contents:: :depth: 2 FAIL: test_connect.py ===================== ============================= test session starts ============================== platform freebsd11 -- Python 3.6.8, pytest-4.3.1, py-1.8.0, pluggy-0.7.1 rootdir: /usr<https://ci.centos.org/job/libvirt-dbus-check/systems=libvirt-freebsd-11/ws/,> inifile: collected 35 items ../../tests/test_connect.py .........................F......... [100%] =================================== FAILURES =================================== _______________ TestConnect.test_connect_node_device_create_xml ________________ Fixture "node_device_create" called directly. Fixtures are not meant to be called directly, but are created automatically when test functions request them as parameters. See https://docs.pytest.org/en/latest/fixture.html for more information about fixtures, and https://docs.pytest.org/en/latest/deprecations.html#calling-fixtures-directl... about how to update your code. ===================== 1 failed, 34 passed in 13.51 seconds ===================== FAIL test_connect.py (exit status: 1) + exit 1 Build step 'Execute shell' marked build as failure

See <https://ci.centos.org/job/libvirt-dbus-check/systems=libvirt-freebsd-11/335/display/redirect> ------------------------------------------ Started by upstream project "libvirt-dbus-check" build number 335 originally caused by: Started by upstream project "libvirt-dbus-syntax-check" build number 378 originally caused by: Started by upstream project "libvirt-dbus-build" build number 385 originally caused by: Started by upstream project "libvirt-glib-build" build number 383 originally caused by: Started by upstream project "libvirt-build" build number 481 originally caused by: Started by an SCM change [EnvInject] - Loading node environment variables. Building remotely on libvirt-freebsd-11 (libvirt) in workspace <https://ci.centos.org/job/libvirt-dbus-check/systems=libvirt-freebsd-11/ws/> [libvirt-dbus] $ /bin/sh -xe /tmp/jenkins6499053676604982695.sh + cd build + /usr/local/bin/gmake check Making check in data gmake[1]: Entering directory '/usr<https://ci.centos.org/job/libvirt-dbus-check/systems=libvirt-freebsd-11/ws/build/data'> gmake[1]: Nothing to be done for 'check'. gmake[1]: Leaving directory '/usr<https://ci.centos.org/job/libvirt-dbus-check/systems=libvirt-freebsd-11/ws/build/data'> Making check in docs gmake[1]: Entering directory '/usr<https://ci.centos.org/job/libvirt-dbus-check/systems=libvirt-freebsd-11/ws/build/docs'> gmake[1]: Nothing to be done for 'check'. gmake[1]: Leaving directory '/usr<https://ci.centos.org/job/libvirt-dbus-check/systems=libvirt-freebsd-11/ws/build/docs'> Making check in src gmake[1]: Entering directory '/usr<https://ci.centos.org/job/libvirt-dbus-check/systems=libvirt-freebsd-11/ws/build/src'> gmake[1]: Nothing to be done for 'check'. gmake[1]: Leaving directory '/usr<https://ci.centos.org/job/libvirt-dbus-check/systems=libvirt-freebsd-11/ws/build/src'> Making check in tests gmake[1]: Entering directory '/usr<https://ci.centos.org/job/libvirt-dbus-check/systems=libvirt-freebsd-11/ws/build/tests'> /usr/local/bin/gmake test_util gmake[2]: Entering directory '/usr<https://ci.centos.org/job/libvirt-dbus-check/systems=libvirt-freebsd-11/ws/build/tests'> CC test_util-test_util.o CCLD test_util gmake[2]: Leaving directory '/usr<https://ci.centos.org/job/libvirt-dbus-check/systems=libvirt-freebsd-11/ws/build/tests'> /usr/local/bin/gmake check-TESTS gmake[2]: Entering directory '/usr<https://ci.centos.org/job/libvirt-dbus-check/systems=libvirt-freebsd-11/ws/build/tests'> gmake[3]: Entering directory '/usr<https://ci.centos.org/job/libvirt-dbus-check/systems=libvirt-freebsd-11/ws/build/tests'> PASS: test_util PASS: test_interface.py PASS: test_domain.py PASS: test_network.py PASS: test_nodedev.py FAIL: test_connect.py PASS: test_storage.py ============================================================================ Testsuite summary for libvirt-dbus 1.4.0 ============================================================================ # TOTAL: 7 # PASS: 6 # SKIP: 0 # XFAIL: 0 # FAIL: 1 # XPASS: 0 # ERROR: 0 ============================================================================ See tests/test-suite.log Please report to libvir-list@redhat.com ============================================================================ gmake[3]: *** [Makefile:766: test-suite.log] Error 1 gmake[3]: Leaving directory '/usr<https://ci.centos.org/job/libvirt-dbus-check/systems=libvirt-freebsd-11/ws/build/tests'> gmake[2]: *** [Makefile:874: check-TESTS] Error 2 gmake[2]: Leaving directory '/usr<https://ci.centos.org/job/libvirt-dbus-check/systems=libvirt-freebsd-11/ws/build/tests'> gmake[1]: *** [Makefile:990: check-am] Error 2 gmake[1]: Leaving directory '/usr<https://ci.centos.org/job/libvirt-dbus-check/systems=libvirt-freebsd-11/ws/build/tests'> gmake: *** [Makefile:460: check-recursive] Error 1 + cat tests/test-suite.log ============================================== libvirt-dbus 1.4.0: tests/test-suite.log ============================================== # TOTAL: 7 # PASS: 6 # SKIP: 0 # XFAIL: 0 # FAIL: 1 # XPASS: 0 # ERROR: 0 .. contents:: :depth: 2 FAIL: test_connect.py ===================== ============================= test session starts ============================== platform freebsd11 -- Python 3.6.8, pytest-4.3.1, py-1.8.0, pluggy-0.7.1 rootdir: /usr<https://ci.centos.org/job/libvirt-dbus-check/systems=libvirt-freebsd-11/ws/,> inifile: collected 35 items ../../tests/test_connect.py .........................F......... [100%] =================================== FAILURES =================================== _______________ TestConnect.test_connect_node_device_create_xml ________________ Fixture "node_device_create" called directly. Fixtures are not meant to be called directly, but are created automatically when test functions request them as parameters. See https://docs.pytest.org/en/latest/fixture.html for more information about fixtures, and https://docs.pytest.org/en/latest/deprecations.html#calling-fixtures-directl... about how to update your code. ===================== 1 failed, 34 passed in 14.24 seconds ===================== FAIL test_connect.py (exit status: 1) + exit 1 Build step 'Execute shell' marked build as failure

participants (1)
-
ci@centos.org