[Libvirt-ci] Build failed in Jenkins: virt-manager-check » libvirt-fedora-rawhide #295

See <https://ci.centos.org/job/virt-manager-check/systems=libvirt-fedora-rawhide/295/display/redirect> ------------------------------------------ Started by upstream project "virt-manager-check" build number 295 originally caused by: Started by upstream project "virt-manager-build" build number 296 originally caused by: Started by upstream project "libosinfo-build" build number 78 originally caused by: Started by an SCM change [EnvInject] - Loading node environment variables. Building remotely on libvirt-fedora-rawhide (libvirt) in workspace <https://ci.centos.org/job/virt-manager-check/systems=libvirt-fedora-rawhide/ws/> [virt-manager] $ /bin/sh -xe /tmp/jenkins3891798916470323139.sh + /usr/bin/python3 ./setup.py test running test ............................................................................................................................................................................................................F........................................s.......................................................................................................................................................................................................ssssssssss ====================================================================== FAIL: testCLI0082virt_install_cdrom_url (tests.clitest.CLITests) ---------------------------------------------------------------------- Traceback (most recent call last): File "<https://ci.centos.org/job/virt-manager-check/systems=libvirt-fedora-rawhide/ws/tests/clitest.py",> line 1134, in <lambda> return lambda s: cmdtemplate(s, cmd) File "<https://ci.centos.org/job/virt-manager-check/systems=libvirt-fedora-rawhide/ws/tests/clitest.py",> line 1133, in cmdtemplate _cmdobj.run(self) File "<https://ci.centos.org/job/virt-manager-check/systems=libvirt-fedora-rawhide/ws/tests/clitest.py",> line 255, in run tests.fail(err) AssertionError: ./virt-install --connect __virtinst_test__test://<https://ci.centos.org/job/virt-manager-check/systems=libvirt-fedora-rawhide/ws/tests/testsuite.xml,predictable> --name foobar --ram 64 --print-step all --nographics --noautoconsole --nodisks --cdrom http://example.com/path/to/some.iso Conversion outputs did not match. --- tests/cli-test-xml/compare/virt-install-cdrom-url.xml +++ Generated Output @@ -1,3 +1,5 @@ +<https://ci.centos.org/job/virt-manager-check/systems=libvirt-fedora-rawhide/ws/virtinst/osdict.py>:205: Warning: g_object_unref: assertion 'G_IS_OBJECT (object)' failed + media = libosinfo.Media.create_from_location(location, None) <domain type="test"> <name>foobar</name> <uuid>00000000-1111-2222-3333-444444444444</uuid> ---------------------------------------------------------------------- Ran 455 tests in 60.013s FAILED (failures=1, skipped=11) Build step 'Execute shell' marked build as failure

participants (1)
-
ci@centos.org