[Libvirt-ci] Build failed in Jenkins: libvirt-master-check » libvirt-fedora-23 #636

See <https://ci.centos.org/job/libvirt-master-check/systems=libvirt-fedora-23/636/display/redirect> ------------------------------------------ [...truncated 22.56 KB...] CCLD test-strerror CCLD test-strerror_r CCLD test-string CCLD test-strings CCLD test-strnlen CCLD test-symlink CCLD test-sys_ioctl CCLD test-sys_select CCLD test-sys_socket CCLD test-sys_stat CCLD test-sys_time CCLD test-sys_uio CCLD test-sys_types CCLD test-sys_utsname CCLD test-sys_wait CCLD test-termios CCLD test-thread_self CCLD test-thread_create CCLD test-time CCLD test-ttyname_r CCLD test-uname CCLD test-unistd CCLD test-unlockpt CCLD test-unsetenv CCLD test-usleep CCLD test-vasnprintf CCLD test-vasprintf CCLD test-verify CCLD test-vsnprintf CCLD test-wchar CCLD test-wcrtomb CCLD test-wcrtomb-w32 CCLD test-wctype-h CCLD test-write CCLD test-xalloc-die make[4]: Leaving directory '<https://ci.centos.org/job/libvirt-master-check/systems=libvirt-fedora-23/ws/build/gnulib/tests'> make check-TESTS make[4]: Entering directory '<https://ci.centos.org/job/libvirt-master-check/systems=libvirt-fedora-23/ws/build/gnulib/tests'> make[5]: Entering directory '<https://ci.centos.org/job/libvirt-master-check/systems=libvirt-fedora-23/ws/build/gnulib/tests'> ============================================================================ Testsuite summary for libvirt 3.8.0 ============================================================================ # TOTAL: 0 # PASS: 0 # SKIP: 0 # XFAIL: 0 # FAIL: 0 # XPASS: 0 # ERROR: 0 ============================================================================ make[5]: Leaving directory '<https://ci.centos.org/job/libvirt-master-check/systems=libvirt-fedora-23/ws/build/gnulib/tests'> make[4]: Leaving directory '<https://ci.centos.org/job/libvirt-master-check/systems=libvirt-fedora-23/ws/build/gnulib/tests'> make[3]: Leaving directory '<https://ci.centos.org/job/libvirt-master-check/systems=libvirt-fedora-23/ws/build/gnulib/tests'> make[2]: Leaving directory '<https://ci.centos.org/job/libvirt-master-check/systems=libvirt-fedora-23/ws/build/gnulib/tests'> make[1]: Leaving directory '<https://ci.centos.org/job/libvirt-master-check/systems=libvirt-fedora-23/ws/build/gnulib/tests'> Making check in tests make[1]: Entering directory '<https://ci.centos.org/job/libvirt-master-check/systems=libvirt-fedora-23/ws/build/tests'> make make[2]: Entering directory '<https://ci.centos.org/job/libvirt-master-check/systems=libvirt-fedora-23/ws/build/tests'> make[2]: Nothing to be done for 'all'. make[2]: Leaving directory '<https://ci.centos.org/job/libvirt-master-check/systems=libvirt-fedora-23/ws/build/tests'> make check-TESTS make[2]: Entering directory '<https://ci.centos.org/job/libvirt-master-check/systems=libvirt-fedora-23/ws/build/tests'> make[3]: Entering directory '<https://ci.centos.org/job/libvirt-master-check/systems=libvirt-fedora-23/ws/build/tests'> PASS: sockettest PASS: virhostcputest PASS: virbuftest PASS: seclabeltest FAIL: commandtest PASS: virhashtest PASS: virconftest PASS: viratomictest PASS: shunloadtest PASS: utiltest PASS: virtimetest PASS: virkeyfiletest PASS: viruritest PASS: virauthconfigtest PASS: viralloctest PASS: virbitmaptest PASS: vircgrouptest PASS: vircryptotest PASS: virpcitest PASS: virendiantest PASS: virfiletest PASS: virfilecachetest PASS: viriscsitest PASS: virfirewalltest PASS: virlockspacetest PASS: virkeycodetest PASS: virshtest PASS: virlogtest PASS: virrotatingfiletest PASS: virstringtest PASS: virportallocatortest PASS: sysinfotest PASS: virkmodtest PASS: vircapstest PASS: domaincapstest PASS: domainconftest PASS: virhostdevtest PASS: virnetdevtest PASS: virschematest PASS: virtypedparamtest PASS: virnetmessagetest PASS: virnetsockettest PASS: virnetdaemontest PASS: virnetserverclienttest PASS: fchosttest PASS: scsihosttest PASS: virnettlscontexttest PASS: vircaps2xmltest PASS: fdstreamtest PASS: virnettlssessiontest PASS: virdbustest PASS: virsystemdtest PASS: virpolkittest PASS: securityselinuxtest PASS: viridentitytest PASS: securityselinuxlabeltest PASS: sexpr2xmltest PASS: xml2sexprtest PASS: xmconfigtest PASS: xencapstest PASS: libxlxml2domconfigtest PASS: qemuxml2argvtest PASS: qemuargv2xmltest PASS: qemuxml2xmltest PASS: qemuhelptest PASS: domainsnapshotxml2xmltest PASS: qemumonitortest PASS: qemumonitorjsontest PASS: qemuhotplugtest PASS: qemuagenttest PASS: qemucapabilitiestest PASS: qemucaps2xmltest PASS: qemumemlocktest PASS: qemucommandutiltest PASS: lxcxml2xmltest PASS: lxcconf2xmltest PASS: openvzutilstest PASS: esxutilstest PASS: vboxsnapshotxmltest PASS: vmx2xmltest PASS: xml2vmxtest PASS: vmwarevertest PASS: virjsontest PASS: networkxml2xmltest PASS: networkxml2conftest PASS: networkxml2xmlupdatetest PASS: xlconfigtest PASS: storagebackendsheepdogtest PASS: networkxml2firewalltest PASS: nwfilterxml2xmltest PASS: nwfilterebiptablestest PASS: nwfilterxml2firewalltest PASS: storagevolxml2argvtest PASS: virstorageutiltest PASS: virscsitest PASS: nsstest PASS: storagevolxml2xmltest PASS: nssguesttest PASS: storagepoolxml2xmltest PASS: nodedevxml2xmltest PASS: interfacexml2xmltest PASS: virstoragetest PASS: metadatatest PASS: secretxml2xmltest PASS: cputest PASS: genericxml2xmltest PASS: virusbtest PASS: virnetdevbandwidthtest PASS: eventtest PASS: virdrivermoduletest PASS: objecteventtest PASS: libvirtd-pool PASS: virmacmaptest PASS: libvirtd-fail PASS: virsh-define-dev-segfault PASS: virsh-cpuset SKIP: virsh-optparse PASS: virsh-int-overflow PASS: virsh-schedinfo PASS: virsh-read-non-seekable PASS: virsh-read-bufsiz PASS: virsh-self-test PASS: virsh-start PASS: virsh-undefine PASS: virt-admin-self-test PASS: virsh-uriprecedence PASS: virsh-vcpupin ============================================================================ Testsuite summary for libvirt 3.8.0 ============================================================================ # TOTAL: 127 # PASS: 125 # SKIP: 1 # XFAIL: 0 # FAIL: 1 # XPASS: 0 # ERROR: 0 ============================================================================ See tests/test-suite.log Please report to libvir-list@redhat.com ============================================================================ Makefile:5992: recipe for target 'test-suite.log' failed make[3]: *** [test-suite.log] Error 1 make[3]: Leaving directory '<https://ci.centos.org/job/libvirt-master-check/systems=libvirt-fedora-23/ws/build/tests'> Makefile:6098: recipe for target 'check-TESTS' failed make[2]: *** [check-TESTS] Error 2 make[2]: Leaving directory '<https://ci.centos.org/job/libvirt-master-check/systems=libvirt-fedora-23/ws/build/tests'> Makefile:7088: recipe for target 'check-am' failed make[1]: *** [check-am] Error 2 make[1]: Leaving directory '<https://ci.centos.org/job/libvirt-master-check/systems=libvirt-fedora-23/ws/build/tests'> Makefile:2114: recipe for target 'check-recursive' failed make: *** [check-recursive] Error 1 + cat tests/test-suite.log ========================================= libvirt 3.8.0: tests/test-suite.log ========================================= # TOTAL: 127 # PASS: 125 # SKIP: 1 # XFAIL: 0 # FAIL: 1 # XPASS: 0 # ERROR: 0 .. contents:: :depth: 2 FAIL: commandtest ================= TEST: commandtest ..!!!!!!!!!!!!!!....!!..!. 26 FAIL FAIL commandtest (exit status: 1) SKIP: virsh-optparse ==================== ../../tests/virsh-optparse: skipping test: This test is very expensive, so it is disabled by default. To run it anyway, rerun: make check VIR_TEST_EXPENSIVE=1 SKIP virsh-optparse (exit status: 77) + exit 1 Build step 'Execute shell' marked build as failure

See <https://ci.centos.org/job/libvirt-master-check/systems=libvirt-fedora-23/637/display/redirect> ------------------------------------------ [...truncated 22.59 KB...] CCLD test-strerror CCLD test-strerror_r CCLD test-string CCLD test-strings CCLD test-strnlen CCLD test-symlink CCLD test-sys_ioctl CCLD test-sys_select CCLD test-sys_socket CCLD test-sys_stat CCLD test-sys_time CCLD test-sys_types CCLD test-sys_uio CCLD test-sys_utsname CCLD test-sys_wait CCLD test-termios CCLD test-thread_self CCLD test-time CCLD test-thread_create CCLD test-ttyname_r CCLD test-uname CCLD test-unistd CCLD test-unlockpt CCLD test-unsetenv CCLD test-usleep CCLD test-vasnprintf CCLD test-vasprintf CCLD test-verify CCLD test-vsnprintf CCLD test-wchar CCLD test-wcrtomb CCLD test-wcrtomb-w32 CCLD test-wctype-h CCLD test-write CCLD test-xalloc-die make[4]: Leaving directory '<https://ci.centos.org/job/libvirt-master-check/systems=libvirt-fedora-23/ws/build/gnulib/tests'> make check-TESTS make[4]: Entering directory '<https://ci.centos.org/job/libvirt-master-check/systems=libvirt-fedora-23/ws/build/gnulib/tests'> make[5]: Entering directory '<https://ci.centos.org/job/libvirt-master-check/systems=libvirt-fedora-23/ws/build/gnulib/tests'> ============================================================================ Testsuite summary for libvirt 3.8.0 ============================================================================ # TOTAL: 0 # PASS: 0 # SKIP: 0 # XFAIL: 0 # FAIL: 0 # XPASS: 0 # ERROR: 0 ============================================================================ make[5]: Leaving directory '<https://ci.centos.org/job/libvirt-master-check/systems=libvirt-fedora-23/ws/build/gnulib/tests'> make[4]: Leaving directory '<https://ci.centos.org/job/libvirt-master-check/systems=libvirt-fedora-23/ws/build/gnulib/tests'> make[3]: Leaving directory '<https://ci.centos.org/job/libvirt-master-check/systems=libvirt-fedora-23/ws/build/gnulib/tests'> make[2]: Leaving directory '<https://ci.centos.org/job/libvirt-master-check/systems=libvirt-fedora-23/ws/build/gnulib/tests'> make[1]: Leaving directory '<https://ci.centos.org/job/libvirt-master-check/systems=libvirt-fedora-23/ws/build/gnulib/tests'> Making check in tests make[1]: Entering directory '<https://ci.centos.org/job/libvirt-master-check/systems=libvirt-fedora-23/ws/build/tests'> make make[2]: Entering directory '<https://ci.centos.org/job/libvirt-master-check/systems=libvirt-fedora-23/ws/build/tests'> make[2]: Nothing to be done for 'all'. make[2]: Leaving directory '<https://ci.centos.org/job/libvirt-master-check/systems=libvirt-fedora-23/ws/build/tests'> make check-TESTS make[2]: Entering directory '<https://ci.centos.org/job/libvirt-master-check/systems=libvirt-fedora-23/ws/build/tests'> make[3]: Entering directory '<https://ci.centos.org/job/libvirt-master-check/systems=libvirt-fedora-23/ws/build/tests'> PASS: sockettest PASS: virhostcputest PASS: virbuftest PASS: seclabeltest FAIL: commandtest PASS: virhashtest PASS: virconftest PASS: viratomictest PASS: shunloadtest PASS: utiltest PASS: virtimetest PASS: viruritest PASS: virkeyfiletest PASS: viralloctest PASS: virauthconfigtest PASS: virbitmaptest PASS: vircgrouptest PASS: vircryptotest PASS: virendiantest PASS: virpcitest PASS: virfilecachetest PASS: virfiletest PASS: virfirewalltest PASS: viriscsitest PASS: virshtest PASS: virkeycodetest PASS: virlockspacetest PASS: virrotatingfiletest PASS: virlogtest PASS: virstringtest PASS: virportallocatortest PASS: sysinfotest PASS: virkmodtest PASS: vircapstest PASS: domainconftest PASS: domaincapstest PASS: virhostdevtest PASS: virnetdevtest PASS: virtypedparamtest PASS: virnetmessagetest PASS: virschematest PASS: virnetsockettest PASS: virnetserverclienttest PASS: virnetdaemontest PASS: fchosttest PASS: scsihosttest PASS: virnettlssessiontest PASS: vircaps2xmltest PASS: fdstreamtest PASS: virnettlscontexttest PASS: virdbustest PASS: virsystemdtest PASS: virpolkittest PASS: securityselinuxtest PASS: viridentitytest PASS: xml2sexprtest PASS: sexpr2xmltest PASS: securityselinuxlabeltest PASS: xmconfigtest PASS: xencapstest PASS: libxlxml2domconfigtest PASS: qemuxml2argvtest PASS: qemuargv2xmltest PASS: qemuxml2xmltest PASS: qemuhelptest PASS: domainsnapshotxml2xmltest PASS: qemumonitortest PASS: qemumonitorjsontest PASS: qemuhotplugtest PASS: qemuagenttest PASS: qemucaps2xmltest PASS: qemucapabilitiestest PASS: qemucommandutiltest PASS: qemumemlocktest PASS: lxcconf2xmltest PASS: lxcxml2xmltest PASS: openvzutilstest PASS: esxutilstest PASS: vboxsnapshotxmltest PASS: vmx2xmltest PASS: xml2vmxtest PASS: vmwarevertest PASS: networkxml2xmltest PASS: virjsontest PASS: networkxml2xmlupdatetest PASS: networkxml2conftest PASS: networkxml2firewalltest PASS: storagebackendsheepdogtest PASS: xlconfigtest PASS: nwfilterxml2xmltest PASS: nwfilterebiptablestest PASS: nwfilterxml2firewalltest PASS: virstorageutiltest PASS: storagevolxml2argvtest PASS: virscsitest PASS: nsstest PASS: nssguesttest PASS: storagepoolxml2xmltest PASS: storagevolxml2xmltest PASS: nodedevxml2xmltest PASS: interfacexml2xmltest PASS: virstoragetest PASS: metadatatest PASS: secretxml2xmltest PASS: genericxml2xmltest PASS: cputest PASS: virusbtest PASS: virnetdevbandwidthtest PASS: virdrivermoduletest PASS: eventtest PASS: objecteventtest PASS: libvirtd-pool PASS: virmacmaptest PASS: virsh-define-dev-segfault PASS: virsh-cpuset PASS: libvirtd-fail SKIP: virsh-optparse PASS: virsh-int-overflow PASS: virsh-schedinfo PASS: virsh-read-bufsiz PASS: virsh-self-test PASS: virsh-read-non-seekable PASS: virsh-start PASS: virt-admin-self-test PASS: virsh-undefine PASS: virsh-uriprecedence PASS: virsh-vcpupin ============================================================================ Testsuite summary for libvirt 3.8.0 ============================================================================ # TOTAL: 127 # PASS: 125 # SKIP: 1 # XFAIL: 0 # FAIL: 1 # XPASS: 0 # ERROR: 0 ============================================================================ See tests/test-suite.log Please report to libvir-list@redhat.com ============================================================================ Makefile:5992: recipe for target 'test-suite.log' failed make[3]: *** [test-suite.log] Error 1 make[3]: Leaving directory '<https://ci.centos.org/job/libvirt-master-check/systems=libvirt-fedora-23/ws/build/tests'> Makefile:6098: recipe for target 'check-TESTS' failed make[2]: *** [check-TESTS] Error 2 make[2]: Leaving directory '<https://ci.centos.org/job/libvirt-master-check/systems=libvirt-fedora-23/ws/build/tests'> Makefile:7088: recipe for target 'check-am' failed make[1]: *** [check-am] Error 2 make[1]: Leaving directory '<https://ci.centos.org/job/libvirt-master-check/systems=libvirt-fedora-23/ws/build/tests'> Makefile:2114: recipe for target 'check-recursive' failed make: *** [check-recursive] Error 1 + cat tests/test-suite.log ========================================= libvirt 3.8.0: tests/test-suite.log ========================================= # TOTAL: 127 # PASS: 125 # SKIP: 1 # XFAIL: 0 # FAIL: 1 # XPASS: 0 # ERROR: 0 .. contents:: :depth: 2 FAIL: commandtest ================= TEST: commandtest ..!!!!!!!!!!!!!!....!!..!. 26 FAIL FAIL commandtest (exit status: 1) SKIP: virsh-optparse ==================== ../../tests/virsh-optparse: skipping test: This test is very expensive, so it is disabled by default. To run it anyway, rerun: make check VIR_TEST_EXPENSIVE=1 SKIP virsh-optparse (exit status: 77) + exit 1 Build step 'Execute shell' marked build as failure

See <https://ci.centos.org/job/libvirt-master-check/systems=libvirt-fedora-23/638/display/redirect> ------------------------------------------ [...truncated 22.62 KB...] CCLD test-strerror CCLD test-strerror_r CCLD test-string CCLD test-strings CCLD test-strnlen CCLD test-symlink CCLD test-sys_ioctl CCLD test-sys_select CCLD test-sys_socket CCLD test-sys_stat CCLD test-sys_time CCLD test-sys_types CCLD test-sys_uio CCLD test-sys_utsname CCLD test-sys_wait CCLD test-termios CCLD test-thread_self CCLD test-thread_create CCLD test-time CCLD test-ttyname_r CCLD test-uname CCLD test-unistd CCLD test-unlockpt CCLD test-unsetenv CCLD test-usleep CCLD test-vasnprintf CCLD test-vasprintf CCLD test-verify CCLD test-vsnprintf CCLD test-wchar CCLD test-wcrtomb CCLD test-wcrtomb-w32 CCLD test-wctype-h CCLD test-write CCLD test-xalloc-die make[4]: Leaving directory '<https://ci.centos.org/job/libvirt-master-check/systems=libvirt-fedora-23/ws/build/gnulib/tests'> make check-TESTS make[4]: Entering directory '<https://ci.centos.org/job/libvirt-master-check/systems=libvirt-fedora-23/ws/build/gnulib/tests'> make[5]: Entering directory '<https://ci.centos.org/job/libvirt-master-check/systems=libvirt-fedora-23/ws/build/gnulib/tests'> ============================================================================ Testsuite summary for libvirt 3.8.0 ============================================================================ # TOTAL: 0 # PASS: 0 # SKIP: 0 # XFAIL: 0 # FAIL: 0 # XPASS: 0 # ERROR: 0 ============================================================================ make[5]: Leaving directory '<https://ci.centos.org/job/libvirt-master-check/systems=libvirt-fedora-23/ws/build/gnulib/tests'> make[4]: Leaving directory '<https://ci.centos.org/job/libvirt-master-check/systems=libvirt-fedora-23/ws/build/gnulib/tests'> make[3]: Leaving directory '<https://ci.centos.org/job/libvirt-master-check/systems=libvirt-fedora-23/ws/build/gnulib/tests'> make[2]: Leaving directory '<https://ci.centos.org/job/libvirt-master-check/systems=libvirt-fedora-23/ws/build/gnulib/tests'> make[1]: Leaving directory '<https://ci.centos.org/job/libvirt-master-check/systems=libvirt-fedora-23/ws/build/gnulib/tests'> Making check in tests make[1]: Entering directory '<https://ci.centos.org/job/libvirt-master-check/systems=libvirt-fedora-23/ws/build/tests'> make make[2]: Entering directory '<https://ci.centos.org/job/libvirt-master-check/systems=libvirt-fedora-23/ws/build/tests'> make[2]: Nothing to be done for 'all'. make[2]: Leaving directory '<https://ci.centos.org/job/libvirt-master-check/systems=libvirt-fedora-23/ws/build/tests'> make check-TESTS make[2]: Entering directory '<https://ci.centos.org/job/libvirt-master-check/systems=libvirt-fedora-23/ws/build/tests'> make[3]: Entering directory '<https://ci.centos.org/job/libvirt-master-check/systems=libvirt-fedora-23/ws/build/tests'> PASS: sockettest PASS: virhostcputest PASS: virbuftest PASS: seclabeltest FAIL: commandtest PASS: virhashtest PASS: virconftest PASS: viratomictest PASS: shunloadtest PASS: utiltest PASS: virtimetest PASS: viruritest PASS: virkeyfiletest PASS: viralloctest PASS: virauthconfigtest PASS: virbitmaptest PASS: vircgrouptest PASS: vircryptotest PASS: virendiantest PASS: virpcitest PASS: virfilecachetest PASS: virfiletest PASS: virshtest PASS: virfirewalltest PASS: viriscsitest PASS: virkeycodetest PASS: virlockspacetest PASS: virlogtest PASS: virrotatingfiletest PASS: virstringtest PASS: virportallocatortest PASS: sysinfotest PASS: virkmodtest PASS: vircapstest PASS: domaincapstest PASS: domainconftest PASS: virhostdevtest PASS: virnetdevtest PASS: virtypedparamtest PASS: virnetmessagetest PASS: virschematest PASS: virnetsockettest PASS: virnetdaemontest PASS: virnetserverclienttest PASS: fchosttest PASS: virnettlssessiontest PASS: scsihosttest PASS: vircaps2xmltest PASS: fdstreamtest PASS: virnettlscontexttest PASS: virdbustest PASS: virsystemdtest PASS: virpolkittest PASS: securityselinuxtest PASS: viridentitytest PASS: xml2sexprtest PASS: sexpr2xmltest PASS: securityselinuxlabeltest PASS: xmconfigtest PASS: xencapstest PASS: libxlxml2domconfigtest PASS: qemuxml2argvtest PASS: qemuargv2xmltest PASS: qemuxml2xmltest PASS: qemuhelptest PASS: domainsnapshotxml2xmltest PASS: qemumonitortest PASS: qemumonitorjsontest PASS: qemuhotplugtest PASS: qemuagenttest PASS: qemucaps2xmltest PASS: qemucapabilitiestest PASS: qemumemlocktest PASS: qemucommandutiltest PASS: lxcxml2xmltest PASS: lxcconf2xmltest PASS: openvzutilstest PASS: esxutilstest PASS: vboxsnapshotxmltest PASS: vmx2xmltest PASS: xml2vmxtest PASS: vmwarevertest PASS: virjsontest PASS: networkxml2xmltest PASS: networkxml2xmlupdatetest PASS: networkxml2conftest PASS: xlconfigtest PASS: networkxml2firewalltest PASS: storagebackendsheepdogtest PASS: nwfilterxml2xmltest PASS: nwfilterebiptablestest PASS: nwfilterxml2firewalltest PASS: virstorageutiltest PASS: storagevolxml2argvtest PASS: virscsitest PASS: nsstest PASS: nssguesttest PASS: storagevolxml2xmltest PASS: storagepoolxml2xmltest PASS: nodedevxml2xmltest PASS: interfacexml2xmltest PASS: virstoragetest PASS: metadatatest PASS: secretxml2xmltest PASS: cputest PASS: genericxml2xmltest PASS: virusbtest PASS: virnetdevbandwidthtest PASS: eventtest PASS: virdrivermoduletest PASS: objecteventtest PASS: libvirtd-pool PASS: virmacmaptest PASS: virsh-cpuset PASS: virsh-define-dev-segfault PASS: libvirtd-fail PASS: virsh-int-overflow SKIP: virsh-optparse PASS: virsh-schedinfo PASS: virsh-read-non-seekable PASS: virsh-read-bufsiz PASS: virsh-self-test PASS: virsh-start PASS: virsh-undefine PASS: virt-admin-self-test PASS: virsh-uriprecedence PASS: virsh-vcpupin ============================================================================ Testsuite summary for libvirt 3.8.0 ============================================================================ # TOTAL: 127 # PASS: 125 # SKIP: 1 # XFAIL: 0 # FAIL: 1 # XPASS: 0 # ERROR: 0 ============================================================================ See tests/test-suite.log Please report to libvir-list@redhat.com ============================================================================ Makefile:5992: recipe for target 'test-suite.log' failed make[3]: *** [test-suite.log] Error 1 make[3]: Leaving directory '<https://ci.centos.org/job/libvirt-master-check/systems=libvirt-fedora-23/ws/build/tests'> Makefile:6098: recipe for target 'check-TESTS' failed make[2]: *** [check-TESTS] Error 2 make[2]: Leaving directory '<https://ci.centos.org/job/libvirt-master-check/systems=libvirt-fedora-23/ws/build/tests'> Makefile:7088: recipe for target 'check-am' failed make[1]: *** [check-am] Error 2 make[1]: Leaving directory '<https://ci.centos.org/job/libvirt-master-check/systems=libvirt-fedora-23/ws/build/tests'> Makefile:2114: recipe for target 'check-recursive' failed make: *** [check-recursive] Error 1 + cat tests/test-suite.log ========================================= libvirt 3.8.0: tests/test-suite.log ========================================= # TOTAL: 127 # PASS: 125 # SKIP: 1 # XFAIL: 0 # FAIL: 1 # XPASS: 0 # ERROR: 0 .. contents:: :depth: 2 FAIL: commandtest ================= TEST: commandtest ..!!!!!!!!!!!!!!....!!..!. 26 FAIL FAIL commandtest (exit status: 1) SKIP: virsh-optparse ==================== ../../tests/virsh-optparse: skipping test: This test is very expensive, so it is disabled by default. To run it anyway, rerun: make check VIR_TEST_EXPENSIVE=1 SKIP virsh-optparse (exit status: 77) + exit 1 Build step 'Execute shell' marked build as failure

See <https://ci.centos.org/job/libvirt-master-check/systems=libvirt-fedora-23/639/display/redirect> ------------------------------------------ [...truncated 22.56 KB...] CCLD test-strerror CCLD test-strerror_r CCLD test-string CCLD test-strings CCLD test-strnlen CCLD test-symlink CCLD test-sys_ioctl CCLD test-sys_select CCLD test-sys_socket CCLD test-sys_stat CCLD test-sys_time CCLD test-sys_types CCLD test-sys_uio CCLD test-sys_utsname CCLD test-sys_wait CCLD test-termios CCLD test-thread_self CCLD test-thread_create CCLD test-time CCLD test-ttyname_r CCLD test-uname CCLD test-unistd CCLD test-unlockpt CCLD test-unsetenv CCLD test-vasnprintf CCLD test-usleep CCLD test-vasprintf CCLD test-verify CCLD test-vsnprintf CCLD test-wchar CCLD test-wcrtomb CCLD test-wcrtomb-w32 CCLD test-wctype-h CCLD test-write CCLD test-xalloc-die make[4]: Leaving directory '<https://ci.centos.org/job/libvirt-master-check/systems=libvirt-fedora-23/ws/build/gnulib/tests'> make check-TESTS make[4]: Entering directory '<https://ci.centos.org/job/libvirt-master-check/systems=libvirt-fedora-23/ws/build/gnulib/tests'> make[5]: Entering directory '<https://ci.centos.org/job/libvirt-master-check/systems=libvirt-fedora-23/ws/build/gnulib/tests'> ============================================================================ Testsuite summary for libvirt 3.8.0 ============================================================================ # TOTAL: 0 # PASS: 0 # SKIP: 0 # XFAIL: 0 # FAIL: 0 # XPASS: 0 # ERROR: 0 ============================================================================ make[5]: Leaving directory '<https://ci.centos.org/job/libvirt-master-check/systems=libvirt-fedora-23/ws/build/gnulib/tests'> make[4]: Leaving directory '<https://ci.centos.org/job/libvirt-master-check/systems=libvirt-fedora-23/ws/build/gnulib/tests'> make[3]: Leaving directory '<https://ci.centos.org/job/libvirt-master-check/systems=libvirt-fedora-23/ws/build/gnulib/tests'> make[2]: Leaving directory '<https://ci.centos.org/job/libvirt-master-check/systems=libvirt-fedora-23/ws/build/gnulib/tests'> make[1]: Leaving directory '<https://ci.centos.org/job/libvirt-master-check/systems=libvirt-fedora-23/ws/build/gnulib/tests'> Making check in tests make[1]: Entering directory '<https://ci.centos.org/job/libvirt-master-check/systems=libvirt-fedora-23/ws/build/tests'> make make[2]: Entering directory '<https://ci.centos.org/job/libvirt-master-check/systems=libvirt-fedora-23/ws/build/tests'> make[2]: Nothing to be done for 'all'. make[2]: Leaving directory '<https://ci.centos.org/job/libvirt-master-check/systems=libvirt-fedora-23/ws/build/tests'> make check-TESTS make[2]: Entering directory '<https://ci.centos.org/job/libvirt-master-check/systems=libvirt-fedora-23/ws/build/tests'> make[3]: Entering directory '<https://ci.centos.org/job/libvirt-master-check/systems=libvirt-fedora-23/ws/build/tests'> PASS: sockettest PASS: virhostcputest PASS: virbuftest PASS: seclabeltest FAIL: commandtest PASS: virconftest PASS: virhashtest PASS: viratomictest PASS: utiltest PASS: shunloadtest PASS: viruritest PASS: virtimetest PASS: viralloctest PASS: virkeyfiletest PASS: virauthconfigtest PASS: virbitmaptest PASS: vircryptotest PASS: vircgrouptest PASS: virpcitest PASS: virendiantest PASS: virfilecachetest PASS: virfiletest PASS: virfirewalltest PASS: viriscsitest PASS: virkeycodetest PASS: virlockspacetest PASS: virshtest PASS: virlogtest PASS: virrotatingfiletest PASS: virstringtest PASS: virportallocatortest PASS: sysinfotest PASS: virkmodtest PASS: vircapstest PASS: domainconftest PASS: domaincapstest PASS: virnetdevtest PASS: virhostdevtest PASS: virschematest PASS: virtypedparamtest PASS: virnetmessagetest PASS: virnetsockettest PASS: virnetdaemontest PASS: virnetserverclienttest PASS: fchosttest PASS: scsihosttest PASS: virnettlssessiontest PASS: fdstreamtest PASS: vircaps2xmltest PASS: virdbustest PASS: virsystemdtest PASS: virnettlscontexttest PASS: virpolkittest PASS: securityselinuxtest PASS: viridentitytest PASS: xml2sexprtest PASS: securityselinuxlabeltest PASS: sexpr2xmltest PASS: xencapstest PASS: xmconfigtest PASS: libxlxml2domconfigtest PASS: qemuxml2argvtest PASS: qemuargv2xmltest PASS: qemuxml2xmltest PASS: qemuhelptest PASS: domainsnapshotxml2xmltest PASS: qemumonitortest PASS: qemumonitorjsontest PASS: qemuhotplugtest PASS: qemuagenttest PASS: qemucapabilitiestest PASS: qemucaps2xmltest PASS: qemumemlocktest PASS: qemucommandutiltest PASS: lxcxml2xmltest PASS: lxcconf2xmltest PASS: openvzutilstest PASS: esxutilstest PASS: vboxsnapshotxmltest PASS: vmx2xmltest PASS: vmwarevertest PASS: xml2vmxtest PASS: virjsontest PASS: networkxml2xmltest PASS: networkxml2xmlupdatetest PASS: networkxml2conftest PASS: networkxml2firewalltest PASS: storagebackendsheepdogtest PASS: nwfilterxml2xmltest PASS: xlconfigtest PASS: nwfilterebiptablestest PASS: nwfilterxml2firewalltest PASS: virstorageutiltest PASS: storagevolxml2argvtest PASS: virscsitest PASS: nsstest PASS: nssguesttest PASS: storagevolxml2xmltest PASS: storagepoolxml2xmltest PASS: nodedevxml2xmltest PASS: interfacexml2xmltest PASS: virstoragetest PASS: metadatatest PASS: secretxml2xmltest PASS: cputest PASS: genericxml2xmltest PASS: virusbtest PASS: virnetdevbandwidthtest PASS: eventtest PASS: virdrivermoduletest PASS: objecteventtest PASS: virmacmaptest PASS: libvirtd-pool PASS: virsh-cpuset PASS: virsh-define-dev-segfault PASS: libvirtd-fail SKIP: virsh-optparse PASS: virsh-int-overflow PASS: virsh-read-non-seekable PASS: virsh-schedinfo PASS: virsh-self-test PASS: virsh-read-bufsiz PASS: virsh-start PASS: virt-admin-self-test PASS: virsh-undefine PASS: virsh-uriprecedence PASS: virsh-vcpupin ============================================================================ Testsuite summary for libvirt 3.8.0 ============================================================================ # TOTAL: 127 # PASS: 125 # SKIP: 1 # XFAIL: 0 # FAIL: 1 # XPASS: 0 # ERROR: 0 ============================================================================ See tests/test-suite.log Please report to libvir-list@redhat.com ============================================================================ Makefile:5992: recipe for target 'test-suite.log' failed make[3]: *** [test-suite.log] Error 1 make[3]: Leaving directory '<https://ci.centos.org/job/libvirt-master-check/systems=libvirt-fedora-23/ws/build/tests'> Makefile:6098: recipe for target 'check-TESTS' failed make[2]: *** [check-TESTS] Error 2 make[2]: Leaving directory '<https://ci.centos.org/job/libvirt-master-check/systems=libvirt-fedora-23/ws/build/tests'> Makefile:7088: recipe for target 'check-am' failed make[1]: *** [check-am] Error 2 make[1]: Leaving directory '<https://ci.centos.org/job/libvirt-master-check/systems=libvirt-fedora-23/ws/build/tests'> Makefile:2114: recipe for target 'check-recursive' failed make: *** [check-recursive] Error 1 + cat tests/test-suite.log ========================================= libvirt 3.8.0: tests/test-suite.log ========================================= # TOTAL: 127 # PASS: 125 # SKIP: 1 # XFAIL: 0 # FAIL: 1 # XPASS: 0 # ERROR: 0 .. contents:: :depth: 2 FAIL: commandtest ================= TEST: commandtest ..!!!!!!!!!!!!!!....!!..!. 26 FAIL FAIL commandtest (exit status: 1) SKIP: virsh-optparse ==================== ../../tests/virsh-optparse: skipping test: This test is very expensive, so it is disabled by default. To run it anyway, rerun: make check VIR_TEST_EXPENSIVE=1 SKIP virsh-optparse (exit status: 77) + exit 1 Build step 'Execute shell' marked build as failure

participants (1)
-
ci@centos.org