[Libvirt-ci] Build failed in Jenkins: libvirt-go-check » libvirt-fedora-rawhide #921

See <https://ci.centos.org/job/libvirt-go-check/systems=libvirt-fedora-rawhide/921/display/redirect> ------------------------------------------ Started by upstream project "libvirt-go-check" build number 921 originally caused by: Started by upstream project "libvirt-go-build" build number 935 originally caused by: Started by upstream project "libvirt-build" build number 1107 originally caused by: Started by an SCM change Running as SYSTEM [EnvInject] - Loading node environment variables. Building remotely on libvirt-fedora-rawhide (libvirt) in workspace <https://ci.centos.org/job/libvirt-go-check/systems=libvirt-fedora-rawhide/ws/> [libvirt-go] $ /bin/sh -xe /tmp/jenkins15456414896028373189.sh + export 'TEST_ARGS=-tags api' + TEST_ARGS='-tags api' + go test -tags api Missing enum 'VIR_DOMAIN_GET_HOSTNAME_AGENT' Missing enum 'VIR_DOMAIN_GET_HOSTNAME_LEASE' Missing enum 'VIR_ERR_NO_HOSTNAME' --- FAIL: TestAPICoverage (1.09s) panic: Missing symbols found [recovered] panic: Missing symbols found goroutine 7 [running]: testing.tRunner.func1(0xc0000a8100) /usr/lib/golang/src/testing/testing.go:874 +0x3a3 panic(0x5df9a0, 0x65c8f0) /usr/lib/golang/src/runtime/panic.go:679 +0x1b2 _<https://ci.centos.org/job/libvirt-go-check/systems=libvirt-fedora-rawhide/ws/.TestAPICoverage(0xc0000a8100)> <https://ci.centos.org/job/libvirt-go-check/systems=libvirt-fedora-rawhide/ws/api_test.go>:503 +0x551 testing.tRunner(0xc0000a8100, 0x635850) /usr/lib/golang/src/testing/testing.go:909 +0xc9 created by testing.(*T).Run /usr/lib/golang/src/testing/testing.go:960 +0x350 exit status 2 FAIL _<https://ci.centos.org/job/libvirt-go-check/systems=libvirt-fedora-rawhide/ws/> 1.335s Build step 'Execute shell' marked build as failure

See <https://ci.centos.org/job/libvirt-go-check/systems=libvirt-fedora-rawhide/922/display/redirect> ------------------------------------------ Started by upstream project "libvirt-go-check" build number 922 originally caused by: Started by upstream project "libvirt-go-build" build number 936 originally caused by: Started by upstream project "libvirt-build" build number 1108 originally caused by: Started by an SCM change Started by an SCM change Started by an SCM change Started by an SCM change Started by an SCM change Started by an SCM change Started by an SCM change Running as SYSTEM [EnvInject] - Loading node environment variables. Building remotely on libvirt-fedora-rawhide (libvirt) in workspace <https://ci.centos.org/job/libvirt-go-check/systems=libvirt-fedora-rawhide/ws/> [libvirt-go] $ /bin/sh -xe /tmp/jenkins7136542418802054437.sh + export 'TEST_ARGS=-tags api' + TEST_ARGS='-tags api' + go test -tags api Missing enum 'VIR_DOMAIN_GET_HOSTNAME_AGENT' Missing enum 'VIR_DOMAIN_GET_HOSTNAME_LEASE' Missing enum 'VIR_ERR_NO_HOSTNAME' --- FAIL: TestAPICoverage (1.49s) panic: Missing symbols found [recovered] panic: Missing symbols found goroutine 7 [running]: testing.tRunner.func1(0xc0000a8100) /usr/lib/golang/src/testing/testing.go:874 +0x3a3 panic(0x5df9a0, 0x65c8f0) /usr/lib/golang/src/runtime/panic.go:679 +0x1b2 _<https://ci.centos.org/job/libvirt-go-check/systems=libvirt-fedora-rawhide/ws/.TestAPICoverage(0xc0000a8100)> <https://ci.centos.org/job/libvirt-go-check/systems=libvirt-fedora-rawhide/ws/api_test.go>:503 +0x551 testing.tRunner(0xc0000a8100, 0x635850) /usr/lib/golang/src/testing/testing.go:909 +0xc9 created by testing.(*T).Run /usr/lib/golang/src/testing/testing.go:960 +0x350 exit status 2 FAIL _<https://ci.centos.org/job/libvirt-go-check/systems=libvirt-fedora-rawhide/ws/> 2.016s Build step 'Execute shell' marked build as failure

See <https://ci.centos.org/job/libvirt-go-check/systems=libvirt-fedora-rawhide/923/display/redirect> ------------------------------------------ Started by upstream project "libvirt-go-check" build number 923 originally caused by: Started by upstream project "libvirt-go-build" build number 937 originally caused by: Started by upstream project "libvirt-build" build number 1109 originally caused by: Started by an SCM change Running as SYSTEM [EnvInject] - Loading node environment variables. Building remotely on libvirt-fedora-rawhide (libvirt) in workspace <https://ci.centos.org/job/libvirt-go-check/systems=libvirt-fedora-rawhide/ws/> [libvirt-go] $ /bin/sh -xe /tmp/jenkins18396576229212549882.sh + export 'TEST_ARGS=-tags api' + TEST_ARGS='-tags api' + go test -tags api Missing enum 'VIR_DOMAIN_GET_HOSTNAME_AGENT' Missing enum 'VIR_DOMAIN_GET_HOSTNAME_LEASE' Missing enum 'VIR_ERR_NO_HOSTNAME' --- FAIL: TestAPICoverage (0.94s) panic: Missing symbols found [recovered] panic: Missing symbols found goroutine 20 [running]: testing.tRunner.func1(0xc0000c8100) /usr/lib/golang/src/testing/testing.go:874 +0x3a3 panic(0x5df9a0, 0x65c8f0) /usr/lib/golang/src/runtime/panic.go:679 +0x1b2 _<https://ci.centos.org/job/libvirt-go-check/systems=libvirt-fedora-rawhide/ws/.TestAPICoverage(0xc0000c8100)> <https://ci.centos.org/job/libvirt-go-check/systems=libvirt-fedora-rawhide/ws/api_test.go>:503 +0x551 testing.tRunner(0xc0000c8100, 0x635850) /usr/lib/golang/src/testing/testing.go:909 +0xc9 created by testing.(*T).Run /usr/lib/golang/src/testing/testing.go:960 +0x350 exit status 2 FAIL _<https://ci.centos.org/job/libvirt-go-check/systems=libvirt-fedora-rawhide/ws/> 1.135s Build step 'Execute shell' marked build as failure

See <https://ci.centos.org/job/libvirt-go-check/systems=libvirt-fedora-rawhide/924/display/redirect> ------------------------------------------ Started by upstream project "libvirt-go-check" build number 924 originally caused by: Started by upstream project "libvirt-go-build" build number 938 originally caused by: Started by upstream project "libvirt-build" build number 1110 originally caused by: Started by an SCM change Started by an SCM change Started by an SCM change Started by an SCM change Started by an SCM change Running as SYSTEM [EnvInject] - Loading node environment variables. Building remotely on libvirt-fedora-rawhide (libvirt) in workspace <https://ci.centos.org/job/libvirt-go-check/systems=libvirt-fedora-rawhide/ws/> [libvirt-go] $ /bin/sh -xe /tmp/jenkins8003569720178367294.sh + export 'TEST_ARGS=-tags api' + TEST_ARGS='-tags api' + go test -tags api Missing enum 'VIR_DOMAIN_GET_HOSTNAME_AGENT' Missing enum 'VIR_DOMAIN_GET_HOSTNAME_LEASE' Missing enum 'VIR_ERR_NO_HOSTNAME' --- FAIL: TestAPICoverage (2.14s) panic: Missing symbols found [recovered] panic: Missing symbols found goroutine 20 [running]: testing.tRunner.func1(0xc0000c0100) /usr/lib/golang/src/testing/testing.go:874 +0x3a3 panic(0x5df9a0, 0x65c8f0) /usr/lib/golang/src/runtime/panic.go:679 +0x1b2 _<https://ci.centos.org/job/libvirt-go-check/systems=libvirt-fedora-rawhide/ws/.TestAPICoverage(0xc0000c0100)> <https://ci.centos.org/job/libvirt-go-check/systems=libvirt-fedora-rawhide/ws/api_test.go>:503 +0x551 testing.tRunner(0xc0000c0100, 0x635850) /usr/lib/golang/src/testing/testing.go:909 +0xc9 created by testing.(*T).Run /usr/lib/golang/src/testing/testing.go:960 +0x350 exit status 2 FAIL _<https://ci.centos.org/job/libvirt-go-check/systems=libvirt-fedora-rawhide/ws/> 2.417s Build step 'Execute shell' marked build as failure

See <https://ci.centos.org/job/libvirt-go-check/systems=libvirt-fedora-rawhide/925/display/redirect> ------------------------------------------ Started by upstream project "libvirt-go-check" build number 925 originally caused by: Started by upstream project "libvirt-go-build" build number 939 originally caused by: Started by an SCM change Running as SYSTEM [EnvInject] - Loading node environment variables. Building remotely on libvirt-fedora-rawhide (libvirt) in workspace <https://ci.centos.org/job/libvirt-go-check/systems=libvirt-fedora-rawhide/ws/> [libvirt-go] $ /bin/sh -xe /tmp/jenkins10273745968576251296.sh + export 'TEST_ARGS=-tags api' + TEST_ARGS='-tags api' + go test -tags api Missing enum 'VIR_DOMAIN_GET_HOSTNAME_AGENT' Missing enum 'VIR_DOMAIN_GET_HOSTNAME_LEASE' Missing enum 'VIR_ERR_NO_HOSTNAME' --- FAIL: TestAPICoverage (0.22s) panic: Missing symbols found [recovered] panic: Missing symbols found goroutine 20 [running]: testing.tRunner.func1(0xc0000c8100) /usr/lib/golang/src/testing/testing.go:874 +0x3a3 panic(0x5df9a0, 0x65c8f0) /usr/lib/golang/src/runtime/panic.go:679 +0x1b2 _<https://ci.centos.org/job/libvirt-go-check/systems=libvirt-fedora-rawhide/ws/.TestAPICoverage(0xc0000c8100)> <https://ci.centos.org/job/libvirt-go-check/systems=libvirt-fedora-rawhide/ws/api_test.go>:503 +0x551 testing.tRunner(0xc0000c8100, 0x635850) /usr/lib/golang/src/testing/testing.go:909 +0xc9 created by testing.(*T).Run /usr/lib/golang/src/testing/testing.go:960 +0x350 exit status 2 FAIL _<https://ci.centos.org/job/libvirt-go-check/systems=libvirt-fedora-rawhide/ws/> 0.270s Build step 'Execute shell' marked build as failure

See <https://ci.centos.org/job/libvirt-go-check/systems=libvirt-fedora-rawhide/926/display/redirect> ------------------------------------------ Started by upstream project "libvirt-go-check" build number 926 originally caused by: Started by upstream project "libvirt-go-build" build number 940 originally caused by: Started by upstream project "libvirt-build" build number 1114 originally caused by: Started by an SCM change Running as SYSTEM [EnvInject] - Loading node environment variables. Building remotely on libvirt-fedora-rawhide (libvirt) in workspace <https://ci.centos.org/job/libvirt-go-check/systems=libvirt-fedora-rawhide/ws/> [libvirt-go] $ /bin/sh -xe /tmp/jenkins10983314827118268657.sh + export 'TEST_ARGS=-tags api' + TEST_ARGS='-tags api' + go test -tags api Missing enum 'VIR_DOMAIN_GET_HOSTNAME_AGENT' Missing enum 'VIR_DOMAIN_GET_HOSTNAME_LEASE' Missing enum 'VIR_ERR_NO_HOSTNAME' --- FAIL: TestAPICoverage (0.66s) panic: Missing symbols found [recovered] panic: Missing symbols found goroutine 20 [running]: testing.tRunner.func1(0xc0000c8100) /usr/lib/golang/src/testing/testing.go:874 +0x3a3 panic(0x5df9a0, 0x65c8f0) /usr/lib/golang/src/runtime/panic.go:679 +0x1b2 _<https://ci.centos.org/job/libvirt-go-check/systems=libvirt-fedora-rawhide/ws/.TestAPICoverage(0xc0000c8100)> <https://ci.centos.org/job/libvirt-go-check/systems=libvirt-fedora-rawhide/ws/api_test.go>:503 +0x551 testing.tRunner(0xc0000c8100, 0x635850) /usr/lib/golang/src/testing/testing.go:909 +0xc9 created by testing.(*T).Run /usr/lib/golang/src/testing/testing.go:960 +0x350 exit status 2 FAIL _<https://ci.centos.org/job/libvirt-go-check/systems=libvirt-fedora-rawhide/ws/> 0.843s Build step 'Execute shell' marked build as failure

See <https://ci.centos.org/job/libvirt-go-check/systems=libvirt-fedora-rawhide/927/display/redirect> ------------------------------------------ Started by upstream project "libvirt-go-check" build number 927 originally caused by: Started by upstream project "libvirt-go-build" build number 941 originally caused by: Started by upstream project "libvirt-build" build number 1115 originally caused by: Started by an SCM change Started by an SCM change Started by an SCM change Started by an SCM change Started by an SCM change Started by an SCM change Started by an SCM change Running as SYSTEM [EnvInject] - Loading node environment variables. Building remotely on libvirt-fedora-rawhide (libvirt) in workspace <https://ci.centos.org/job/libvirt-go-check/systems=libvirt-fedora-rawhide/ws/> [libvirt-go] $ /bin/sh -xe /tmp/jenkins4745832060949214621.sh + export 'TEST_ARGS=-tags api' + TEST_ARGS='-tags api' + go test -tags api Missing enum 'VIR_DOMAIN_GET_HOSTNAME_AGENT' Missing enum 'VIR_DOMAIN_GET_HOSTNAME_LEASE' Missing enum 'VIR_ERR_NO_HOSTNAME' --- FAIL: TestAPICoverage (1.21s) panic: Missing symbols found [recovered] panic: Missing symbols found goroutine 7 [running]: testing.tRunner.func1(0xc0000a8100) /usr/lib/golang/src/testing/testing.go:874 +0x3a3 panic(0x5df9a0, 0x65c8f0) /usr/lib/golang/src/runtime/panic.go:679 +0x1b2 _<https://ci.centos.org/job/libvirt-go-check/systems=libvirt-fedora-rawhide/ws/.TestAPICoverage(0xc0000a8100)> <https://ci.centos.org/job/libvirt-go-check/systems=libvirt-fedora-rawhide/ws/api_test.go>:503 +0x551 testing.tRunner(0xc0000a8100, 0x635850) /usr/lib/golang/src/testing/testing.go:909 +0xc9 created by testing.(*T).Run /usr/lib/golang/src/testing/testing.go:960 +0x350 exit status 2 FAIL _<https://ci.centos.org/job/libvirt-go-check/systems=libvirt-fedora-rawhide/ws/> 1.421s Build step 'Execute shell' marked build as failure

See <https://ci.centos.org/job/libvirt-go-check/systems=libvirt-fedora-rawhide/928/display/redirect> ------------------------------------------ Started by upstream project "libvirt-go-check" build number 928 originally caused by: Started by upstream project "libvirt-go-build" build number 942 originally caused by: Started by upstream project "libvirt-build" build number 1116 originally caused by: Started by an SCM change Running as SYSTEM [EnvInject] - Loading node environment variables. Building remotely on libvirt-fedora-rawhide (libvirt) in workspace <https://ci.centos.org/job/libvirt-go-check/systems=libvirt-fedora-rawhide/ws/> [libvirt-go] $ /bin/sh -xe /tmp/jenkins16286983219472586123.sh + export 'TEST_ARGS=-tags api' + TEST_ARGS='-tags api' + go test -tags api Missing enum 'VIR_DOMAIN_GET_HOSTNAME_AGENT' Missing enum 'VIR_DOMAIN_GET_HOSTNAME_LEASE' Missing enum 'VIR_ERR_NO_HOSTNAME' --- FAIL: TestAPICoverage (1.74s) panic: Missing symbols found [recovered] panic: Missing symbols found goroutine 7 [running]: testing.tRunner.func1(0xc0000a8100) /usr/lib/golang/src/testing/testing.go:874 +0x3a3 panic(0x5df9a0, 0x65c8f0) /usr/lib/golang/src/runtime/panic.go:679 +0x1b2 _<https://ci.centos.org/job/libvirt-go-check/systems=libvirt-fedora-rawhide/ws/.TestAPICoverage(0xc0000a8100)> <https://ci.centos.org/job/libvirt-go-check/systems=libvirt-fedora-rawhide/ws/api_test.go>:503 +0x551 testing.tRunner(0xc0000a8100, 0x635850) /usr/lib/golang/src/testing/testing.go:909 +0xc9 created by testing.(*T).Run /usr/lib/golang/src/testing/testing.go:960 +0x350 exit status 2 FAIL _<https://ci.centos.org/job/libvirt-go-check/systems=libvirt-fedora-rawhide/ws/> 2.178s Build step 'Execute shell' marked build as failure

See <https://ci.centos.org/job/libvirt-go-check/systems=libvirt-fedora-rawhide/929/display/redirect> ------------------------------------------ Started by upstream project "libvirt-go-check" build number 929 originally caused by: Started by upstream project "libvirt-go-build" build number 943 originally caused by: Started by upstream project "libvirt-build" build number 1117 originally caused by: Started by an SCM change Running as SYSTEM [EnvInject] - Loading node environment variables. Building remotely on libvirt-fedora-rawhide (libvirt) in workspace <https://ci.centos.org/job/libvirt-go-check/systems=libvirt-fedora-rawhide/ws/> [libvirt-go] $ /bin/sh -xe /tmp/jenkins14773339716519448939.sh + export 'TEST_ARGS=-tags api' + TEST_ARGS='-tags api' + go test -tags api Missing enum 'VIR_DOMAIN_GET_HOSTNAME_AGENT' Missing enum 'VIR_DOMAIN_GET_HOSTNAME_LEASE' Missing enum 'VIR_ERR_NO_HOSTNAME' --- FAIL: TestAPICoverage (1.80s) panic: Missing symbols found [recovered] panic: Missing symbols found goroutine 7 [running]: testing.tRunner.func1(0xc0000a8100) /usr/lib/golang/src/testing/testing.go:874 +0x3a3 panic(0x5df9a0, 0x65c8f0) /usr/lib/golang/src/runtime/panic.go:679 +0x1b2 _<https://ci.centos.org/job/libvirt-go-check/systems=libvirt-fedora-rawhide/ws/.TestAPICoverage(0xc0000a8100)> <https://ci.centos.org/job/libvirt-go-check/systems=libvirt-fedora-rawhide/ws/api_test.go>:503 +0x551 testing.tRunner(0xc0000a8100, 0x635850) /usr/lib/golang/src/testing/testing.go:909 +0xc9 created by testing.(*T).Run /usr/lib/golang/src/testing/testing.go:960 +0x350 exit status 2 FAIL _<https://ci.centos.org/job/libvirt-go-check/systems=libvirt-fedora-rawhide/ws/> 2.587s Build step 'Execute shell' marked build as failure

See <https://ci.centos.org/job/libvirt-go-check/systems=libvirt-fedora-rawhide/930/display/redirect> ------------------------------------------ Started by upstream project "libvirt-go-check" build number 930 originally caused by: Started by upstream project "libvirt-go-build" build number 944 originally caused by: Started by upstream project "libvirt-build" build number 1118 originally caused by: Started by an SCM change Running as SYSTEM [EnvInject] - Loading node environment variables. Building remotely on libvirt-fedora-rawhide (libvirt) in workspace <https://ci.centos.org/job/libvirt-go-check/systems=libvirt-fedora-rawhide/ws/> [libvirt-go] $ /bin/sh -xe /tmp/jenkins10227749042480268445.sh + export 'TEST_ARGS=-tags api' + TEST_ARGS='-tags api' + go test -tags api Missing enum 'VIR_DOMAIN_GET_HOSTNAME_AGENT' Missing enum 'VIR_DOMAIN_GET_HOSTNAME_LEASE' Missing enum 'VIR_ERR_NO_HOSTNAME' --- FAIL: TestAPICoverage (0.60s) panic: Missing symbols found [recovered] panic: Missing symbols found goroutine 20 [running]: testing.tRunner.func1(0xc0000c8100) /usr/lib/golang/src/testing/testing.go:874 +0x3a3 panic(0x5df9a0, 0x65c8f0) /usr/lib/golang/src/runtime/panic.go:679 +0x1b2 _<https://ci.centos.org/job/libvirt-go-check/systems=libvirt-fedora-rawhide/ws/.TestAPICoverage(0xc0000c8100)> <https://ci.centos.org/job/libvirt-go-check/systems=libvirt-fedora-rawhide/ws/api_test.go>:503 +0x551 testing.tRunner(0xc0000c8100, 0x635850) /usr/lib/golang/src/testing/testing.go:909 +0xc9 created by testing.(*T).Run /usr/lib/golang/src/testing/testing.go:960 +0x350 exit status 2 FAIL _<https://ci.centos.org/job/libvirt-go-check/systems=libvirt-fedora-rawhide/ws/> 0.691s Build step 'Execute shell' marked build as failure

See <https://ci.centos.org/job/libvirt-go-check/systems=libvirt-fedora-rawhide/931/display/redirect> ------------------------------------------ Started by upstream project "libvirt-go-check" build number 931 originally caused by: Started by upstream project "libvirt-go-build" build number 945 originally caused by: Started by upstream project "libvirt-build" build number 1119 originally caused by: Started by an SCM change Running as SYSTEM [EnvInject] - Loading node environment variables. Building remotely on libvirt-fedora-rawhide (libvirt) in workspace <https://ci.centos.org/job/libvirt-go-check/systems=libvirt-fedora-rawhide/ws/> [libvirt-go] $ /bin/sh -xe /tmp/jenkins11079888595263988419.sh + export 'TEST_ARGS=-tags api' + TEST_ARGS='-tags api' + go test -tags api Missing enum 'VIR_DOMAIN_GET_HOSTNAME_AGENT' Missing enum 'VIR_DOMAIN_GET_HOSTNAME_LEASE' Missing enum 'VIR_ERR_NO_HOSTNAME' --- FAIL: TestAPICoverage (1.65s) panic: Missing symbols found [recovered] panic: Missing symbols found goroutine 7 [running]: testing.tRunner.func1(0xc0000a8100) /usr/lib/golang/src/testing/testing.go:874 +0x3a3 panic(0x5df9a0, 0x65c8f0) /usr/lib/golang/src/runtime/panic.go:679 +0x1b2 _<https://ci.centos.org/job/libvirt-go-check/systems=libvirt-fedora-rawhide/ws/.TestAPICoverage(0xc0000a8100)> <https://ci.centos.org/job/libvirt-go-check/systems=libvirt-fedora-rawhide/ws/api_test.go>:503 +0x551 testing.tRunner(0xc0000a8100, 0x635850) /usr/lib/golang/src/testing/testing.go:909 +0xc9 created by testing.(*T).Run /usr/lib/golang/src/testing/testing.go:960 +0x350 exit status 2 FAIL _<https://ci.centos.org/job/libvirt-go-check/systems=libvirt-fedora-rawhide/ws/> 1.890s Build step 'Execute shell' marked build as failure

See <https://ci.centos.org/job/libvirt-go-check/systems=libvirt-fedora-rawhide/932/display/redirect> ------------------------------------------ Started by upstream project "libvirt-go-check" build number 932 originally caused by: Started by upstream project "libvirt-go-build" build number 946 originally caused by: Started by upstream project "libvirt-build" build number 1120 originally caused by: Started by an SCM change Running as SYSTEM [EnvInject] - Loading node environment variables. Building remotely on libvirt-fedora-rawhide (libvirt) in workspace <https://ci.centos.org/job/libvirt-go-check/systems=libvirt-fedora-rawhide/ws/> [libvirt-go] $ /bin/sh -xe /tmp/jenkins12657913883850107515.sh + export 'TEST_ARGS=-tags api' + TEST_ARGS='-tags api' + go test -tags api Missing enum 'VIR_DOMAIN_GET_HOSTNAME_AGENT' Missing enum 'VIR_DOMAIN_GET_HOSTNAME_LEASE' Missing enum 'VIR_ERR_NO_HOSTNAME' --- FAIL: TestAPICoverage (1.76s) panic: Missing symbols found [recovered] panic: Missing symbols found goroutine 7 [running]: testing.tRunner.func1(0xc0000a8100) /usr/lib/golang/src/testing/testing.go:874 +0x3a3 panic(0x5df9a0, 0x65c8f0) /usr/lib/golang/src/runtime/panic.go:679 +0x1b2 _<https://ci.centos.org/job/libvirt-go-check/systems=libvirt-fedora-rawhide/ws/.TestAPICoverage(0xc0000a8100)> <https://ci.centos.org/job/libvirt-go-check/systems=libvirt-fedora-rawhide/ws/api_test.go>:503 +0x551 testing.tRunner(0xc0000a8100, 0x635850) /usr/lib/golang/src/testing/testing.go:909 +0xc9 created by testing.(*T).Run /usr/lib/golang/src/testing/testing.go:960 +0x350 exit status 2 FAIL _<https://ci.centos.org/job/libvirt-go-check/systems=libvirt-fedora-rawhide/ws/> 2.181s Build step 'Execute shell' marked build as failure

See <https://ci.centos.org/job/libvirt-go-check/systems=libvirt-fedora-rawhide/933/display/redirect> ------------------------------------------ Started by upstream project "libvirt-go-check" build number 933 originally caused by: Started by upstream project "libvirt-go-build" build number 947 originally caused by: Started by upstream project "libvirt-build" build number 1121 originally caused by: Started by an SCM change Running as SYSTEM [EnvInject] - Loading node environment variables. Building remotely on libvirt-fedora-rawhide (libvirt) in workspace <https://ci.centos.org/job/libvirt-go-check/systems=libvirt-fedora-rawhide/ws/> [libvirt-go] $ /bin/sh -xe /tmp/jenkins121038272880012852.sh + export 'TEST_ARGS=-tags api' + TEST_ARGS='-tags api' + go test -tags api Missing enum 'VIR_DOMAIN_GET_HOSTNAME_AGENT' Missing enum 'VIR_DOMAIN_GET_HOSTNAME_LEASE' Missing enum 'VIR_ERR_NO_HOSTNAME' --- FAIL: TestAPICoverage (2.04s) panic: Missing symbols found [recovered] panic: Missing symbols found goroutine 7 [running]: testing.tRunner.func1(0xc0000a8100) /usr/lib/golang/src/testing/testing.go:874 +0x3a3 panic(0x5df9a0, 0x65c8f0) /usr/lib/golang/src/runtime/panic.go:679 +0x1b2 _<https://ci.centos.org/job/libvirt-go-check/systems=libvirt-fedora-rawhide/ws/.TestAPICoverage(0xc0000a8100)> <https://ci.centos.org/job/libvirt-go-check/systems=libvirt-fedora-rawhide/ws/api_test.go>:503 +0x551 testing.tRunner(0xc0000a8100, 0x635850) /usr/lib/golang/src/testing/testing.go:909 +0xc9 created by testing.(*T).Run /usr/lib/golang/src/testing/testing.go:960 +0x350 exit status 2 FAIL _<https://ci.centos.org/job/libvirt-go-check/systems=libvirt-fedora-rawhide/ws/> 2.624s Build step 'Execute shell' marked build as failure

See <https://ci.centos.org/job/libvirt-go-check/systems=libvirt-fedora-rawhide/934/display/redirect> ------------------------------------------ Started by upstream project "libvirt-go-check" build number 934 originally caused by: Started by upstream project "libvirt-go-build" build number 948 originally caused by: Started by upstream project "libvirt-build" build number 1122 originally caused by: Started by an SCM change Running as SYSTEM [EnvInject] - Loading node environment variables. Building remotely on libvirt-fedora-rawhide (libvirt) in workspace <https://ci.centos.org/job/libvirt-go-check/systems=libvirt-fedora-rawhide/ws/> [libvirt-go] $ /bin/sh -xe /tmp/jenkins17508837924951628751.sh + export 'TEST_ARGS=-tags api' + TEST_ARGS='-tags api' + go test -tags api Missing enum 'VIR_DOMAIN_GET_HOSTNAME_AGENT' Missing enum 'VIR_DOMAIN_GET_HOSTNAME_LEASE' Missing enum 'VIR_ERR_NO_HOSTNAME' --- FAIL: TestAPICoverage (1.15s) panic: Missing symbols found [recovered] panic: Missing symbols found goroutine 6 [running]: testing.tRunner.func1(0xc0000c8100) /usr/lib/golang/src/testing/testing.go:874 +0x3a3 panic(0x5df9a0, 0x65c8f0) /usr/lib/golang/src/runtime/panic.go:679 +0x1b2 _<https://ci.centos.org/job/libvirt-go-check/systems=libvirt-fedora-rawhide/ws/.TestAPICoverage(0xc0000c8100)> <https://ci.centos.org/job/libvirt-go-check/systems=libvirt-fedora-rawhide/ws/api_test.go>:503 +0x551 testing.tRunner(0xc0000c8100, 0x635850) /usr/lib/golang/src/testing/testing.go:909 +0xc9 created by testing.(*T).Run /usr/lib/golang/src/testing/testing.go:960 +0x350 exit status 2 FAIL _<https://ci.centos.org/job/libvirt-go-check/systems=libvirt-fedora-rawhide/ws/> 1.379s Build step 'Execute shell' marked build as failure

See <https://ci.centos.org/job/libvirt-go-check/systems=libvirt-fedora-rawhide/935/display/redirect> ------------------------------------------ Started by upstream project "libvirt-go-check" build number 935 originally caused by: Started by upstream project "libvirt-go-build" build number 949 originally caused by: Started by upstream project "libvirt-build" build number 1123 originally caused by: Started by an SCM change Started by an SCM change Running as SYSTEM [EnvInject] - Loading node environment variables. Building remotely on libvirt-fedora-rawhide (libvirt) in workspace <https://ci.centos.org/job/libvirt-go-check/systems=libvirt-fedora-rawhide/ws/> [libvirt-go] $ /bin/sh -xe /tmp/jenkins16131864376811649944.sh + export 'TEST_ARGS=-tags api' + TEST_ARGS='-tags api' + go test -tags api Missing enum 'VIR_DOMAIN_GET_HOSTNAME_AGENT' Missing enum 'VIR_DOMAIN_GET_HOSTNAME_LEASE' Missing enum 'VIR_ERR_NO_HOSTNAME' --- FAIL: TestAPICoverage (2.00s) panic: Missing symbols found [recovered] panic: Missing symbols found goroutine 20 [running]: testing.tRunner.func1(0xc0000c0100) /usr/lib/golang/src/testing/testing.go:874 +0x3a3 panic(0x5df9a0, 0x65c8f0) /usr/lib/golang/src/runtime/panic.go:679 +0x1b2 _<https://ci.centos.org/job/libvirt-go-check/systems=libvirt-fedora-rawhide/ws/.TestAPICoverage(0xc0000c0100)> <https://ci.centos.org/job/libvirt-go-check/systems=libvirt-fedora-rawhide/ws/api_test.go>:503 +0x551 testing.tRunner(0xc0000c0100, 0x635850) /usr/lib/golang/src/testing/testing.go:909 +0xc9 created by testing.(*T).Run /usr/lib/golang/src/testing/testing.go:960 +0x350 exit status 2 FAIL _<https://ci.centos.org/job/libvirt-go-check/systems=libvirt-fedora-rawhide/ws/> 2.396s Build step 'Execute shell' marked build as failure

See <https://ci.centos.org/job/libvirt-go-check/systems=libvirt-fedora-rawhide/936/display/redirect> ------------------------------------------ Started by upstream project "libvirt-go-check" build number 936 originally caused by: Started by upstream project "libvirt-go-build" build number 950 originally caused by: Started by upstream project "libvirt-build" build number 1124 originally caused by: Started by an SCM change Running as SYSTEM [EnvInject] - Loading node environment variables. Building remotely on libvirt-fedora-rawhide (libvirt) in workspace <https://ci.centos.org/job/libvirt-go-check/systems=libvirt-fedora-rawhide/ws/> [libvirt-go] $ /bin/sh -xe /tmp/jenkins1445197102524938141.sh + export 'TEST_ARGS=-tags api' + TEST_ARGS='-tags api' + go test -tags api Missing enum 'VIR_DOMAIN_GET_HOSTNAME_AGENT' Missing enum 'VIR_DOMAIN_GET_HOSTNAME_LEASE' Missing enum 'VIR_ERR_NO_HOSTNAME' --- FAIL: TestAPICoverage (2.16s) panic: Missing symbols found [recovered] panic: Missing symbols found goroutine 20 [running]: testing.tRunner.func1(0xc0000c0100) /usr/lib/golang/src/testing/testing.go:874 +0x3a3 panic(0x5df9a0, 0x65c8f0) /usr/lib/golang/src/runtime/panic.go:679 +0x1b2 _<https://ci.centos.org/job/libvirt-go-check/systems=libvirt-fedora-rawhide/ws/.TestAPICoverage(0xc0000c0100)> <https://ci.centos.org/job/libvirt-go-check/systems=libvirt-fedora-rawhide/ws/api_test.go>:503 +0x551 testing.tRunner(0xc0000c0100, 0x635850) /usr/lib/golang/src/testing/testing.go:909 +0xc9 created by testing.(*T).Run /usr/lib/golang/src/testing/testing.go:960 +0x350 exit status 2 FAIL _<https://ci.centos.org/job/libvirt-go-check/systems=libvirt-fedora-rawhide/ws/> 2.717s Build step 'Execute shell' marked build as failure

See <https://ci.centos.org/job/libvirt-go-check/systems=libvirt-fedora-rawhide/937/display/redirect> ------------------------------------------ Started by upstream project "libvirt-go-check" build number 937 originally caused by: Started by upstream project "libvirt-go-build" build number 951 originally caused by: Started by upstream project "libvirt-build" build number 1125 originally caused by: Started by an SCM change Running as SYSTEM [EnvInject] - Loading node environment variables. Building remotely on libvirt-fedora-rawhide (libvirt) in workspace <https://ci.centos.org/job/libvirt-go-check/systems=libvirt-fedora-rawhide/ws/> [libvirt-go] $ /bin/sh -xe /tmp/jenkins3067865179020209248.sh + export 'TEST_ARGS=-tags api' + TEST_ARGS='-tags api' + go test -tags api Missing enum 'VIR_DOMAIN_GET_HOSTNAME_AGENT' Missing enum 'VIR_DOMAIN_GET_HOSTNAME_LEASE' Missing enum 'VIR_ERR_NO_HOSTNAME' --- FAIL: TestAPICoverage (0.61s) panic: Missing symbols found [recovered] panic: Missing symbols found goroutine 19 [running]: testing.tRunner.func1(0xc0000d4120) /usr/lib/golang/src/testing/testing.go:916 +0x608 panic(0x5d81c0, 0x6524d0) /usr/lib/golang/src/runtime/panic.go:967 +0x15d _<https://ci.centos.org/job/libvirt-go-check/systems=libvirt-fedora-rawhide/ws/.TestAPICoverage(0xc0000d4120)> <https://ci.centos.org/job/libvirt-go-check/systems=libvirt-fedora-rawhide/ws/api_test.go>:503 +0x551 testing.tRunner(0xc0000d4120, 0x628040) /usr/lib/golang/src/testing/testing.go:954 +0xdc created by testing.(*T).Run /usr/lib/golang/src/testing/testing.go:1005 +0x357 exit status 2 FAIL _<https://ci.centos.org/job/libvirt-go-check/systems=libvirt-fedora-rawhide/ws/> 0.773s Build step 'Execute shell' marked build as failure

See <https://ci.centos.org/job/libvirt-go-check/systems=libvirt-fedora-rawhide/938/display/redirect> ------------------------------------------ Started by upstream project "libvirt-go-check" build number 938 originally caused by: Started by upstream project "libvirt-go-build" build number 952 originally caused by: Started by upstream project "libvirt-build" build number 1126 originally caused by: Started by an SCM change Started by an SCM change Started by an SCM change Started by an SCM change Running as SYSTEM [EnvInject] - Loading node environment variables. Building remotely on libvirt-fedora-rawhide (libvirt) in workspace <https://ci.centos.org/job/libvirt-go-check/systems=libvirt-fedora-rawhide/ws/> [libvirt-go] $ /bin/sh -xe /tmp/jenkins2133920222817887008.sh + export 'TEST_ARGS=-tags api' + TEST_ARGS='-tags api' + go test -tags api Missing enum 'VIR_DOMAIN_GET_HOSTNAME_AGENT' Missing enum 'VIR_DOMAIN_GET_HOSTNAME_LEASE' Missing enum 'VIR_ERR_NO_HOSTNAME' --- FAIL: TestAPICoverage (0.66s) panic: Missing symbols found [recovered] panic: Missing symbols found goroutine 6 [running]: testing.tRunner.func1(0xc0000a4120) /usr/lib/golang/src/testing/testing.go:916 +0x608 panic(0x5d81c0, 0x6524d0) /usr/lib/golang/src/runtime/panic.go:967 +0x15d _<https://ci.centos.org/job/libvirt-go-check/systems=libvirt-fedora-rawhide/ws/.TestAPICoverage(0xc0000a4120)> <https://ci.centos.org/job/libvirt-go-check/systems=libvirt-fedora-rawhide/ws/api_test.go>:503 +0x551 testing.tRunner(0xc0000a4120, 0x628040) /usr/lib/golang/src/testing/testing.go:954 +0xdc created by testing.(*T).Run /usr/lib/golang/src/testing/testing.go:1005 +0x357 exit status 2 FAIL _<https://ci.centos.org/job/libvirt-go-check/systems=libvirt-fedora-rawhide/ws/> 0.926s Build step 'Execute shell' marked build as failure

See <https://ci.centos.org/job/libvirt-go-check/systems=libvirt-fedora-rawhide/939/display/redirect> ------------------------------------------ Started by upstream project "libvirt-go-check" build number 939 originally caused by: Started by upstream project "libvirt-go-build" build number 953 originally caused by: Started by upstream project "libvirt-build" build number 1127 originally caused by: Started by an SCM change Started by an SCM change Running as SYSTEM [EnvInject] - Loading node environment variables. Building remotely on libvirt-fedora-rawhide (libvirt) in workspace <https://ci.centos.org/job/libvirt-go-check/systems=libvirt-fedora-rawhide/ws/> [libvirt-go] $ /bin/sh -xe /tmp/jenkins16185572619318338290.sh + export 'TEST_ARGS=-tags api' + TEST_ARGS='-tags api' + go test -tags api Missing enum 'VIR_DOMAIN_GET_HOSTNAME_AGENT' Missing enum 'VIR_DOMAIN_GET_HOSTNAME_LEASE' Missing enum 'VIR_ERR_NO_HOSTNAME' --- FAIL: TestAPICoverage (1.27s) panic: Missing symbols found [recovered] panic: Missing symbols found goroutine 6 [running]: testing.tRunner.func1(0xc0000a4120) /usr/lib/golang/src/testing/testing.go:916 +0x608 panic(0x5d81c0, 0x6524d0) /usr/lib/golang/src/runtime/panic.go:967 +0x15d _<https://ci.centos.org/job/libvirt-go-check/systems=libvirt-fedora-rawhide/ws/.TestAPICoverage(0xc0000a4120)> <https://ci.centos.org/job/libvirt-go-check/systems=libvirt-fedora-rawhide/ws/api_test.go>:503 +0x551 testing.tRunner(0xc0000a4120, 0x628040) /usr/lib/golang/src/testing/testing.go:954 +0xdc created by testing.(*T).Run /usr/lib/golang/src/testing/testing.go:1005 +0x357 exit status 2 FAIL _<https://ci.centos.org/job/libvirt-go-check/systems=libvirt-fedora-rawhide/ws/> 1.381s Build step 'Execute shell' marked build as failure

See <https://ci.centos.org/job/libvirt-go-check/systems=libvirt-fedora-rawhide/940/display/redirect> ------------------------------------------ Started by upstream project "libvirt-go-check" build number 940 originally caused by: Started by upstream project "libvirt-go-build" build number 954 originally caused by: Started by upstream project "libvirt-build" build number 1128 originally caused by: Started by an SCM change Running as SYSTEM [EnvInject] - Loading node environment variables. Building remotely on libvirt-fedora-rawhide (libvirt) in workspace <https://ci.centos.org/job/libvirt-go-check/systems=libvirt-fedora-rawhide/ws/> [libvirt-go] $ /bin/sh -xe /tmp/jenkins4760407002314640908.sh + export 'TEST_ARGS=-tags api' + TEST_ARGS='-tags api' + go test -tags api Missing enum 'VIR_DOMAIN_GET_HOSTNAME_AGENT' Missing enum 'VIR_DOMAIN_GET_HOSTNAME_LEASE' Missing enum 'VIR_ERR_NO_HOSTNAME' --- FAIL: TestAPICoverage (0.71s) panic: Missing symbols found [recovered] panic: Missing symbols found goroutine 6 [running]: testing.tRunner.func1(0xc0000a4120) /usr/lib/golang/src/testing/testing.go:916 +0x608 panic(0x5d81c0, 0x6524d0) /usr/lib/golang/src/runtime/panic.go:967 +0x15d _<https://ci.centos.org/job/libvirt-go-check/systems=libvirt-fedora-rawhide/ws/.TestAPICoverage(0xc0000a4120)> <https://ci.centos.org/job/libvirt-go-check/systems=libvirt-fedora-rawhide/ws/api_test.go>:503 +0x551 testing.tRunner(0xc0000a4120, 0x628040) /usr/lib/golang/src/testing/testing.go:954 +0xdc created by testing.(*T).Run /usr/lib/golang/src/testing/testing.go:1005 +0x357 exit status 2 FAIL _<https://ci.centos.org/job/libvirt-go-check/systems=libvirt-fedora-rawhide/ws/> 0.899s Build step 'Execute shell' marked build as failure

See <https://ci.centos.org/job/libvirt-go-check/systems=libvirt-fedora-rawhide/941/display/redirect> ------------------------------------------ Started by upstream project "libvirt-go-check" build number 941 originally caused by: Started by upstream project "libvirt-go-build" build number 955 originally caused by: Started by upstream project "libvirt-build" build number 1131 originally caused by: Started by an SCM change Running as SYSTEM [EnvInject] - Loading node environment variables. Building remotely on libvirt-fedora-rawhide (libvirt) in workspace <https://ci.centos.org/job/libvirt-go-check/systems=libvirt-fedora-rawhide/ws/> [libvirt-go] $ /bin/sh -xe /tmp/jenkins14980514694463499685.sh + export 'TEST_ARGS=-tags api' + TEST_ARGS='-tags api' + go test -tags api Missing enum 'VIR_DOMAIN_GET_HOSTNAME_AGENT' Missing enum 'VIR_DOMAIN_GET_HOSTNAME_LEASE' Missing enum 'VIR_ERR_NO_HOSTNAME' --- FAIL: TestAPICoverage (1.59s) panic: Missing symbols found [recovered] panic: Missing symbols found goroutine 6 [running]: testing.tRunner.func1(0xc0000a4120) /usr/lib/golang/src/testing/testing.go:916 +0x608 panic(0x5d81c0, 0x6524d0) /usr/lib/golang/src/runtime/panic.go:967 +0x15d _<https://ci.centos.org/job/libvirt-go-check/systems=libvirt-fedora-rawhide/ws/.TestAPICoverage(0xc0000a4120)> <https://ci.centos.org/job/libvirt-go-check/systems=libvirt-fedora-rawhide/ws/api_test.go>:503 +0x551 testing.tRunner(0xc0000a4120, 0x628040) /usr/lib/golang/src/testing/testing.go:954 +0xdc created by testing.(*T).Run /usr/lib/golang/src/testing/testing.go:1005 +0x357 exit status 2 FAIL _<https://ci.centos.org/job/libvirt-go-check/systems=libvirt-fedora-rawhide/ws/> 1.882s Build step 'Execute shell' marked build as failure

See <https://ci.centos.org/job/libvirt-go-check/systems=libvirt-fedora-rawhide/942/display/redirect> ------------------------------------------ Started by upstream project "libvirt-go-check" build number 942 originally caused by: Started by upstream project "libvirt-go-build" build number 956 originally caused by: Started by upstream project "libvirt-build" build number 1132 originally caused by: Started by an SCM change Started by an SCM change Started by an SCM change Started by an SCM change Running as SYSTEM [EnvInject] - Loading node environment variables. Building remotely on libvirt-fedora-rawhide (libvirt) in workspace <https://ci.centos.org/job/libvirt-go-check/systems=libvirt-fedora-rawhide/ws/> [libvirt-go] $ /bin/sh -xe /tmp/jenkins10046620343648206545.sh + export 'TEST_ARGS=-tags api' + TEST_ARGS='-tags api' + go test -tags api Missing enum 'VIR_DOMAIN_GET_HOSTNAME_AGENT' Missing enum 'VIR_DOMAIN_GET_HOSTNAME_LEASE' Missing enum 'VIR_ERR_NO_HOSTNAME' --- FAIL: TestAPICoverage (1.67s) panic: Missing symbols found [recovered] panic: Missing symbols found goroutine 6 [running]: testing.tRunner.func1(0xc000124120) /usr/lib/golang/src/testing/testing.go:916 +0x608 panic(0x5d81c0, 0x6524d0) /usr/lib/golang/src/runtime/panic.go:967 +0x15d _<https://ci.centos.org/job/libvirt-go-check/systems=libvirt-fedora-rawhide/ws/.TestAPICoverage(0xc000124120)> <https://ci.centos.org/job/libvirt-go-check/systems=libvirt-fedora-rawhide/ws/api_test.go>:503 +0x551 testing.tRunner(0xc000124120, 0x628040) /usr/lib/golang/src/testing/testing.go:954 +0xdc created by testing.(*T).Run /usr/lib/golang/src/testing/testing.go:1005 +0x357 exit status 2 FAIL _<https://ci.centos.org/job/libvirt-go-check/systems=libvirt-fedora-rawhide/ws/> 2.122s Build step 'Execute shell' marked build as failure

See <https://ci.centos.org/job/libvirt-go-check/systems=libvirt-fedora-rawhide/943/display/redirect> ------------------------------------------ Started by upstream project "libvirt-go-check" build number 943 originally caused by: Started by upstream project "libvirt-go-build" build number 957 originally caused by: Started by upstream project "libvirt-build" build number 1133 originally caused by: Started by an SCM change Running as SYSTEM [EnvInject] - Loading node environment variables. Building remotely on libvirt-fedora-rawhide (libvirt) in workspace <https://ci.centos.org/job/libvirt-go-check/systems=libvirt-fedora-rawhide/ws/> [libvirt-go] $ /bin/sh -xe /tmp/jenkins3470433521505106452.sh + export 'TEST_ARGS=-tags api' + TEST_ARGS='-tags api' + go test -tags api Missing enum 'VIR_DOMAIN_GET_HOSTNAME_AGENT' Missing enum 'VIR_DOMAIN_GET_HOSTNAME_LEASE' Missing enum 'VIR_ERR_NO_HOSTNAME' --- FAIL: TestAPICoverage (1.62s) panic: Missing symbols found [recovered] panic: Missing symbols found goroutine 6 [running]: testing.tRunner.func1(0xc0000a4120) /usr/lib/golang/src/testing/testing.go:916 +0x608 panic(0x5d81c0, 0x6524d0) /usr/lib/golang/src/runtime/panic.go:967 +0x15d _<https://ci.centos.org/job/libvirt-go-check/systems=libvirt-fedora-rawhide/ws/.TestAPICoverage(0xc0000a4120)> <https://ci.centos.org/job/libvirt-go-check/systems=libvirt-fedora-rawhide/ws/api_test.go>:503 +0x551 testing.tRunner(0xc0000a4120, 0x628040) /usr/lib/golang/src/testing/testing.go:954 +0xdc created by testing.(*T).Run /usr/lib/golang/src/testing/testing.go:1005 +0x357 exit status 2 FAIL _<https://ci.centos.org/job/libvirt-go-check/systems=libvirt-fedora-rawhide/ws/> 2.029s Build step 'Execute shell' marked build as failure

participants (1)
-
ci@centos.org