[Libvirt-ci] Build failed in Jenkins: libvirt-go-xml-check » libvirt-freebsd-11 #222

See <https://ci.centos.org/job/libvirt-go-xml-check/systems=libvirt-freebsd-11/222/display/redirect> ------------------------------------------ Started by upstream project "libvirt-go-xml-check" build number 222 originally caused by: Started by upstream project "libvirt-go-xml-build" build number 222 originally caused by: Started by upstream project "libvirt-build" build number 280 originally caused by: Started by an SCM change Started by an SCM change Started by an SCM change [EnvInject] - Loading node environment variables. Building remotely on libvirt-freebsd-11 (libvirt) in workspace <https://ci.centos.org/job/libvirt-go-xml-check/systems=libvirt-freebsd-11/ws/> [libvirt-go-xml] $ /bin/sh -xe /tmp/jenkins8472822644540285294.sh + export 'TEST_ARGS=-tags xmlroundtrip' + go test -tags xmlroundtrip --- FAIL: TestRoundTrip (8.15s) xml_test.go:400: testdata/libvirt/tests/networkxml2xmlin/routed-network.xml: /network[0]/bridge[0]/@zone: attribute 'myzone' in expected XML missing in actual XML FAIL exit status 1 FAIL _/usr<https://ci.centos.org/job/libvirt-go-xml-check/systems=libvirt-freebsd-11/ws/> 8.273s Build step 'Execute shell' marked build as failure

See <https://ci.centos.org/job/libvirt-go-xml-check/systems=libvirt-freebsd-11/223/display/redirect> ------------------------------------------ Started by upstream project "libvirt-go-xml-check" build number 223 originally caused by: Started by upstream project "libvirt-go-xml-build" build number 223 originally caused by: Started by upstream project "libvirt-build" build number 281 originally caused by: Started by an SCM change Started by an SCM change Started by an SCM change Started by an SCM change Started by an SCM change Started by an SCM change Started by an SCM change Started by an SCM change [EnvInject] - Loading node environment variables. Building remotely on libvirt-freebsd-11 (libvirt) in workspace <https://ci.centos.org/job/libvirt-go-xml-check/systems=libvirt-freebsd-11/ws/> [libvirt-go-xml] $ /bin/sh -xe /tmp/jenkins1699542773365398570.sh + export 'TEST_ARGS=-tags xmlroundtrip' + go test -tags xmlroundtrip --- FAIL: TestRoundTrip (3.33s) xml_test.go:400: testdata/libvirt/tests/networkxml2xmlin/routed-network.xml: /network[0]/bridge[0]/@zone: attribute 'myzone' in expected XML missing in actual XML FAIL exit status 1 FAIL _/usr<https://ci.centos.org/job/libvirt-go-xml-check/systems=libvirt-freebsd-11/ws/> 3.380s Build step 'Execute shell' marked build as failure

See <https://ci.centos.org/job/libvirt-go-xml-check/systems=libvirt-freebsd-11/224/display/redirect> ------------------------------------------ Started by upstream project "libvirt-go-xml-check" build number 224 originally caused by: Started by upstream project "libvirt-go-xml-build" build number 224 originally caused by: Started by upstream project "libvirt-build" build number 282 originally caused by: Started by an SCM change [EnvInject] - Loading node environment variables. Building remotely on libvirt-freebsd-11 (libvirt) in workspace <https://ci.centos.org/job/libvirt-go-xml-check/systems=libvirt-freebsd-11/ws/> [libvirt-go-xml] $ /bin/sh -xe /tmp/jenkins7990080514951119179.sh + export 'TEST_ARGS=-tags xmlroundtrip' + go test -tags xmlroundtrip --- FAIL: TestRoundTrip (17.66s) xml_test.go:400: testdata/libvirt/tests/networkxml2xmlin/routed-network.xml: /network[0]/bridge[0]/@zone: attribute 'myzone' in expected XML missing in actual XML FAIL exit status 1 FAIL _/usr<https://ci.centos.org/job/libvirt-go-xml-check/systems=libvirt-freebsd-11/ws/> 17.771s Build step 'Execute shell' marked build as failure

See <https://ci.centos.org/job/libvirt-go-xml-check/systems=libvirt-freebsd-11/225/display/redirect> ------------------------------------------ Started by upstream project "libvirt-go-xml-check" build number 225 originally caused by: Started by upstream project "libvirt-go-xml-build" build number 225 originally caused by: Started by upstream project "libvirt-build" build number 284 originally caused by: Started by an SCM change [EnvInject] - Loading node environment variables. Building remotely on libvirt-freebsd-11 (libvirt) in workspace <https://ci.centos.org/job/libvirt-go-xml-check/systems=libvirt-freebsd-11/ws/> [libvirt-go-xml] $ /bin/sh -xe /tmp/jenkins9101928165395862402.sh + export 'TEST_ARGS=-tags xmlroundtrip' + go test -tags xmlroundtrip --- FAIL: TestRoundTrip (23.57s) xml_test.go:400: testdata/libvirt/tests/networkxml2xmlin/routed-network.xml: /network[0]/bridge[0]/@zone: attribute 'myzone' in expected XML missing in actual XML FAIL exit status 1 FAIL _/usr<https://ci.centos.org/job/libvirt-go-xml-check/systems=libvirt-freebsd-11/ws/> 23.706s Build step 'Execute shell' marked build as failure

participants (1)
-
ci@centos.org