[Libvirt-ci] Build failed in Jenkins: libvirt-go-check » libvirt-debian-8 #329

See <https://ci.centos.org/job/libvirt-go-check/systems=libvirt-debian-8/329/display/redirect> ------------------------------------------ Started by upstream project "libvirt-go-check" build number 329 originally caused by: Started by upstream project "libvirt-go-build" build number 335 originally caused by: Started by upstream project "libvirt-build" build number 424 originally caused by: Started by an SCM change Started by an SCM change Started by an SCM change Started by an SCM change Started by an SCM change Started by an SCM change Started by an SCM change Started by an SCM change Started by an SCM change [EnvInject] - Loading node environment variables. Building remotely on libvirt-debian-8 (libvirt) in workspace <https://ci.centos.org/job/libvirt-go-check/systems=libvirt-debian-8/ws/> [libvirt-go] $ /bin/sh -xe /tmp/jenkins398226395183621374.sh + export TEST_ARGS=-tags api + go test -tags api Missing enum 'VIR_ERR_INVALID_DOMAIN_CHECKPOINT' Missing enum 'VIR_ERR_NO_DOMAIN_BACKUP' Missing enum 'VIR_ERR_NO_DOMAIN_CHECKPOINT' Missing enum 'VIR_FROM_DOMAIN_CHECKPOINT' --- FAIL: TestAPICoverage (0.55s) panic: Missing symbols found [recovered] panic: Missing symbols found goroutine 5 [running]: panic(0x5b5860, 0xc4204306f0) /usr/lib/go-1.7/src/runtime/panic.go:500 +0x1a1 testing.tRunner.func1(0xc420078180) /usr/lib/go-1.7/src/testing/testing.go:579 +0x25d panic(0x5b5860, 0xc4204306f0) /usr/lib/go-1.7/src/runtime/panic.go:458 +0x243 _<https://ci.centos.org/job/libvirt-go-check/systems=libvirt-debian-8/ws/.TestAPICoverage(0xc420078180)> <https://ci.centos.org/job/libvirt-go-check/systems=libvirt-debian-8/ws/api_test.go>:501 +0x5ff testing.tRunner(0xc420078180, 0x608fa8) /usr/lib/go-1.7/src/testing/testing.go:610 +0x81 created by testing.(*T).Run /usr/lib/go-1.7/src/testing/testing.go:646 +0x2ec exit status 2 FAIL _<https://ci.centos.org/job/libvirt-go-check/systems=libvirt-debian-8/ws/> 0.725s Build step 'Execute shell' marked build as failure

See <https://ci.centos.org/job/libvirt-go-check/systems=libvirt-debian-8/330/display/redirect> ------------------------------------------ Started by upstream project "libvirt-go-check" build number 330 originally caused by: Started by upstream project "libvirt-go-build" build number 336 originally caused by: Started by upstream project "libvirt-build" build number 426 originally caused by: Started by an SCM change Started by an SCM change [EnvInject] - Loading node environment variables. Building remotely on libvirt-debian-8 (libvirt) in workspace <https://ci.centos.org/job/libvirt-go-check/systems=libvirt-debian-8/ws/> [libvirt-go] $ /bin/sh -xe /tmp/jenkins5396338308986355202.sh + export TEST_ARGS=-tags api + go test -tags api Missing macro 'VIR_MIGRATE_PARAM_PARALLEL_CONNECTIONS' Missing enum 'VIR_ERR_INVALID_DOMAIN_CHECKPOINT' Missing enum 'VIR_ERR_NO_DOMAIN_BACKUP' Missing enum 'VIR_ERR_NO_DOMAIN_CHECKPOINT' Missing enum 'VIR_FROM_DOMAIN_CHECKPOINT' Missing enum 'VIR_MIGRATE_PARALLEL' --- FAIL: TestAPICoverage (0.33s) panic: Missing symbols found [recovered] panic: Missing symbols found goroutine 19 [running]: panic(0x5b5860, 0xc420220550) /usr/lib/go-1.7/src/runtime/panic.go:500 +0x1a1 testing.tRunner.func1(0xc420086180) /usr/lib/go-1.7/src/testing/testing.go:579 +0x25d panic(0x5b5860, 0xc420220550) /usr/lib/go-1.7/src/runtime/panic.go:458 +0x243 _<https://ci.centos.org/job/libvirt-go-check/systems=libvirt-debian-8/ws/.TestAPICoverage(0xc420086180)> <https://ci.centos.org/job/libvirt-go-check/systems=libvirt-debian-8/ws/api_test.go>:501 +0x5ff testing.tRunner(0xc420086180, 0x608fa8) /usr/lib/go-1.7/src/testing/testing.go:610 +0x81 created by testing.(*T).Run /usr/lib/go-1.7/src/testing/testing.go:646 +0x2ec exit status 2 FAIL _<https://ci.centos.org/job/libvirt-go-check/systems=libvirt-debian-8/ws/> 0.408s Build step 'Execute shell' marked build as failure

See <https://ci.centos.org/job/libvirt-go-check/systems=libvirt-debian-8/331/display/redirect> ------------------------------------------ Started by upstream project "libvirt-go-check" build number 331 originally caused by: Started by upstream project "libvirt-go-build" build number 337 originally caused by: Started by upstream project "libvirt-build" build number 428 originally caused by: Started by an SCM change [EnvInject] - Loading node environment variables. Building remotely on libvirt-debian-8 (libvirt) in workspace <https://ci.centos.org/job/libvirt-go-check/systems=libvirt-debian-8/ws/> [libvirt-go] $ /bin/sh -xe /tmp/jenkins8897620874042087048.sh + export TEST_ARGS=-tags api + go test -tags api Missing macro 'VIR_MIGRATE_PARAM_PARALLEL_CONNECTIONS' Missing enum 'VIR_ERR_INVALID_DOMAIN_CHECKPOINT' Missing enum 'VIR_ERR_NO_DOMAIN_BACKUP' Missing enum 'VIR_ERR_NO_DOMAIN_CHECKPOINT' Missing enum 'VIR_FROM_DOMAIN_CHECKPOINT' Missing enum 'VIR_MIGRATE_PARALLEL' --- FAIL: TestAPICoverage (0.78s) panic: Missing symbols found [recovered] panic: Missing symbols found goroutine 5 [running]: panic(0x5b5860, 0xc4201ee100) /usr/lib/go-1.7/src/runtime/panic.go:500 +0x1a1 testing.tRunner.func1(0xc420078180) /usr/lib/go-1.7/src/testing/testing.go:579 +0x25d panic(0x5b5860, 0xc4201ee100) /usr/lib/go-1.7/src/runtime/panic.go:458 +0x243 _<https://ci.centos.org/job/libvirt-go-check/systems=libvirt-debian-8/ws/.TestAPICoverage(0xc420078180)> <https://ci.centos.org/job/libvirt-go-check/systems=libvirt-debian-8/ws/api_test.go>:501 +0x5ff testing.tRunner(0xc420078180, 0x608fa8) /usr/lib/go-1.7/src/testing/testing.go:610 +0x81 created by testing.(*T).Run /usr/lib/go-1.7/src/testing/testing.go:646 +0x2ec exit status 2 FAIL _<https://ci.centos.org/job/libvirt-go-check/systems=libvirt-debian-8/ws/> 1.010s Build step 'Execute shell' marked build as failure

See <https://ci.centos.org/job/libvirt-go-check/systems=libvirt-debian-8/332/display/redirect> ------------------------------------------ Started by upstream project "libvirt-go-check" build number 332 originally caused by: Started by upstream project "libvirt-go-build" build number 338 originally caused by: Started by upstream project "libvirt-build" build number 429 originally caused by: Started by an SCM change [EnvInject] - Loading node environment variables. Building remotely on libvirt-debian-8 (libvirt) in workspace <https://ci.centos.org/job/libvirt-go-check/systems=libvirt-debian-8/ws/> [libvirt-go] $ /bin/sh -xe /tmp/jenkins7055860010319937939.sh + export TEST_ARGS=-tags api + go test -tags api Missing macro 'VIR_MIGRATE_PARAM_PARALLEL_CONNECTIONS' Missing enum 'VIR_ERR_INVALID_DOMAIN_CHECKPOINT' Missing enum 'VIR_ERR_NO_DOMAIN_BACKUP' Missing enum 'VIR_ERR_NO_DOMAIN_CHECKPOINT' Missing enum 'VIR_FROM_DOMAIN_CHECKPOINT' Missing enum 'VIR_MIGRATE_PARALLEL' --- FAIL: TestAPICoverage (0.30s) panic: Missing symbols found [recovered] panic: Missing symbols found goroutine 5 [running]: panic(0x5b5860, 0xc42010ffa0) /usr/lib/go-1.7/src/runtime/panic.go:500 +0x1a1 testing.tRunner.func1(0xc420078180) /usr/lib/go-1.7/src/testing/testing.go:579 +0x25d panic(0x5b5860, 0xc42010ffa0) /usr/lib/go-1.7/src/runtime/panic.go:458 +0x243 _<https://ci.centos.org/job/libvirt-go-check/systems=libvirt-debian-8/ws/.TestAPICoverage(0xc420078180)> <https://ci.centos.org/job/libvirt-go-check/systems=libvirt-debian-8/ws/api_test.go>:501 +0x5ff testing.tRunner(0xc420078180, 0x608fa8) /usr/lib/go-1.7/src/testing/testing.go:610 +0x81 created by testing.(*T).Run /usr/lib/go-1.7/src/testing/testing.go:646 +0x2ec exit status 2 FAIL _<https://ci.centos.org/job/libvirt-go-check/systems=libvirt-debian-8/ws/> 0.341s Build step 'Execute shell' marked build as failure

See <https://ci.centos.org/job/libvirt-go-check/systems=libvirt-debian-8/333/display/redirect> ------------------------------------------ Started by upstream project "libvirt-go-check" build number 333 originally caused by: Started by upstream project "libvirt-go-build" build number 339 originally caused by: Started by upstream project "libvirt-build" build number 430 originally caused by: Started by an SCM change [EnvInject] - Loading node environment variables. Building remotely on libvirt-debian-8 (libvirt) in workspace <https://ci.centos.org/job/libvirt-go-check/systems=libvirt-debian-8/ws/> [libvirt-go] $ /bin/sh -xe /tmp/jenkins7035367847313363104.sh + export TEST_ARGS=-tags api + go test -tags api Missing macro 'VIR_MIGRATE_PARAM_PARALLEL_CONNECTIONS' Missing enum 'VIR_ERR_INVALID_DOMAIN_CHECKPOINT' Missing enum 'VIR_ERR_NO_DOMAIN_BACKUP' Missing enum 'VIR_ERR_NO_DOMAIN_CHECKPOINT' Missing enum 'VIR_FROM_DOMAIN_CHECKPOINT' Missing enum 'VIR_MIGRATE_PARALLEL' --- FAIL: TestAPICoverage (0.60s) panic: Missing symbols found [recovered] panic: Missing symbols found goroutine 5 [running]: panic(0x5b5860, 0xc4200ac740) /usr/lib/go-1.7/src/runtime/panic.go:500 +0x1a1 testing.tRunner.func1(0xc420078180) /usr/lib/go-1.7/src/testing/testing.go:579 +0x25d panic(0x5b5860, 0xc4200ac740) /usr/lib/go-1.7/src/runtime/panic.go:458 +0x243 _<https://ci.centos.org/job/libvirt-go-check/systems=libvirt-debian-8/ws/.TestAPICoverage(0xc420078180)> <https://ci.centos.org/job/libvirt-go-check/systems=libvirt-debian-8/ws/api_test.go>:501 +0x5ff testing.tRunner(0xc420078180, 0x608fa8) /usr/lib/go-1.7/src/testing/testing.go:610 +0x81 created by testing.(*T).Run /usr/lib/go-1.7/src/testing/testing.go:646 +0x2ec exit status 2 FAIL _<https://ci.centos.org/job/libvirt-go-check/systems=libvirt-debian-8/ws/> 0.696s Build step 'Execute shell' marked build as failure

participants (1)
-
ci@centos.org