[Libvirt-ci] Build failed in Jenkins: libvirt-go-check » libvirt-fedora-28 #218

See <https://ci.centos.org/job/libvirt-go-check/systems=libvirt-fedora-28/218/display/redirect> ------------------------------------------ Started by upstream project "libvirt-go-check" build number 218 originally caused by: Started by upstream project "libvirt-go-build" build number 222 originally caused by: Started by upstream project "libvirt-build" build number 281 originally caused by: Started by an SCM change Started by an SCM change Started by an SCM change Started by an SCM change Started by an SCM change Started by an SCM change Started by an SCM change Started by an SCM change [EnvInject] - Loading node environment variables. Building remotely on libvirt-fedora-28 (libvirt) in workspace <https://ci.centos.org/job/libvirt-go-check/systems=libvirt-fedora-28/ws/> [libvirt-go] $ /bin/sh -xe /tmp/jenkins6125292312953856296.sh + export 'TEST_ARGS=-tags api' + TEST_ARGS='-tags api' + go test -tags api Missing enum 'VIR_FROM_FIREWALLD' --- FAIL: TestAPICoverage (1.02s) panic: Missing symbols found [recovered] panic: Missing symbols found goroutine 5 [running]: testing.tRunner.func1(0xc4200aa0f0) /usr/lib/golang/src/testing/testing.go:742 +0x29d panic(0x5c3ba0, 0x6277b0) /usr/lib/golang/src/runtime/panic.go:502 +0x229 _<https://ci.centos.org/job/libvirt-go-check/systems=libvirt-fedora-28/ws/.TestAPICoverage(0xc4200aa0f0)> <https://ci.centos.org/job/libvirt-go-check/systems=libvirt-fedora-28/ws/api_test.go>:501 +0x548 testing.tRunner(0xc4200aa0f0, 0x612868) /usr/lib/golang/src/testing/testing.go:777 +0xd0 created by testing.(*T).Run /usr/lib/golang/src/testing/testing.go:824 +0x2e0 exit status 2 FAIL _<https://ci.centos.org/job/libvirt-go-check/systems=libvirt-fedora-28/ws/> 1.424s Build step 'Execute shell' marked build as failure

See <https://ci.centos.org/job/libvirt-go-check/systems=libvirt-fedora-28/219/display/redirect> ------------------------------------------ Started by upstream project "libvirt-go-check" build number 219 originally caused by: Started by upstream project "libvirt-go-build" build number 223 originally caused by: Started by upstream project "libvirt-build" build number 282 originally caused by: Started by an SCM change [EnvInject] - Loading node environment variables. Building remotely on libvirt-fedora-28 (libvirt) in workspace <https://ci.centos.org/job/libvirt-go-check/systems=libvirt-fedora-28/ws/> [libvirt-go] $ /bin/sh -xe /tmp/jenkins1251427781313994863.sh + export 'TEST_ARGS=-tags api' + TEST_ARGS='-tags api' + go test -tags api Missing enum 'VIR_FROM_FIREWALLD' --- FAIL: TestAPICoverage (0.17s) panic: Missing symbols found [recovered] panic: Missing symbols found goroutine 19 [running]: testing.tRunner.func1(0xc4200c60f0) /usr/lib/golang/src/testing/testing.go:742 +0x29d panic(0x5c3ba0, 0x6277b0) /usr/lib/golang/src/runtime/panic.go:502 +0x229 _<https://ci.centos.org/job/libvirt-go-check/systems=libvirt-fedora-28/ws/.TestAPICoverage(0xc4200c60f0)> <https://ci.centos.org/job/libvirt-go-check/systems=libvirt-fedora-28/ws/api_test.go>:501 +0x548 testing.tRunner(0xc4200c60f0, 0x612868) /usr/lib/golang/src/testing/testing.go:777 +0xd0 created by testing.(*T).Run /usr/lib/golang/src/testing/testing.go:824 +0x2e0 exit status 2 FAIL _<https://ci.centos.org/job/libvirt-go-check/systems=libvirt-fedora-28/ws/> 0.215s Build step 'Execute shell' marked build as failure

See <https://ci.centos.org/job/libvirt-go-check/systems=libvirt-fedora-28/220/display/redirect> ------------------------------------------ Started by upstream project "libvirt-go-check" build number 220 originally caused by: Started by upstream project "libvirt-go-build" build number 224 originally caused by: Started by upstream project "libvirt-build" build number 284 originally caused by: Started by an SCM change [EnvInject] - Loading node environment variables. Building remotely on libvirt-fedora-28 (libvirt) in workspace <https://ci.centos.org/job/libvirt-go-check/systems=libvirt-fedora-28/ws/> [libvirt-go] $ /bin/sh -xe /tmp/jenkins1657614765626265763.sh + export 'TEST_ARGS=-tags api' + TEST_ARGS='-tags api' + go test -tags api Missing enum 'VIR_FROM_FIREWALLD' --- FAIL: TestAPICoverage (0.87s) panic: Missing symbols found [recovered] panic: Missing symbols found goroutine 5 [running]: testing.tRunner.func1(0xc4200aa0f0) /usr/lib/golang/src/testing/testing.go:742 +0x29d panic(0x5c3ba0, 0x6277b0) /usr/lib/golang/src/runtime/panic.go:502 +0x229 _<https://ci.centos.org/job/libvirt-go-check/systems=libvirt-fedora-28/ws/.TestAPICoverage(0xc4200aa0f0)> <https://ci.centos.org/job/libvirt-go-check/systems=libvirt-fedora-28/ws/api_test.go>:501 +0x548 testing.tRunner(0xc4200aa0f0, 0x612868) /usr/lib/golang/src/testing/testing.go:777 +0xd0 created by testing.(*T).Run /usr/lib/golang/src/testing/testing.go:824 +0x2e0 exit status 2 FAIL _<https://ci.centos.org/job/libvirt-go-check/systems=libvirt-fedora-28/ws/> 1.168s Build step 'Execute shell' marked build as failure

participants (1)
-
ci@centos.org