[Libvirt-ci] Build failed in Jenkins: libvirt-go-xml-master-check » libvirt-debian-9 #481

See <https://ci.centos.org/job/libvirt-go-xml-master-check/systems=libvirt-debian-9/481/display/redirect> ------------------------------------------ Started by upstream project "libvirt-go-xml-master-check" build number 481 originally caused by: Started by upstream project "libvirt-go-xml-master-build" build number 490 originally caused by: Started by upstream project "libvirt-master-build" build number 1541 originally caused by: Started by an SCM change [EnvInject] - Loading node environment variables. Building remotely on libvirt-debian-9 (libvirt) in workspace <https://ci.centos.org/job/libvirt-go-xml-master-check/systems=libvirt-debian-9/ws/> [libvirt-go-xml-master] $ /bin/sh -xe /tmp/jenkins6101205843944373965.sh + export TEST_ARGS=-tags xmlroundtrip + go test -tags xmlroundtrip --- FAIL: TestRoundTrip (29.76s) xml_test.go:383: testdata/libvirt/tests/storagevolxml2xmlin/vol-luks-convert.xml: /volume[0]/source[0]: element in expected XML missing in actual XML FAIL exit status 1 FAIL _<https://ci.centos.org/job/libvirt-go-xml-master-check/systems=libvirt-debian-9/ws/> 29.965s Build step 'Execute shell' marked build as failure

See <https://ci.centos.org/job/libvirt-go-xml-master-check/systems=libvirt-debian-9/482/display/redirect> ------------------------------------------ Started by upstream project "libvirt-go-xml-master-check" build number 482 originally caused by: Started by upstream project "libvirt-go-xml-master-build" build number 491 originally caused by: Started by upstream project "libvirt-master-build" build number 1542 originally caused by: Started by an SCM change Started by an SCM change Started by an SCM change Started by an SCM change Started by an SCM change [EnvInject] - Loading node environment variables. Building remotely on libvirt-debian-9 (libvirt) in workspace <https://ci.centos.org/job/libvirt-go-xml-master-check/systems=libvirt-debian-9/ws/> [libvirt-go-xml-master] $ /bin/sh -xe /tmp/jenkins6134391282117712703.sh + export TEST_ARGS=-tags xmlroundtrip + go test -tags xmlroundtrip --- FAIL: TestRoundTrip (30.91s) xml_test.go:383: testdata/libvirt/tests/storagevolxml2xmlin/vol-luks-convert.xml: /volume[0]/source[0]: element in expected XML missing in actual XML FAIL exit status 1 FAIL _<https://ci.centos.org/job/libvirt-go-xml-master-check/systems=libvirt-debian-9/ws/> 31.132s Build step 'Execute shell' marked build as failure

See <https://ci.centos.org/job/libvirt-go-xml-master-check/systems=libvirt-debian-9/483/display/redirect> ------------------------------------------ Started by upstream project "libvirt-go-xml-master-check" build number 483 originally caused by: Started by upstream project "libvirt-go-xml-master-build" build number 492 originally caused by: Started by upstream project "libvirt-master-build" build number 1543 originally caused by: Started by an SCM change Started by an SCM change Started by an SCM change [EnvInject] - Loading node environment variables. Building remotely on libvirt-debian-9 (libvirt) in workspace <https://ci.centos.org/job/libvirt-go-xml-master-check/systems=libvirt-debian-9/ws/> [libvirt-go-xml-master] $ /bin/sh -xe /tmp/jenkins7615653016868810841.sh + export TEST_ARGS=-tags xmlroundtrip + go test -tags xmlroundtrip --- FAIL: TestRoundTrip (22.16s) xml_test.go:383: testdata/libvirt/tests/storagevolxml2xmlin/vol-luks-convert.xml: /volume[0]/source[0]: element in expected XML missing in actual XML FAIL exit status 1 FAIL _<https://ci.centos.org/job/libvirt-go-xml-master-check/systems=libvirt-debian-9/ws/> 22.481s Build step 'Execute shell' marked build as failure

See <https://ci.centos.org/job/libvirt-go-xml-master-check/systems=libvirt-debian-9/484/display/redirect> ------------------------------------------ Started by upstream project "libvirt-go-xml-master-check" build number 484 originally caused by: Started by upstream project "libvirt-go-xml-master-build" build number 493 originally caused by: Started by upstream project "libvirt-master-build" build number 1544 originally caused by: Started by an SCM change [EnvInject] - Loading node environment variables. Building remotely on libvirt-debian-9 (libvirt) in workspace <https://ci.centos.org/job/libvirt-go-xml-master-check/systems=libvirt-debian-9/ws/> [libvirt-go-xml-master] $ /bin/sh -xe /tmp/jenkins4564880556043983003.sh + export TEST_ARGS=-tags xmlroundtrip + go test -tags xmlroundtrip --- FAIL: TestRoundTrip (7.14s) xml_test.go:383: testdata/libvirt/tests/storagevolxml2xmlin/vol-luks-convert.xml: /volume[0]/source[0]: element in expected XML missing in actual XML FAIL exit status 1 FAIL _<https://ci.centos.org/job/libvirt-go-xml-master-check/systems=libvirt-debian-9/ws/> 7.180s Build step 'Execute shell' marked build as failure

See <https://ci.centos.org/job/libvirt-go-xml-master-check/systems=libvirt-debian-9/485/display/redirect> ------------------------------------------ Started by upstream project "libvirt-go-xml-master-check" build number 485 originally caused by: Started by upstream project "libvirt-go-xml-master-build" build number 494 originally caused by: Started by upstream project "libvirt-master-build" build number 1545 originally caused by: Started by an SCM change [EnvInject] - Loading node environment variables. Building remotely on libvirt-debian-9 (libvirt) in workspace <https://ci.centos.org/job/libvirt-go-xml-master-check/systems=libvirt-debian-9/ws/> [libvirt-go-xml-master] $ /bin/sh -xe /tmp/jenkins7525484097040645695.sh + export TEST_ARGS=-tags xmlroundtrip + go test -tags xmlroundtrip --- FAIL: TestRoundTrip (29.10s) xml_test.go:383: testdata/libvirt/tests/storagevolxml2xmlin/vol-luks-convert.xml: /volume[0]/source[0]: element in expected XML missing in actual XML FAIL exit status 1 FAIL _<https://ci.centos.org/job/libvirt-go-xml-master-check/systems=libvirt-debian-9/ws/> 29.277s Build step 'Execute shell' marked build as failure

See <https://ci.centos.org/job/libvirt-go-xml-master-check/systems=libvirt-debian-9/486/display/redirect> ------------------------------------------ Started by upstream project "libvirt-go-xml-master-check" build number 486 originally caused by: Started by upstream project "libvirt-go-xml-master-build" build number 495 originally caused by: Started by upstream project "libvirt-master-build" build number 1546 originally caused by: Started by an SCM change [EnvInject] - Loading node environment variables. Building remotely on libvirt-debian-9 (libvirt) in workspace <https://ci.centos.org/job/libvirt-go-xml-master-check/systems=libvirt-debian-9/ws/> [libvirt-go-xml-master] $ /bin/sh -xe /tmp/jenkins8927366369508772538.sh + export TEST_ARGS=-tags xmlroundtrip + go test -tags xmlroundtrip --- FAIL: TestRoundTrip (7.68s) xml_test.go:383: testdata/libvirt/tests/storagevolxml2xmlin/vol-luks-convert.xml: /volume[0]/source[0]: element in expected XML missing in actual XML FAIL exit status 1 FAIL _<https://ci.centos.org/job/libvirt-go-xml-master-check/systems=libvirt-debian-9/ws/> 7.711s Build step 'Execute shell' marked build as failure

See <https://ci.centos.org/job/libvirt-go-xml-master-check/systems=libvirt-debian-9/487/display/redirect> ------------------------------------------ Started by upstream project "libvirt-go-xml-master-check" build number 487 originally caused by: Started by upstream project "libvirt-go-xml-master-build" build number 496 originally caused by: Started by upstream project "libvirt-master-build" build number 1547 originally caused by: Started by an SCM change [EnvInject] - Loading node environment variables. Building remotely on libvirt-debian-9 (libvirt) in workspace <https://ci.centos.org/job/libvirt-go-xml-master-check/systems=libvirt-debian-9/ws/> [libvirt-go-xml-master] $ /bin/sh -xe /tmp/jenkins5949896490193998031.sh + export TEST_ARGS=-tags xmlroundtrip + go test -tags xmlroundtrip --- FAIL: TestRoundTrip (7.92s) xml_test.go:383: testdata/libvirt/tests/storagevolxml2xmlin/vol-luks-convert.xml: /volume[0]/source[0]: element in expected XML missing in actual XML FAIL exit status 1 FAIL _<https://ci.centos.org/job/libvirt-go-xml-master-check/systems=libvirt-debian-9/ws/> 7.967s Build step 'Execute shell' marked build as failure

See <https://ci.centos.org/job/libvirt-go-xml-master-check/systems=libvirt-debian-9/488/display/redirect> ------------------------------------------ Started by upstream project "libvirt-go-xml-master-check" build number 488 originally caused by: Started by upstream project "libvirt-go-xml-master-build" build number 497 originally caused by: Started by upstream project "libvirt-master-build" build number 1548 originally caused by: Started by an SCM change [EnvInject] - Loading node environment variables. Building remotely on libvirt-debian-9 (libvirt) in workspace <https://ci.centos.org/job/libvirt-go-xml-master-check/systems=libvirt-debian-9/ws/> [libvirt-go-xml-master] $ /bin/sh -xe /tmp/jenkins7627877112020067267.sh + export TEST_ARGS=-tags xmlroundtrip + go test -tags xmlroundtrip --- FAIL: TestRoundTrip (6.13s) xml_test.go:383: testdata/libvirt/tests/storagevolxml2xmlin/vol-luks-convert.xml: /volume[0]/source[0]: element in expected XML missing in actual XML FAIL exit status 1 FAIL _<https://ci.centos.org/job/libvirt-go-xml-master-check/systems=libvirt-debian-9/ws/> 6.178s Build step 'Execute shell' marked build as failure

See <https://ci.centos.org/job/libvirt-go-xml-master-check/systems=libvirt-debian-9/489/display/redirect> ------------------------------------------ Started by upstream project "libvirt-go-xml-master-check" build number 489 originally caused by: Started by upstream project "libvirt-go-xml-master-build" build number 498 originally caused by: Started by upstream project "libvirt-master-build" build number 1549 originally caused by: Started by an SCM change Started by an SCM change Started by an SCM change [EnvInject] - Loading node environment variables. Building remotely on libvirt-debian-9 (libvirt) in workspace <https://ci.centos.org/job/libvirt-go-xml-master-check/systems=libvirt-debian-9/ws/> [libvirt-go-xml-master] $ /bin/sh -xe /tmp/jenkins3775266388229861665.sh + export TEST_ARGS=-tags xmlroundtrip + go test -tags xmlroundtrip --- FAIL: TestRoundTrip (34.83s) xml_test.go:383: testdata/libvirt/tests/storagevolxml2xmlin/vol-luks-convert.xml: /volume[0]/source[0]: element in expected XML missing in actual XML FAIL exit status 1 FAIL _<https://ci.centos.org/job/libvirt-go-xml-master-check/systems=libvirt-debian-9/ws/> 35.034s Build step 'Execute shell' marked build as failure

participants (1)
-
ci@centos.org