[Libvirt-ci] Build failed in Jenkins: libvirt-go-master-check » libvirt-debian-9 #1057

See <https://ci.centos.org/job/libvirt-go-master-check/systems=libvirt-debian-9/1057/display/redirect> ------------------------------------------ Started by upstream project "libvirt-go-master-check" build number 1057 originally caused by: Started by upstream project "libvirt-go-master-build" build number 1068 originally caused by: Started by upstream project "libvirt-master-build" build number 1465 originally caused by: Started by an SCM change [EnvInject] - Loading node environment variables. Building remotely on libvirt-debian-9 (libvirt) in workspace <https://ci.centos.org/job/libvirt-go-master-check/systems=libvirt-debian-9/ws/> [libvirt-go-master] $ /bin/sh -xe /tmp/jenkins8380017685492686685.sh + export TEST_ARGS=-tags api + go test -tags api 2018-05-28 12:26:47.499+0000: 8795: info : libvirt version: 4.4.0 2018-05-28 12:26:47.499+0000: 8795: info : hostname: libvirt-debian-9 2018-05-28 12:26:47.499+0000: 8795: warning : virEventRegisterImpl:245 : Ignoring attempt to replace registered event loop 2018-05-28 12:26:47.505+0000: 8795: warning : virEventRegisterImpl:245 : Ignoring attempt to replace registered event loop 2018-05-28 12:26:47.505+0000: 8795: warning : virEventRegisterImpl:245 : Ignoring attempt to replace registered event loop Missing function 'virDomainDetachDeviceAlias' --- FAIL: TestAPICoverage (0.65s) panic: Missing symbols found [recovered] panic: Missing symbols found goroutine 5 [running]: panic(0x5580d0891640, 0xc42000c810) /usr/lib/go-1.7/src/runtime/panic.go:500 +0x1a1 testing.tRunner.func1(0xc42007a180) /usr/lib/go-1.7/src/testing/testing.go:579 +0x25d panic(0x5580d0891640, 0xc42000c810) /usr/lib/go-1.7/src/runtime/panic.go:458 +0x243 _<https://ci.centos.org/job/libvirt-go-master-check/systems=libvirt-debian-9/ws/.TestAPICoverage(0xc42007a180)> <https://ci.centos.org/job/libvirt-go-master-check/systems=libvirt-debian-9/ws/api_test.go>:504 +0x5ff testing.tRunner(0xc42007a180, 0x5580d08e4e48) /usr/lib/go-1.7/src/testing/testing.go:610 +0x81 created by testing.(*T).Run /usr/lib/go-1.7/src/testing/testing.go:646 +0x2ec exit status 2 FAIL _<https://ci.centos.org/job/libvirt-go-master-check/systems=libvirt-debian-9/ws/> 0.762s Build step 'Execute shell' marked build as failure

See <https://ci.centos.org/job/libvirt-go-master-check/systems=libvirt-debian-9/1058/display/redirect> ------------------------------------------ Started by upstream project "libvirt-go-master-check" build number 1058 originally caused by: Started by upstream project "libvirt-go-master-build" build number 1069 originally caused by: Started by upstream project "libvirt-master-build" build number 1466 originally caused by: Started by an SCM change [EnvInject] - Loading node environment variables. Building remotely on libvirt-debian-9 (libvirt) in workspace <https://ci.centos.org/job/libvirt-go-master-check/systems=libvirt-debian-9/ws/> [libvirt-go-master] $ /bin/sh -xe /tmp/jenkins1671151297767477925.sh + export TEST_ARGS=-tags api + go test -tags api 2018-05-28 15:27:04.836+0000: 13694: info : libvirt version: 4.4.0 2018-05-28 15:27:04.836+0000: 13694: info : hostname: libvirt-debian-9 2018-05-28 15:27:04.836+0000: 13694: warning : virEventRegisterImpl:245 : Ignoring attempt to replace registered event loop 2018-05-28 15:27:04.837+0000: 13694: warning : virEventRegisterImpl:245 : Ignoring attempt to replace registered event loop 2018-05-28 15:27:04.837+0000: 13694: warning : virEventRegisterImpl:245 : Ignoring attempt to replace registered event loop Missing function 'virConnectBaselineHypervisorCPU' Missing function 'virConnectCompareHypervisorCPU' Missing function 'virDomainDetachDeviceAlias' --- FAIL: TestAPICoverage (0.85s) panic: Missing symbols found [recovered] panic: Missing symbols found goroutine 5 [running]: panic(0x562f3486a640, 0xc42012e980) /usr/lib/go-1.7/src/runtime/panic.go:500 +0x1a1 testing.tRunner.func1(0xc42007a180) /usr/lib/go-1.7/src/testing/testing.go:579 +0x25d panic(0x562f3486a640, 0xc42012e980) /usr/lib/go-1.7/src/runtime/panic.go:458 +0x243 _<https://ci.centos.org/job/libvirt-go-master-check/systems=libvirt-debian-9/ws/.TestAPICoverage(0xc42007a180)> <https://ci.centos.org/job/libvirt-go-master-check/systems=libvirt-debian-9/ws/api_test.go>:504 +0x5ff testing.tRunner(0xc42007a180, 0x562f348bde48) /usr/lib/go-1.7/src/testing/testing.go:610 +0x81 created by testing.(*T).Run /usr/lib/go-1.7/src/testing/testing.go:646 +0x2ec exit status 2 FAIL _<https://ci.centos.org/job/libvirt-go-master-check/systems=libvirt-debian-9/ws/> 0.985s Build step 'Execute shell' marked build as failure

See <https://ci.centos.org/job/libvirt-go-master-check/systems=libvirt-debian-9/1059/display/redirect> ------------------------------------------ Started by upstream project "libvirt-go-master-check" build number 1059 originally caused by: Started by upstream project "libvirt-go-master-build" build number 1070 originally caused by: Started by upstream project "libvirt-master-build" build number 1467 originally caused by: Started by an SCM change Started by an SCM change [EnvInject] - Loading node environment variables. Building remotely on libvirt-debian-9 (libvirt) in workspace <https://ci.centos.org/job/libvirt-go-master-check/systems=libvirt-debian-9/ws/> [libvirt-go-master] $ /bin/sh -xe /tmp/jenkins1752866227977298513.sh + export TEST_ARGS=-tags api + go test -tags api 2018-05-28 16:51:18.097+0000: 10239: info : libvirt version: 4.4.0 2018-05-28 16:51:18.097+0000: 10239: info : hostname: libvirt-debian-9 2018-05-28 16:51:18.097+0000: 10239: warning : virEventRegisterImpl:245 : Ignoring attempt to replace registered event loop 2018-05-28 16:51:18.098+0000: 10239: warning : virEventRegisterImpl:245 : Ignoring attempt to replace registered event loop 2018-05-28 16:51:18.098+0000: 10239: warning : virEventRegisterImpl:245 : Ignoring attempt to replace registered event loop Missing function 'virConnectBaselineHypervisorCPU' Missing function 'virConnectCompareHypervisorCPU' Missing function 'virDomainDetachDeviceAlias' --- FAIL: TestAPICoverage (1.13s) panic: Missing symbols found [recovered] panic: Missing symbols found goroutine 5 [running]: panic(0x55e1361a6640, 0xc42000c9a0) /usr/lib/go-1.7/src/runtime/panic.go:500 +0x1a1 testing.tRunner.func1(0xc42007a180) /usr/lib/go-1.7/src/testing/testing.go:579 +0x25d panic(0x55e1361a6640, 0xc42000c9a0) /usr/lib/go-1.7/src/runtime/panic.go:458 +0x243 _<https://ci.centos.org/job/libvirt-go-master-check/systems=libvirt-debian-9/ws/.TestAPICoverage(0xc42007a180)> <https://ci.centos.org/job/libvirt-go-master-check/systems=libvirt-debian-9/ws/api_test.go>:504 +0x5ff testing.tRunner(0xc42007a180, 0x55e1361f9e48) /usr/lib/go-1.7/src/testing/testing.go:610 +0x81 created by testing.(*T).Run /usr/lib/go-1.7/src/testing/testing.go:646 +0x2ec exit status 2 FAIL _<https://ci.centos.org/job/libvirt-go-master-check/systems=libvirt-debian-9/ws/> 1.309s Build step 'Execute shell' marked build as failure

See <https://ci.centos.org/job/libvirt-go-master-check/systems=libvirt-debian-9/1060/display/redirect> ------------------------------------------ Started by upstream project "libvirt-go-master-check" build number 1060 originally caused by: Started by upstream project "libvirt-go-master-build" build number 1071 originally caused by: Started by upstream project "libvirt-master-build" build number 1468 originally caused by: Started by an SCM change [EnvInject] - Loading node environment variables. Building remotely on libvirt-debian-9 (libvirt) in workspace <https://ci.centos.org/job/libvirt-go-master-check/systems=libvirt-debian-9/ws/> [libvirt-go-master] $ /bin/sh -xe /tmp/jenkins5307965998268842357.sh + export TEST_ARGS=-tags api + go test -tags api 2018-05-29 09:48:42.795+0000: 3109: info : libvirt version: 4.4.0 2018-05-29 09:48:42.795+0000: 3109: info : hostname: libvirt-debian-9 2018-05-29 09:48:42.795+0000: 3109: warning : virEventRegisterImpl:245 : Ignoring attempt to replace registered event loop 2018-05-29 09:48:42.804+0000: 3109: warning : virEventRegisterImpl:245 : Ignoring attempt to replace registered event loop 2018-05-29 09:48:42.804+0000: 3109: warning : virEventRegisterImpl:245 : Ignoring attempt to replace registered event loop Missing function 'virConnectBaselineHypervisorCPU' Missing function 'virConnectCompareHypervisorCPU' Missing function 'virDomainDetachDeviceAlias' --- FAIL: TestAPICoverage (0.94s) panic: Missing symbols found [recovered] panic: Missing symbols found goroutine 5 [running]: panic(0x5654dd751640, 0xc42013c330) /usr/lib/go-1.7/src/runtime/panic.go:500 +0x1a1 testing.tRunner.func1(0xc42007a180) /usr/lib/go-1.7/src/testing/testing.go:579 +0x25d panic(0x5654dd751640, 0xc42013c330) /usr/lib/go-1.7/src/runtime/panic.go:458 +0x243 _<https://ci.centos.org/job/libvirt-go-master-check/systems=libvirt-debian-9/ws/.TestAPICoverage(0xc42007a180)> <https://ci.centos.org/job/libvirt-go-master-check/systems=libvirt-debian-9/ws/api_test.go>:504 +0x5ff testing.tRunner(0xc42007a180, 0x5654dd7a4e48) /usr/lib/go-1.7/src/testing/testing.go:610 +0x81 created by testing.(*T).Run /usr/lib/go-1.7/src/testing/testing.go:646 +0x2ec exit status 2 FAIL _<https://ci.centos.org/job/libvirt-go-master-check/systems=libvirt-debian-9/ws/> 1.055s Build step 'Execute shell' marked build as failure

See <https://ci.centos.org/job/libvirt-go-master-check/systems=libvirt-debian-9/1061/display/redirect> ------------------------------------------ Started by upstream project "libvirt-go-master-check" build number 1061 originally caused by: Started by upstream project "libvirt-go-master-build" build number 1072 originally caused by: Started by upstream project "libvirt-master-build" build number 1469 originally caused by: Started by an SCM change [EnvInject] - Loading node environment variables. Building remotely on libvirt-debian-9 (libvirt) in workspace <https://ci.centos.org/job/libvirt-go-master-check/systems=libvirt-debian-9/ws/> [libvirt-go-master] $ /bin/sh -xe /tmp/jenkins2658524862285662897.sh + export TEST_ARGS=-tags api + go test -tags api 2018-05-29 13:30:14.119+0000: 4222: info : libvirt version: 4.4.0 2018-05-29 13:30:14.119+0000: 4222: info : hostname: libvirt-debian-9 2018-05-29 13:30:14.119+0000: 4222: warning : virEventRegisterImpl:245 : Ignoring attempt to replace registered event loop 2018-05-29 13:30:14.120+0000: 4222: warning : virEventRegisterImpl:245 : Ignoring attempt to replace registered event loop 2018-05-29 13:30:14.120+0000: 4222: warning : virEventRegisterImpl:245 : Ignoring attempt to replace registered event loop Missing function 'virConnectBaselineHypervisorCPU' Missing function 'virConnectCompareHypervisorCPU' Missing function 'virDomainDetachDeviceAlias' --- FAIL: TestAPICoverage (0.60s) panic: Missing symbols found [recovered] panic: Missing symbols found goroutine 5 [running]: panic(0x556938e36640, 0xc42000cf00) /usr/lib/go-1.7/src/runtime/panic.go:500 +0x1a1 testing.tRunner.func1(0xc42007a180) /usr/lib/go-1.7/src/testing/testing.go:579 +0x25d panic(0x556938e36640, 0xc42000cf00) /usr/lib/go-1.7/src/runtime/panic.go:458 +0x243 _<https://ci.centos.org/job/libvirt-go-master-check/systems=libvirt-debian-9/ws/.TestAPICoverage(0xc42007a180)> <https://ci.centos.org/job/libvirt-go-master-check/systems=libvirt-debian-9/ws/api_test.go>:504 +0x5ff testing.tRunner(0xc42007a180, 0x556938e89e48) /usr/lib/go-1.7/src/testing/testing.go:610 +0x81 created by testing.(*T).Run /usr/lib/go-1.7/src/testing/testing.go:646 +0x2ec exit status 2 FAIL _<https://ci.centos.org/job/libvirt-go-master-check/systems=libvirt-debian-9/ws/> 0.875s Build step 'Execute shell' marked build as failure

See <https://ci.centos.org/job/libvirt-go-master-check/systems=libvirt-debian-9/1062/display/redirect> ------------------------------------------ Started by upstream project "libvirt-go-master-check" build number 1062 originally caused by: Started by upstream project "libvirt-go-master-build" build number 1073 originally caused by: Started by upstream project "libvirt-master-build" build number 1470 originally caused by: Started by an SCM change [EnvInject] - Loading node environment variables. Building remotely on libvirt-debian-9 (libvirt) in workspace <https://ci.centos.org/job/libvirt-go-master-check/systems=libvirt-debian-9/ws/> [libvirt-go-master] $ /bin/sh -xe /tmp/jenkins2335664855951745729.sh + export TEST_ARGS=-tags api + go test -tags api 2018-05-29 15:13:23.193+0000: 9141: info : libvirt version: 4.4.0 2018-05-29 15:13:23.193+0000: 9141: info : hostname: libvirt-debian-9 2018-05-29 15:13:23.193+0000: 9141: warning : virEventRegisterImpl:245 : Ignoring attempt to replace registered event loop 2018-05-29 15:13:23.194+0000: 9141: warning : virEventRegisterImpl:245 : Ignoring attempt to replace registered event loop 2018-05-29 15:13:23.194+0000: 9141: warning : virEventRegisterImpl:245 : Ignoring attempt to replace registered event loop Missing function 'virConnectBaselineHypervisorCPU' Missing function 'virConnectCompareHypervisorCPU' Missing function 'virDomainDetachDeviceAlias' --- FAIL: TestAPICoverage (0.21s) panic: Missing symbols found [recovered] panic: Missing symbols found goroutine 19 [running]: panic(0x55fec8b21640, 0xc42000cb60) /usr/lib/go-1.7/src/runtime/panic.go:500 +0x1a1 testing.tRunner.func1(0xc420088180) /usr/lib/go-1.7/src/testing/testing.go:579 +0x25d panic(0x55fec8b21640, 0xc42000cb60) /usr/lib/go-1.7/src/runtime/panic.go:458 +0x243 _<https://ci.centos.org/job/libvirt-go-master-check/systems=libvirt-debian-9/ws/.TestAPICoverage(0xc420088180)> <https://ci.centos.org/job/libvirt-go-master-check/systems=libvirt-debian-9/ws/api_test.go>:504 +0x5ff testing.tRunner(0xc420088180, 0x55fec8b74e48) /usr/lib/go-1.7/src/testing/testing.go:610 +0x81 created by testing.(*T).Run /usr/lib/go-1.7/src/testing/testing.go:646 +0x2ec exit status 2 FAIL _<https://ci.centos.org/job/libvirt-go-master-check/systems=libvirt-debian-9/ws/> 0.252s Build step 'Execute shell' marked build as failure

See <https://ci.centos.org/job/libvirt-go-master-check/systems=libvirt-debian-9/1063/display/redirect> ------------------------------------------ Started by upstream project "libvirt-go-master-check" build number 1063 originally caused by: Started by upstream project "libvirt-go-master-build" build number 1074 originally caused by: Started by upstream project "libvirt-master-build" build number 1471 originally caused by: Started by an SCM change Started by an SCM change [EnvInject] - Loading node environment variables. Building remotely on libvirt-debian-9 (libvirt) in workspace <https://ci.centos.org/job/libvirt-go-master-check/systems=libvirt-debian-9/ws/> [libvirt-go-master] $ /bin/sh -xe /tmp/jenkins1138377157214755889.sh + export TEST_ARGS=-tags api + go test -tags api 2018-05-29 16:10:42.920+0000: 32169: info : libvirt version: 4.4.0 2018-05-29 16:10:42.920+0000: 32169: info : hostname: libvirt-debian-9 2018-05-29 16:10:42.920+0000: 32169: warning : virEventRegisterImpl:245 : Ignoring attempt to replace registered event loop 2018-05-29 16:10:42.920+0000: 32169: warning : virEventRegisterImpl:245 : Ignoring attempt to replace registered event loop 2018-05-29 16:10:42.920+0000: 32169: warning : virEventRegisterImpl:245 : Ignoring attempt to replace registered event loop Missing function 'virConnectBaselineHypervisorCPU' Missing function 'virConnectCompareHypervisorCPU' Missing function 'virDomainDetachDeviceAlias' --- FAIL: TestAPICoverage (1.09s) panic: Missing symbols found [recovered] panic: Missing symbols found goroutine 5 [running]: panic(0x55b47ae95640, 0xc420114040) /usr/lib/go-1.7/src/runtime/panic.go:500 +0x1a1 testing.tRunner.func1(0xc42007a180) /usr/lib/go-1.7/src/testing/testing.go:579 +0x25d panic(0x55b47ae95640, 0xc420114040) /usr/lib/go-1.7/src/runtime/panic.go:458 +0x243 _<https://ci.centos.org/job/libvirt-go-master-check/systems=libvirt-debian-9/ws/.TestAPICoverage(0xc42007a180)> <https://ci.centos.org/job/libvirt-go-master-check/systems=libvirt-debian-9/ws/api_test.go>:504 +0x5ff testing.tRunner(0xc42007a180, 0x55b47aee8e48) /usr/lib/go-1.7/src/testing/testing.go:610 +0x81 created by testing.(*T).Run /usr/lib/go-1.7/src/testing/testing.go:646 +0x2ec exit status 2 FAIL _<https://ci.centos.org/job/libvirt-go-master-check/systems=libvirt-debian-9/ws/> 1.247s Build step 'Execute shell' marked build as failure

See <https://ci.centos.org/job/libvirt-go-master-check/systems=libvirt-debian-9/1064/display/redirect> ------------------------------------------ Started by upstream project "libvirt-go-master-check" build number 1064 originally caused by: Started by upstream project "libvirt-go-master-build" build number 1075 originally caused by: Started by upstream project "libvirt-master-build" build number 1472 originally caused by: Started by an SCM change [EnvInject] - Loading node environment variables. Building remotely on libvirt-debian-9 (libvirt) in workspace <https://ci.centos.org/job/libvirt-go-master-check/systems=libvirt-debian-9/ws/> [libvirt-go-master] $ /bin/sh -xe /tmp/jenkins5371878210199077226.sh + export TEST_ARGS=-tags api + go test -tags api 2018-05-30 10:20:07.663+0000: 5509: info : libvirt version: 4.4.0 2018-05-30 10:20:07.663+0000: 5509: info : hostname: libvirt-debian-9 2018-05-30 10:20:07.663+0000: 5509: warning : virEventRegisterImpl:245 : Ignoring attempt to replace registered event loop 2018-05-30 10:20:07.664+0000: 5509: warning : virEventRegisterImpl:245 : Ignoring attempt to replace registered event loop 2018-05-30 10:20:07.664+0000: 5509: warning : virEventRegisterImpl:245 : Ignoring attempt to replace registered event loop Missing function 'virConnectBaselineHypervisorCPU' Missing function 'virConnectCompareHypervisorCPU' Missing function 'virDomainDetachDeviceAlias' --- FAIL: TestAPICoverage (0.64s) panic: Missing symbols found [recovered] panic: Missing symbols found goroutine 5 [running]: panic(0x55c94cb84640, 0xc420154460) /usr/lib/go-1.7/src/runtime/panic.go:500 +0x1a1 testing.tRunner.func1(0xc42007a180) /usr/lib/go-1.7/src/testing/testing.go:579 +0x25d panic(0x55c94cb84640, 0xc420154460) /usr/lib/go-1.7/src/runtime/panic.go:458 +0x243 _<https://ci.centos.org/job/libvirt-go-master-check/systems=libvirt-debian-9/ws/.TestAPICoverage(0xc42007a180)> <https://ci.centos.org/job/libvirt-go-master-check/systems=libvirt-debian-9/ws/api_test.go>:504 +0x5ff testing.tRunner(0xc42007a180, 0x55c94cbd7e48) /usr/lib/go-1.7/src/testing/testing.go:610 +0x81 created by testing.(*T).Run /usr/lib/go-1.7/src/testing/testing.go:646 +0x2ec exit status 2 FAIL _<https://ci.centos.org/job/libvirt-go-master-check/systems=libvirt-debian-9/ws/> 0.802s Build step 'Execute shell' marked build as failure

See <https://ci.centos.org/job/libvirt-go-master-check/systems=libvirt-debian-9/1065/display/redirect> ------------------------------------------ Started by upstream project "libvirt-go-master-check" build number 1065 originally caused by: Started by upstream project "libvirt-go-master-build" build number 1076 originally caused by: Started by upstream project "libvirt-master-build" build number 1473 originally caused by: Started by an SCM change [EnvInject] - Loading node environment variables. Building remotely on libvirt-debian-9 (libvirt) in workspace <https://ci.centos.org/job/libvirt-go-master-check/systems=libvirt-debian-9/ws/> [libvirt-go-master] $ /bin/sh -xe /tmp/jenkins4048341277956955370.sh + export TEST_ARGS=-tags api + go test -tags api 2018-05-30 14:51:05.755+0000: 2283: info : libvirt version: 4.4.0 2018-05-30 14:51:05.755+0000: 2283: info : hostname: libvirt-debian-9 2018-05-30 14:51:05.755+0000: 2283: warning : virEventRegisterImpl:245 : Ignoring attempt to replace registered event loop 2018-05-30 14:51:05.756+0000: 2283: warning : virEventRegisterImpl:245 : Ignoring attempt to replace registered event loop 2018-05-30 14:51:05.756+0000: 2283: warning : virEventRegisterImpl:245 : Ignoring attempt to replace registered event loop Missing function 'virConnectBaselineHypervisorCPU' Missing function 'virConnectCompareHypervisorCPU' Missing function 'virDomainDetachDeviceAlias' --- FAIL: TestAPICoverage (0.55s) panic: Missing symbols found [recovered] panic: Missing symbols found goroutine 5 [running]: panic(0x5606d3b38640, 0xc42010c5b0) /usr/lib/go-1.7/src/runtime/panic.go:500 +0x1a1 testing.tRunner.func1(0xc42007a180) /usr/lib/go-1.7/src/testing/testing.go:579 +0x25d panic(0x5606d3b38640, 0xc42010c5b0) /usr/lib/go-1.7/src/runtime/panic.go:458 +0x243 _<https://ci.centos.org/job/libvirt-go-master-check/systems=libvirt-debian-9/ws/.TestAPICoverage(0xc42007a180)> <https://ci.centos.org/job/libvirt-go-master-check/systems=libvirt-debian-9/ws/api_test.go>:504 +0x5ff testing.tRunner(0xc42007a180, 0x5606d3b8be48) /usr/lib/go-1.7/src/testing/testing.go:610 +0x81 created by testing.(*T).Run /usr/lib/go-1.7/src/testing/testing.go:646 +0x2ec exit status 2 FAIL _<https://ci.centos.org/job/libvirt-go-master-check/systems=libvirt-debian-9/ws/> 0.731s Build step 'Execute shell' marked build as failure

See <https://ci.centos.org/job/libvirt-go-master-check/systems=libvirt-debian-9/1066/display/redirect> ------------------------------------------ Started by upstream project "libvirt-go-master-check" build number 1066 originally caused by: Started by upstream project "libvirt-go-master-build" build number 1077 originally caused by: Started by upstream project "libvirt-master-build" build number 1474 originally caused by: Started by an SCM change Started by an SCM change Started by an SCM change [EnvInject] - Loading node environment variables. Building remotely on libvirt-debian-9 (libvirt) in workspace <https://ci.centos.org/job/libvirt-go-master-check/systems=libvirt-debian-9/ws/> [libvirt-go-master] $ /bin/sh -xe /tmp/jenkins3445411743965873830.sh + export TEST_ARGS=-tags api + go test -tags api 2018-05-30 15:57:53.302+0000: 31921: info : libvirt version: 4.4.0 2018-05-30 15:57:53.302+0000: 31921: info : hostname: libvirt-debian-9 2018-05-30 15:57:53.302+0000: 31921: warning : virEventRegisterImpl:245 : Ignoring attempt to replace registered event loop 2018-05-30 15:57:53.303+0000: 31921: warning : virEventRegisterImpl:245 : Ignoring attempt to replace registered event loop 2018-05-30 15:57:53.303+0000: 31921: warning : virEventRegisterImpl:245 : Ignoring attempt to replace registered event loop Missing function 'virConnectBaselineHypervisorCPU' Missing function 'virConnectCompareHypervisorCPU' Missing function 'virDomainDetachDeviceAlias' --- FAIL: TestAPICoverage (0.56s) panic: Missing symbols found [recovered] panic: Missing symbols found goroutine 5 [running]: panic(0x556a8f5d6640, 0xc420114070) /usr/lib/go-1.7/src/runtime/panic.go:500 +0x1a1 testing.tRunner.func1(0xc42007a180) /usr/lib/go-1.7/src/testing/testing.go:579 +0x25d panic(0x556a8f5d6640, 0xc420114070) /usr/lib/go-1.7/src/runtime/panic.go:458 +0x243 _<https://ci.centos.org/job/libvirt-go-master-check/systems=libvirt-debian-9/ws/.TestAPICoverage(0xc42007a180)> <https://ci.centos.org/job/libvirt-go-master-check/systems=libvirt-debian-9/ws/api_test.go>:504 +0x5ff testing.tRunner(0xc42007a180, 0x556a8f629e48) /usr/lib/go-1.7/src/testing/testing.go:610 +0x81 created by testing.(*T).Run /usr/lib/go-1.7/src/testing/testing.go:646 +0x2ec exit status 2 FAIL _<https://ci.centos.org/job/libvirt-go-master-check/systems=libvirt-debian-9/ws/> 0.655s Build step 'Execute shell' marked build as failure

See <https://ci.centos.org/job/libvirt-go-master-check/systems=libvirt-debian-9/1067/display/redirect> ------------------------------------------ Started by upstream project "libvirt-go-master-check" build number 1067 originally caused by: Started by upstream project "libvirt-go-master-build" build number 1078 originally caused by: Started by upstream project "libvirt-master-build" build number 1475 originally caused by: Started by an SCM change [EnvInject] - Loading node environment variables. Building remotely on libvirt-debian-9 (libvirt) in workspace <https://ci.centos.org/job/libvirt-go-master-check/systems=libvirt-debian-9/ws/> [libvirt-go-master] $ /bin/sh -xe /tmp/jenkins2407669319400102640.sh + export TEST_ARGS=-tags api + go test -tags api 2018-05-31 08:28:10.067+0000: 27149: info : libvirt version: 4.4.0 2018-05-31 08:28:10.067+0000: 27149: info : hostname: libvirt-debian-9 2018-05-31 08:28:10.067+0000: 27149: warning : virEventRegisterImpl:245 : Ignoring attempt to replace registered event loop 2018-05-31 08:28:10.067+0000: 27149: warning : virEventRegisterImpl:245 : Ignoring attempt to replace registered event loop 2018-05-31 08:28:10.067+0000: 27149: warning : virEventRegisterImpl:245 : Ignoring attempt to replace registered event loop Missing function 'virConnectBaselineHypervisorCPU' Missing function 'virConnectCompareHypervisorCPU' Missing function 'virDomainDetachDeviceAlias' --- FAIL: TestAPICoverage (0.83s) panic: Missing symbols found [recovered] panic: Missing symbols found goroutine 5 [running]: panic(0x56050b5af640, 0xc420100b10) /usr/lib/go-1.7/src/runtime/panic.go:500 +0x1a1 testing.tRunner.func1(0xc42007a180) /usr/lib/go-1.7/src/testing/testing.go:579 +0x25d panic(0x56050b5af640, 0xc420100b10) /usr/lib/go-1.7/src/runtime/panic.go:458 +0x243 _<https://ci.centos.org/job/libvirt-go-master-check/systems=libvirt-debian-9/ws/.TestAPICoverage(0xc42007a180)> <https://ci.centos.org/job/libvirt-go-master-check/systems=libvirt-debian-9/ws/api_test.go>:504 +0x5ff testing.tRunner(0xc42007a180, 0x56050b602e48) /usr/lib/go-1.7/src/testing/testing.go:610 +0x81 created by testing.(*T).Run /usr/lib/go-1.7/src/testing/testing.go:646 +0x2ec exit status 2 FAIL _<https://ci.centos.org/job/libvirt-go-master-check/systems=libvirt-debian-9/ws/> 0.984s Build step 'Execute shell' marked build as failure

See <https://ci.centos.org/job/libvirt-go-master-check/systems=libvirt-debian-9/1068/display/redirect> ------------------------------------------ Started by upstream project "libvirt-go-master-check" build number 1068 originally caused by: Started by upstream project "libvirt-go-master-build" build number 1079 originally caused by: Started by upstream project "libvirt-master-build" build number 1476 originally caused by: Started by an SCM change [EnvInject] - Loading node environment variables. Building remotely on libvirt-debian-9 (libvirt) in workspace <https://ci.centos.org/job/libvirt-go-master-check/systems=libvirt-debian-9/ws/> [libvirt-go-master] $ /bin/sh -xe /tmp/jenkins1907948191819233859.sh + export TEST_ARGS=-tags api + go test -tags api 2018-05-31 10:29:48.387+0000: 24488: info : libvirt version: 4.4.0 2018-05-31 10:29:48.387+0000: 24488: info : hostname: libvirt-debian-9 2018-05-31 10:29:48.387+0000: 24488: warning : virEventRegisterImpl:245 : Ignoring attempt to replace registered event loop 2018-05-31 10:29:48.387+0000: 24488: warning : virEventRegisterImpl:245 : Ignoring attempt to replace registered event loop 2018-05-31 10:29:48.387+0000: 24488: warning : virEventRegisterImpl:245 : Ignoring attempt to replace registered event loop Missing function 'virConnectBaselineHypervisorCPU' Missing function 'virConnectCompareHypervisorCPU' Missing function 'virDomainDetachDeviceAlias' --- FAIL: TestAPICoverage (0.70s) panic: Missing symbols found [recovered] panic: Missing symbols found goroutine 5 [running]: panic(0x556e818cc640, 0xc4200b0b90) /usr/lib/go-1.7/src/runtime/panic.go:500 +0x1a1 testing.tRunner.func1(0xc42007a180) /usr/lib/go-1.7/src/testing/testing.go:579 +0x25d panic(0x556e818cc640, 0xc4200b0b90) /usr/lib/go-1.7/src/runtime/panic.go:458 +0x243 _<https://ci.centos.org/job/libvirt-go-master-check/systems=libvirt-debian-9/ws/.TestAPICoverage(0xc42007a180)> <https://ci.centos.org/job/libvirt-go-master-check/systems=libvirt-debian-9/ws/api_test.go>:504 +0x5ff testing.tRunner(0xc42007a180, 0x556e8191fe48) /usr/lib/go-1.7/src/testing/testing.go:610 +0x81 created by testing.(*T).Run /usr/lib/go-1.7/src/testing/testing.go:646 +0x2ec exit status 2 FAIL _<https://ci.centos.org/job/libvirt-go-master-check/systems=libvirt-debian-9/ws/> 0.797s Build step 'Execute shell' marked build as failure

See <https://ci.centos.org/job/libvirt-go-master-check/systems=libvirt-debian-9/1069/display/redirect> ------------------------------------------ Started by upstream project "libvirt-go-master-check" build number 1069 originally caused by: Started by upstream project "libvirt-go-master-build" build number 1080 originally caused by: Started by upstream project "libvirt-master-build" build number 1477 originally caused by: Started by an SCM change Started by an SCM change Started by an SCM change [EnvInject] - Loading node environment variables. Building remotely on libvirt-debian-9 (libvirt) in workspace <https://ci.centos.org/job/libvirt-go-master-check/systems=libvirt-debian-9/ws/> [libvirt-go-master] $ /bin/sh -xe /tmp/jenkins3987105352354883387.sh + export TEST_ARGS=-tags api + go test -tags api 2018-05-31 11:49:17.635+0000: 22147: info : libvirt version: 4.4.0 2018-05-31 11:49:17.635+0000: 22147: info : hostname: libvirt-debian-9 2018-05-31 11:49:17.635+0000: 22147: warning : virEventRegisterImpl:245 : Ignoring attempt to replace registered event loop 2018-05-31 11:49:17.635+0000: 22147: warning : virEventRegisterImpl:245 : Ignoring attempt to replace registered event loop 2018-05-31 11:49:17.635+0000: 22147: warning : virEventRegisterImpl:245 : Ignoring attempt to replace registered event loop Missing function 'virConnectBaselineHypervisorCPU' Missing function 'virConnectCompareHypervisorCPU' Missing function 'virDomainDetachDeviceAlias' --- FAIL: TestAPICoverage (0.63s) panic: Missing symbols found [recovered] panic: Missing symbols found goroutine 5 [running]: panic(0x559117b24640, 0xc42012e8f0) /usr/lib/go-1.7/src/runtime/panic.go:500 +0x1a1 testing.tRunner.func1(0xc42007a180) /usr/lib/go-1.7/src/testing/testing.go:579 +0x25d panic(0x559117b24640, 0xc42012e8f0) /usr/lib/go-1.7/src/runtime/panic.go:458 +0x243 _<https://ci.centos.org/job/libvirt-go-master-check/systems=libvirt-debian-9/ws/.TestAPICoverage(0xc42007a180)> <https://ci.centos.org/job/libvirt-go-master-check/systems=libvirt-debian-9/ws/api_test.go>:504 +0x5ff testing.tRunner(0xc42007a180, 0x559117b77e48) /usr/lib/go-1.7/src/testing/testing.go:610 +0x81 created by testing.(*T).Run /usr/lib/go-1.7/src/testing/testing.go:646 +0x2ec exit status 2 FAIL _<https://ci.centos.org/job/libvirt-go-master-check/systems=libvirt-debian-9/ws/> 0.722s Build step 'Execute shell' marked build as failure

See <https://ci.centos.org/job/libvirt-go-master-check/systems=libvirt-debian-9/1070/display/redirect> ------------------------------------------ Started by upstream project "libvirt-go-master-check" build number 1070 originally caused by: Started by upstream project "libvirt-go-master-build" build number 1081 originally caused by: Started by upstream project "libvirt-master-build" build number 1478 originally caused by: Started by an SCM change [EnvInject] - Loading node environment variables. Building remotely on libvirt-debian-9 (libvirt) in workspace <https://ci.centos.org/job/libvirt-go-master-check/systems=libvirt-debian-9/ws/> [libvirt-go-master] $ /bin/sh -xe /tmp/jenkins124459999776295954.sh + export TEST_ARGS=-tags api + go test -tags api 2018-05-31 14:19:54.743+0000: 19133: info : libvirt version: 4.4.0 2018-05-31 14:19:54.743+0000: 19133: info : hostname: libvirt-debian-9 2018-05-31 14:19:54.743+0000: 19133: warning : virEventRegisterImpl:245 : Ignoring attempt to replace registered event loop 2018-05-31 14:19:54.743+0000: 19133: warning : virEventRegisterImpl:245 : Ignoring attempt to replace registered event loop 2018-05-31 14:19:54.743+0000: 19133: warning : virEventRegisterImpl:245 : Ignoring attempt to replace registered event loop Missing function 'virConnectBaselineHypervisorCPU' Missing function 'virConnectCompareHypervisorCPU' Missing function 'virDomainDetachDeviceAlias' --- FAIL: TestAPICoverage (0.39s) panic: Missing symbols found [recovered] panic: Missing symbols found goroutine 5 [running]: panic(0x555bfe386640, 0xc42000caf0) /usr/lib/go-1.7/src/runtime/panic.go:500 +0x1a1 testing.tRunner.func1(0xc42007a180) /usr/lib/go-1.7/src/testing/testing.go:579 +0x25d panic(0x555bfe386640, 0xc42000caf0) /usr/lib/go-1.7/src/runtime/panic.go:458 +0x243 _<https://ci.centos.org/job/libvirt-go-master-check/systems=libvirt-debian-9/ws/.TestAPICoverage(0xc42007a180)> <https://ci.centos.org/job/libvirt-go-master-check/systems=libvirt-debian-9/ws/api_test.go>:504 +0x5ff testing.tRunner(0xc42007a180, 0x555bfe3d9e48) /usr/lib/go-1.7/src/testing/testing.go:610 +0x81 created by testing.(*T).Run /usr/lib/go-1.7/src/testing/testing.go:646 +0x2ec exit status 2 FAIL _<https://ci.centos.org/job/libvirt-go-master-check/systems=libvirt-debian-9/ws/> 0.494s Build step 'Execute shell' marked build as failure

See <https://ci.centos.org/job/libvirt-go-master-check/systems=libvirt-debian-9/1071/display/redirect> ------------------------------------------ Started by upstream project "libvirt-go-master-check" build number 1071 originally caused by: Started by upstream project "libvirt-go-master-build" build number 1082 originally caused by: Started by upstream project "libvirt-master-build" build number 1479 originally caused by: Started by an SCM change [EnvInject] - Loading node environment variables. Building remotely on libvirt-debian-9 (libvirt) in workspace <https://ci.centos.org/job/libvirt-go-master-check/systems=libvirt-debian-9/ws/> [libvirt-go-master] $ /bin/sh -xe /tmp/jenkins362274672156043930.sh + export TEST_ARGS=-tags api + go test -tags api 2018-05-31 15:46:39.906+0000: 17598: info : libvirt version: 4.4.0 2018-05-31 15:46:39.906+0000: 17598: info : hostname: libvirt-debian-9 2018-05-31 15:46:39.906+0000: 17598: warning : virEventRegisterImpl:245 : Ignoring attempt to replace registered event loop 2018-05-31 15:46:39.906+0000: 17598: warning : virEventRegisterImpl:245 : Ignoring attempt to replace registered event loop 2018-05-31 15:46:39.906+0000: 17598: warning : virEventRegisterImpl:245 : Ignoring attempt to replace registered event loop Missing function 'virConnectBaselineHypervisorCPU' Missing function 'virConnectCompareHypervisorCPU' Missing function 'virDomainDetachDeviceAlias' --- FAIL: TestAPICoverage (0.51s) panic: Missing symbols found [recovered] panic: Missing symbols found goroutine 5 [running]: panic(0x5617dd516640, 0xc42012e4f0) /usr/lib/go-1.7/src/runtime/panic.go:500 +0x1a1 testing.tRunner.func1(0xc42007a180) /usr/lib/go-1.7/src/testing/testing.go:579 +0x25d panic(0x5617dd516640, 0xc42012e4f0) /usr/lib/go-1.7/src/runtime/panic.go:458 +0x243 _<https://ci.centos.org/job/libvirt-go-master-check/systems=libvirt-debian-9/ws/.TestAPICoverage(0xc42007a180)> <https://ci.centos.org/job/libvirt-go-master-check/systems=libvirt-debian-9/ws/api_test.go>:504 +0x5ff testing.tRunner(0xc42007a180, 0x5617dd569e48) /usr/lib/go-1.7/src/testing/testing.go:610 +0x81 created by testing.(*T).Run /usr/lib/go-1.7/src/testing/testing.go:646 +0x2ec exit status 2 FAIL _<https://ci.centos.org/job/libvirt-go-master-check/systems=libvirt-debian-9/ws/> 0.578s Build step 'Execute shell' marked build as failure

See <https://ci.centos.org/job/libvirt-go-master-check/systems=libvirt-debian-9/1072/display/redirect> ------------------------------------------ Started by upstream project "libvirt-go-master-check" build number 1072 originally caused by: Started by upstream project "libvirt-go-master-build" build number 1083 originally caused by: Started by upstream project "libvirt-master-build" build number 1480 originally caused by: Started by an SCM change [EnvInject] - Loading node environment variables. Building remotely on libvirt-debian-9 (libvirt) in workspace <https://ci.centos.org/job/libvirt-go-master-check/systems=libvirt-debian-9/ws/> [libvirt-go-master] $ /bin/sh -xe /tmp/jenkins5994046565731438568.sh + export TEST_ARGS=-tags api + go test -tags api 2018-06-01 12:40:31.463+0000: 31189: info : libvirt version: 4.4.0 2018-06-01 12:40:31.463+0000: 31189: info : hostname: libvirt-debian-9 2018-06-01 12:40:31.463+0000: 31189: warning : virEventRegisterImpl:245 : Ignoring attempt to replace registered event loop 2018-06-01 12:40:31.463+0000: 31189: warning : virEventRegisterImpl:245 : Ignoring attempt to replace registered event loop 2018-06-01 12:40:31.463+0000: 31189: warning : virEventRegisterImpl:245 : Ignoring attempt to replace registered event loop Missing function 'virConnectBaselineHypervisorCPU' Missing function 'virConnectCompareHypervisorCPU' Missing function 'virDomainDetachDeviceAlias' --- FAIL: TestAPICoverage (1.52s) panic: Missing symbols found [recovered] panic: Missing symbols found goroutine 5 [running]: panic(0x5567612da640, 0xc420112b00) /usr/lib/go-1.7/src/runtime/panic.go:500 +0x1a1 testing.tRunner.func1(0xc42007a180) /usr/lib/go-1.7/src/testing/testing.go:579 +0x25d panic(0x5567612da640, 0xc420112b00) /usr/lib/go-1.7/src/runtime/panic.go:458 +0x243 _<https://ci.centos.org/job/libvirt-go-master-check/systems=libvirt-debian-9/ws/.TestAPICoverage(0xc42007a180)> <https://ci.centos.org/job/libvirt-go-master-check/systems=libvirt-debian-9/ws/api_test.go>:504 +0x5ff testing.tRunner(0xc42007a180, 0x55676132de48) /usr/lib/go-1.7/src/testing/testing.go:610 +0x81 created by testing.(*T).Run /usr/lib/go-1.7/src/testing/testing.go:646 +0x2ec exit status 2 FAIL _<https://ci.centos.org/job/libvirt-go-master-check/systems=libvirt-debian-9/ws/> 1.670s Build step 'Execute shell' marked build as failure

See <https://ci.centos.org/job/libvirt-go-master-check/systems=libvirt-debian-9/1073/display/redirect> ------------------------------------------ Started by upstream project "libvirt-go-master-check" build number 1073 originally caused by: Started by upstream project "libvirt-go-master-build" build number 1084 originally caused by: Started by upstream project "libvirt-master-build" build number 1481 originally caused by: Started by an SCM change Started by an SCM change [EnvInject] - Loading node environment variables. Building remotely on libvirt-debian-9 (libvirt) in workspace <https://ci.centos.org/job/libvirt-go-master-check/systems=libvirt-debian-9/ws/> [libvirt-go-master] $ /bin/sh -xe /tmp/jenkins4014007161044661952.sh + export TEST_ARGS=-tags api + go test -tags api 2018-06-01 13:59:14.247+0000: 7778: info : libvirt version: 4.4.0 2018-06-01 13:59:14.247+0000: 7778: info : hostname: libvirt-debian-9 2018-06-01 13:59:14.247+0000: 7778: warning : virEventRegisterImpl:245 : Ignoring attempt to replace registered event loop 2018-06-01 13:59:14.247+0000: 7778: warning : virEventRegisterImpl:245 : Ignoring attempt to replace registered event loop 2018-06-01 13:59:14.247+0000: 7778: warning : virEventRegisterImpl:245 : Ignoring attempt to replace registered event loop Missing function 'virConnectBaselineHypervisorCPU' Missing function 'virConnectCompareHypervisorCPU' Missing function 'virDomainDetachDeviceAlias' --- FAIL: TestAPICoverage (1.17s) panic: Missing symbols found [recovered] panic: Missing symbols found goroutine 5 [running]: panic(0x55ef43c46640, 0xc42000cf20) /usr/lib/go-1.7/src/runtime/panic.go:500 +0x1a1 testing.tRunner.func1(0xc42007a180) /usr/lib/go-1.7/src/testing/testing.go:579 +0x25d panic(0x55ef43c46640, 0xc42000cf20) /usr/lib/go-1.7/src/runtime/panic.go:458 +0x243 _<https://ci.centos.org/job/libvirt-go-master-check/systems=libvirt-debian-9/ws/.TestAPICoverage(0xc42007a180)> <https://ci.centos.org/job/libvirt-go-master-check/systems=libvirt-debian-9/ws/api_test.go>:504 +0x5ff testing.tRunner(0xc42007a180, 0x55ef43c99e48) /usr/lib/go-1.7/src/testing/testing.go:610 +0x81 created by testing.(*T).Run /usr/lib/go-1.7/src/testing/testing.go:646 +0x2ec exit status 2 FAIL _<https://ci.centos.org/job/libvirt-go-master-check/systems=libvirt-debian-9/ws/> 1.331s Build step 'Execute shell' marked build as failure

See <https://ci.centos.org/job/libvirt-go-master-check/systems=libvirt-debian-9/1074/display/redirect> ------------------------------------------ Started by upstream project "libvirt-go-master-check" build number 1074 originally caused by: Started by upstream project "libvirt-go-master-build" build number 1085 originally caused by: Started by upstream project "libvirt-master-build" build number 1482 originally caused by: Started by an SCM change [EnvInject] - Loading node environment variables. Building remotely on libvirt-debian-9 (libvirt) in workspace <https://ci.centos.org/job/libvirt-go-master-check/systems=libvirt-debian-9/ws/> [libvirt-go-master] $ /bin/sh -xe /tmp/jenkins7665375011705449403.sh + export TEST_ARGS=-tags api + go test -tags api 2018-06-01 16:31:51.159+0000: 1176: info : libvirt version: 4.4.0 2018-06-01 16:31:51.159+0000: 1176: info : hostname: libvirt-debian-9 2018-06-01 16:31:51.159+0000: 1176: warning : virEventRegisterImpl:245 : Ignoring attempt to replace registered event loop 2018-06-01 16:31:51.159+0000: 1176: warning : virEventRegisterImpl:245 : Ignoring attempt to replace registered event loop 2018-06-01 16:31:51.159+0000: 1176: warning : virEventRegisterImpl:245 : Ignoring attempt to replace registered event loop Missing function 'virConnectBaselineHypervisorCPU' Missing function 'virConnectCompareHypervisorCPU' Missing function 'virDomainDetachDeviceAlias' --- FAIL: TestAPICoverage (0.97s) panic: Missing symbols found [recovered] panic: Missing symbols found goroutine 5 [running]: panic(0x55cf0f6b3640, 0xc420108580) /usr/lib/go-1.7/src/runtime/panic.go:500 +0x1a1 testing.tRunner.func1(0xc42007a180) /usr/lib/go-1.7/src/testing/testing.go:579 +0x25d panic(0x55cf0f6b3640, 0xc420108580) /usr/lib/go-1.7/src/runtime/panic.go:458 +0x243 _<https://ci.centos.org/job/libvirt-go-master-check/systems=libvirt-debian-9/ws/.TestAPICoverage(0xc42007a180)> <https://ci.centos.org/job/libvirt-go-master-check/systems=libvirt-debian-9/ws/api_test.go>:504 +0x5ff testing.tRunner(0xc42007a180, 0x55cf0f706e48) /usr/lib/go-1.7/src/testing/testing.go:610 +0x81 created by testing.(*T).Run /usr/lib/go-1.7/src/testing/testing.go:646 +0x2ec exit status 2 FAIL _<https://ci.centos.org/job/libvirt-go-master-check/systems=libvirt-debian-9/ws/> 1.052s Build step 'Execute shell' marked build as failure

participants (1)
-
ci@centos.org