[Libvirt-ci] Build failed in Jenkins: libvirt-go-xml-master-check » libvirt-debian-9 #405

See <https://ci.centos.org/job/libvirt-go-xml-master-check/systems=libvirt-debian-9/405/display/redirect> ------------------------------------------ Started by upstream project "libvirt-go-xml-master-check" build number 405 originally caused by: Started by upstream project "libvirt-go-xml-master-build" build number 413 originally caused by: Started by upstream project "libvirt-master-build" build number 1463 originally caused by: Started by an SCM change [EnvInject] - Loading node environment variables. Building remotely on libvirt-debian-9 (libvirt) in workspace <https://ci.centos.org/job/libvirt-go-xml-master-check/systems=libvirt-debian-9/ws/> [libvirt-go-xml-master] $ /bin/sh -xe /tmp/jenkins6960592834443784830.sh + export TEST_ARGS=-tags xmlroundtrip + go test -tags xmlroundtrip --- FAIL: TestRoundTrip (13.33s) xml_test.go:383: testdata/libvirt/tests/domaincapsschemadata/basic.xml: /domainCapabilities[0]/features[0]/genid[0]: element in expected XML missing in actual XML FAIL exit status 1 FAIL _<https://ci.centos.org/job/libvirt-go-xml-master-check/systems=libvirt-debian-9/ws/> 13.501s Build step 'Execute shell' marked build as failure

See <https://ci.centos.org/job/libvirt-go-xml-master-check/systems=libvirt-debian-9/406/display/redirect> ------------------------------------------ Started by upstream project "libvirt-go-xml-master-check" build number 406 originally caused by: Started by upstream project "libvirt-go-xml-master-build" build number 414 originally caused by: Started by upstream project "libvirt-master-build" build number 1464 originally caused by: Started by an SCM change [EnvInject] - Loading node environment variables. Building remotely on libvirt-debian-9 (libvirt) in workspace <https://ci.centos.org/job/libvirt-go-xml-master-check/systems=libvirt-debian-9/ws/> [libvirt-go-xml-master] $ /bin/sh -xe /tmp/jenkins1407638603955993529.sh + export TEST_ARGS=-tags xmlroundtrip + go test -tags xmlroundtrip --- FAIL: TestRoundTrip (3.47s) xml_test.go:383: testdata/libvirt/tests/capabilityschemadata/caps-test2.xml: /capabilities[0]/host[0]/cpu[0]/microcode[0]: element in expected XML missing in actual XML FAIL exit status 1 FAIL _<https://ci.centos.org/job/libvirt-go-xml-master-check/systems=libvirt-debian-9/ws/> 3.709s Build step 'Execute shell' marked build as failure

See <https://ci.centos.org/job/libvirt-go-xml-master-check/systems=libvirt-debian-9/407/display/redirect> ------------------------------------------ Started by upstream project "libvirt-go-xml-master-check" build number 407 originally caused by: Started by upstream project "libvirt-go-xml-master-build" build number 415 originally caused by: Started by upstream project "libvirt-master-build" build number 1465 originally caused by: Started by an SCM change [EnvInject] - Loading node environment variables. Building remotely on libvirt-debian-9 (libvirt) in workspace <https://ci.centos.org/job/libvirt-go-xml-master-check/systems=libvirt-debian-9/ws/> [libvirt-go-xml-master] $ /bin/sh -xe /tmp/jenkins8426385362438520490.sh + export TEST_ARGS=-tags xmlroundtrip + go test -tags xmlroundtrip --- FAIL: TestRoundTrip (10.69s) xml_test.go:383: testdata/libvirt/tests/capabilityschemadata/caps-test2.xml: /capabilities[0]/host[0]/cpu[0]/microcode[0]: element in expected XML missing in actual XML FAIL exit status 1 FAIL _<https://ci.centos.org/job/libvirt-go-xml-master-check/systems=libvirt-debian-9/ws/> 10.932s Build step 'Execute shell' marked build as failure

See <https://ci.centos.org/job/libvirt-go-xml-master-check/systems=libvirt-debian-9/408/display/redirect> ------------------------------------------ Started by upstream project "libvirt-go-xml-master-check" build number 408 originally caused by: Started by upstream project "libvirt-go-xml-master-build" build number 416 originally caused by: Started by upstream project "libvirt-master-build" build number 1466 originally caused by: Started by an SCM change [EnvInject] - Loading node environment variables. Building remotely on libvirt-debian-9 (libvirt) in workspace <https://ci.centos.org/job/libvirt-go-xml-master-check/systems=libvirt-debian-9/ws/> [libvirt-go-xml-master] $ /bin/sh -xe /tmp/jenkins7828310561252194748.sh + export TEST_ARGS=-tags xmlroundtrip + go test -tags xmlroundtrip --- FAIL: TestRoundTrip (6.50s) xml_test.go:383: testdata/libvirt/tests/capabilityschemadata/caps-test2.xml: /capabilities[0]/host[0]/cpu[0]/microcode[0]: element in expected XML missing in actual XML FAIL exit status 1 FAIL _<https://ci.centos.org/job/libvirt-go-xml-master-check/systems=libvirt-debian-9/ws/> 6.749s Build step 'Execute shell' marked build as failure

See <https://ci.centos.org/job/libvirt-go-xml-master-check/systems=libvirt-debian-9/409/display/redirect> ------------------------------------------ Started by upstream project "libvirt-go-xml-master-check" build number 409 originally caused by: Started by upstream project "libvirt-go-xml-master-build" build number 417 originally caused by: Started by upstream project "libvirt-master-build" build number 1467 originally caused by: Started by an SCM change Started by an SCM change [EnvInject] - Loading node environment variables. Building remotely on libvirt-debian-9 (libvirt) in workspace <https://ci.centos.org/job/libvirt-go-xml-master-check/systems=libvirt-debian-9/ws/> [libvirt-go-xml-master] $ /bin/sh -xe /tmp/jenkins1635440765072100680.sh + export TEST_ARGS=-tags xmlroundtrip + go test -tags xmlroundtrip --- FAIL: TestRoundTrip (5.64s) xml_test.go:383: testdata/libvirt/tests/capabilityschemadata/caps-test2.xml: /capabilities[0]/host[0]/cpu[0]/microcode[0]: element in expected XML missing in actual XML FAIL exit status 1 FAIL _<https://ci.centos.org/job/libvirt-go-xml-master-check/systems=libvirt-debian-9/ws/> 6.088s Build step 'Execute shell' marked build as failure

See <https://ci.centos.org/job/libvirt-go-xml-master-check/systems=libvirt-debian-9/410/display/redirect> ------------------------------------------ Started by upstream project "libvirt-go-xml-master-check" build number 410 originally caused by: Started by upstream project "libvirt-go-xml-master-build" build number 418 originally caused by: Started by upstream project "libvirt-master-build" build number 1468 originally caused by: Started by an SCM change [EnvInject] - Loading node environment variables. Building remotely on libvirt-debian-9 (libvirt) in workspace <https://ci.centos.org/job/libvirt-go-xml-master-check/systems=libvirt-debian-9/ws/> [libvirt-go-xml-master] $ /bin/sh -xe /tmp/jenkins8514604164598205700.sh + export TEST_ARGS=-tags xmlroundtrip + go test -tags xmlroundtrip --- FAIL: TestRoundTrip (7.72s) xml_test.go:383: testdata/libvirt/tests/capabilityschemadata/caps-test2.xml: /capabilities[0]/host[0]/cpu[0]/microcode[0]: element in expected XML missing in actual XML FAIL exit status 1 FAIL _<https://ci.centos.org/job/libvirt-go-xml-master-check/systems=libvirt-debian-9/ws/> 7.928s Build step 'Execute shell' marked build as failure

See <https://ci.centos.org/job/libvirt-go-xml-master-check/systems=libvirt-debian-9/411/display/redirect> ------------------------------------------ Started by upstream project "libvirt-go-xml-master-check" build number 411 originally caused by: Started by upstream project "libvirt-go-xml-master-build" build number 419 originally caused by: Started by upstream project "libvirt-master-build" build number 1469 originally caused by: Started by an SCM change [EnvInject] - Loading node environment variables. Building remotely on libvirt-debian-9 (libvirt) in workspace <https://ci.centos.org/job/libvirt-go-xml-master-check/systems=libvirt-debian-9/ws/> [libvirt-go-xml-master] $ /bin/sh -xe /tmp/jenkins4113554858378471030.sh + export TEST_ARGS=-tags xmlroundtrip + go test -tags xmlroundtrip --- FAIL: TestRoundTrip (4.71s) xml_test.go:383: testdata/libvirt/tests/capabilityschemadata/caps-test2.xml: /capabilities[0]/host[0]/cpu[0]/microcode[0]: element in expected XML missing in actual XML FAIL exit status 1 FAIL _<https://ci.centos.org/job/libvirt-go-xml-master-check/systems=libvirt-debian-9/ws/> 4.982s Build step 'Execute shell' marked build as failure

See <https://ci.centos.org/job/libvirt-go-xml-master-check/systems=libvirt-debian-9/412/display/redirect> ------------------------------------------ Started by upstream project "libvirt-go-xml-master-check" build number 412 originally caused by: Started by upstream project "libvirt-go-xml-master-build" build number 420 originally caused by: Started by upstream project "libvirt-master-build" build number 1470 originally caused by: Started by an SCM change [EnvInject] - Loading node environment variables. Building remotely on libvirt-debian-9 (libvirt) in workspace <https://ci.centos.org/job/libvirt-go-xml-master-check/systems=libvirt-debian-9/ws/> [libvirt-go-xml-master] $ /bin/sh -xe /tmp/jenkins2046733455293285907.sh + export TEST_ARGS=-tags xmlroundtrip + go test -tags xmlroundtrip --- FAIL: TestRoundTrip (8.71s) xml_test.go:383: testdata/libvirt/tests/capabilityschemadata/caps-test2.xml: /capabilities[0]/host[0]/cpu[0]/microcode[0]: element in expected XML missing in actual XML FAIL exit status 1 FAIL _<https://ci.centos.org/job/libvirt-go-xml-master-check/systems=libvirt-debian-9/ws/> 8.861s Build step 'Execute shell' marked build as failure

See <https://ci.centos.org/job/libvirt-go-xml-master-check/systems=libvirt-debian-9/413/display/redirect> ------------------------------------------ Started by upstream project "libvirt-go-xml-master-check" build number 413 originally caused by: Started by upstream project "libvirt-go-xml-master-build" build number 421 originally caused by: Started by upstream project "libvirt-master-build" build number 1471 originally caused by: Started by an SCM change Started by an SCM change [EnvInject] - Loading node environment variables. Building remotely on libvirt-debian-9 (libvirt) in workspace <https://ci.centos.org/job/libvirt-go-xml-master-check/systems=libvirt-debian-9/ws/> [libvirt-go-xml-master] $ /bin/sh -xe /tmp/jenkins298321967625488681.sh + export TEST_ARGS=-tags xmlroundtrip + go test -tags xmlroundtrip --- FAIL: TestRoundTrip (2.77s) xml_test.go:383: testdata/libvirt/tests/capabilityschemadata/caps-test2.xml: /capabilities[0]/host[0]/cpu[0]/microcode[0]: element in expected XML missing in actual XML FAIL exit status 1 FAIL _<https://ci.centos.org/job/libvirt-go-xml-master-check/systems=libvirt-debian-9/ws/> 2.932s Build step 'Execute shell' marked build as failure

See <https://ci.centos.org/job/libvirt-go-xml-master-check/systems=libvirt-debian-9/414/display/redirect> ------------------------------------------ Started by upstream project "libvirt-go-xml-master-check" build number 414 originally caused by: Started by upstream project "libvirt-go-xml-master-build" build number 422 originally caused by: Started by upstream project "libvirt-master-build" build number 1472 originally caused by: Started by an SCM change [EnvInject] - Loading node environment variables. Building remotely on libvirt-debian-9 (libvirt) in workspace <https://ci.centos.org/job/libvirt-go-xml-master-check/systems=libvirt-debian-9/ws/> [libvirt-go-xml-master] $ /bin/sh -xe /tmp/jenkins2101381538645556960.sh + export TEST_ARGS=-tags xmlroundtrip + go test -tags xmlroundtrip --- FAIL: TestRoundTrip (7.23s) xml_test.go:383: testdata/libvirt/tests/capabilityschemadata/caps-test2.xml: /capabilities[0]/host[0]/cpu[0]/microcode[0]: element in expected XML missing in actual XML FAIL exit status 1 FAIL _<https://ci.centos.org/job/libvirt-go-xml-master-check/systems=libvirt-debian-9/ws/> 7.336s Build step 'Execute shell' marked build as failure

See <https://ci.centos.org/job/libvirt-go-xml-master-check/systems=libvirt-debian-9/415/display/redirect> ------------------------------------------ Started by upstream project "libvirt-go-xml-master-check" build number 415 originally caused by: Started by upstream project "libvirt-go-xml-master-build" build number 423 originally caused by: Started by upstream project "libvirt-master-build" build number 1473 originally caused by: Started by an SCM change [EnvInject] - Loading node environment variables. Building remotely on libvirt-debian-9 (libvirt) in workspace <https://ci.centos.org/job/libvirt-go-xml-master-check/systems=libvirt-debian-9/ws/> [libvirt-go-xml-master] $ /bin/sh -xe /tmp/jenkins813336560231565810.sh + export TEST_ARGS=-tags xmlroundtrip + go test -tags xmlroundtrip --- FAIL: TestRoundTrip (6.95s) xml_test.go:383: testdata/libvirt/tests/capabilityschemadata/caps-test2.xml: /capabilities[0]/host[0]/cpu[0]/microcode[0]: element in expected XML missing in actual XML FAIL exit status 1 FAIL _<https://ci.centos.org/job/libvirt-go-xml-master-check/systems=libvirt-debian-9/ws/> 7.112s Build step 'Execute shell' marked build as failure

See <https://ci.centos.org/job/libvirt-go-xml-master-check/systems=libvirt-debian-9/416/display/redirect> ------------------------------------------ Started by upstream project "libvirt-go-xml-master-check" build number 416 originally caused by: Started by upstream project "libvirt-go-xml-master-build" build number 424 originally caused by: Started by upstream project "libvirt-master-build" build number 1474 originally caused by: Started by an SCM change Started by an SCM change Started by an SCM change [EnvInject] - Loading node environment variables. Building remotely on libvirt-debian-9 (libvirt) in workspace <https://ci.centos.org/job/libvirt-go-xml-master-check/systems=libvirt-debian-9/ws/> [libvirt-go-xml-master] $ /bin/sh -xe /tmp/jenkins5909407064516599510.sh + export TEST_ARGS=-tags xmlroundtrip + go test -tags xmlroundtrip --- FAIL: TestRoundTrip (1.77s) xml_test.go:383: testdata/libvirt/tests/capabilityschemadata/caps-test2.xml: /capabilities[0]/host[0]/cpu[0]/microcode[0]: element in expected XML missing in actual XML FAIL exit status 1 FAIL _<https://ci.centos.org/job/libvirt-go-xml-master-check/systems=libvirt-debian-9/ws/> 1.893s Build step 'Execute shell' marked build as failure

See <https://ci.centos.org/job/libvirt-go-xml-master-check/systems=libvirt-debian-9/417/display/redirect> ------------------------------------------ Started by upstream project "libvirt-go-xml-master-check" build number 417 originally caused by: Started by upstream project "libvirt-go-xml-master-build" build number 425 originally caused by: Started by upstream project "libvirt-master-build" build number 1475 originally caused by: Started by an SCM change [EnvInject] - Loading node environment variables. Building remotely on libvirt-debian-9 (libvirt) in workspace <https://ci.centos.org/job/libvirt-go-xml-master-check/systems=libvirt-debian-9/ws/> [libvirt-go-xml-master] $ /bin/sh -xe /tmp/jenkins8707750961043239456.sh + export TEST_ARGS=-tags xmlroundtrip + go test -tags xmlroundtrip --- FAIL: TestRoundTrip (10.03s) xml_test.go:383: testdata/libvirt/tests/capabilityschemadata/caps-test2.xml: /capabilities[0]/host[0]/cpu[0]/microcode[0]: element in expected XML missing in actual XML FAIL exit status 1 FAIL _<https://ci.centos.org/job/libvirt-go-xml-master-check/systems=libvirt-debian-9/ws/> 10.330s Build step 'Execute shell' marked build as failure

See <https://ci.centos.org/job/libvirt-go-xml-master-check/systems=libvirt-debian-9/418/display/redirect> ------------------------------------------ Started by upstream project "libvirt-go-xml-master-check" build number 418 originally caused by: Started by upstream project "libvirt-go-xml-master-build" build number 426 originally caused by: Started by upstream project "libvirt-master-build" build number 1476 originally caused by: Started by an SCM change [EnvInject] - Loading node environment variables. Building remotely on libvirt-debian-9 (libvirt) in workspace <https://ci.centos.org/job/libvirt-go-xml-master-check/systems=libvirt-debian-9/ws/> [libvirt-go-xml-master] $ /bin/sh -xe /tmp/jenkins5325068295576436310.sh + export TEST_ARGS=-tags xmlroundtrip + go test -tags xmlroundtrip --- FAIL: TestRoundTrip (5.20s) xml_test.go:383: testdata/libvirt/tests/capabilityschemadata/caps-test2.xml: /capabilities[0]/host[0]/cpu[0]/microcode[0]: element in expected XML missing in actual XML FAIL exit status 1 FAIL _<https://ci.centos.org/job/libvirt-go-xml-master-check/systems=libvirt-debian-9/ws/> 5.444s Build step 'Execute shell' marked build as failure

See <https://ci.centos.org/job/libvirt-go-xml-master-check/systems=libvirt-debian-9/419/display/redirect> ------------------------------------------ Started by upstream project "libvirt-go-xml-master-check" build number 419 originally caused by: Started by upstream project "libvirt-go-xml-master-build" build number 427 originally caused by: Started by upstream project "libvirt-master-build" build number 1477 originally caused by: Started by an SCM change Started by an SCM change Started by an SCM change [EnvInject] - Loading node environment variables. Building remotely on libvirt-debian-9 (libvirt) in workspace <https://ci.centos.org/job/libvirt-go-xml-master-check/systems=libvirt-debian-9/ws/> [libvirt-go-xml-master] $ /bin/sh -xe /tmp/jenkins5972174507739291072.sh + export TEST_ARGS=-tags xmlroundtrip + go test -tags xmlroundtrip --- FAIL: TestRoundTrip (4.31s) xml_test.go:383: testdata/libvirt/tests/capabilityschemadata/caps-test2.xml: /capabilities[0]/host[0]/cpu[0]/microcode[0]: element in expected XML missing in actual XML FAIL exit status 1 FAIL _<https://ci.centos.org/job/libvirt-go-xml-master-check/systems=libvirt-debian-9/ws/> 4.532s Build step 'Execute shell' marked build as failure

See <https://ci.centos.org/job/libvirt-go-xml-master-check/systems=libvirt-debian-9/420/display/redirect> ------------------------------------------ Started by upstream project "libvirt-go-xml-master-check" build number 420 originally caused by: Started by upstream project "libvirt-go-xml-master-build" build number 428 originally caused by: Started by upstream project "libvirt-master-build" build number 1478 originally caused by: Started by an SCM change [EnvInject] - Loading node environment variables. Building remotely on libvirt-debian-9 (libvirt) in workspace <https://ci.centos.org/job/libvirt-go-xml-master-check/systems=libvirt-debian-9/ws/> [libvirt-go-xml-master] $ /bin/sh -xe /tmp/jenkins6529656333865313471.sh + export TEST_ARGS=-tags xmlroundtrip + go test -tags xmlroundtrip --- FAIL: TestRoundTrip (4.31s) xml_test.go:383: testdata/libvirt/tests/capabilityschemadata/caps-test2.xml: /capabilities[0]/host[0]/cpu[0]/microcode[0]: element in expected XML missing in actual XML FAIL exit status 1 FAIL _<https://ci.centos.org/job/libvirt-go-xml-master-check/systems=libvirt-debian-9/ws/> 4.520s Build step 'Execute shell' marked build as failure

See <https://ci.centos.org/job/libvirt-go-xml-master-check/systems=libvirt-debian-9/421/display/redirect> ------------------------------------------ Started by upstream project "libvirt-go-xml-master-check" build number 421 originally caused by: Started by upstream project "libvirt-go-xml-master-build" build number 429 originally caused by: Started by upstream project "libvirt-master-build" build number 1479 originally caused by: Started by an SCM change [EnvInject] - Loading node environment variables. Building remotely on libvirt-debian-9 (libvirt) in workspace <https://ci.centos.org/job/libvirt-go-xml-master-check/systems=libvirt-debian-9/ws/> [libvirt-go-xml-master] $ /bin/sh -xe /tmp/jenkins2801474931842978955.sh + export TEST_ARGS=-tags xmlroundtrip + go test -tags xmlroundtrip --- FAIL: TestRoundTrip (8.25s) xml_test.go:383: testdata/libvirt/tests/capabilityschemadata/caps-test2.xml: /capabilities[0]/host[0]/cpu[0]/microcode[0]: element in expected XML missing in actual XML FAIL exit status 1 FAIL _<https://ci.centos.org/job/libvirt-go-xml-master-check/systems=libvirt-debian-9/ws/> 8.458s Build step 'Execute shell' marked build as failure

See <https://ci.centos.org/job/libvirt-go-xml-master-check/systems=libvirt-debian-9/422/display/redirect> ------------------------------------------ Started by upstream project "libvirt-go-xml-master-check" build number 422 originally caused by: Started by upstream project "libvirt-go-xml-master-build" build number 430 originally caused by: Started by upstream project "libvirt-master-build" build number 1480 originally caused by: Started by an SCM change [EnvInject] - Loading node environment variables. Building remotely on libvirt-debian-9 (libvirt) in workspace <https://ci.centos.org/job/libvirt-go-xml-master-check/systems=libvirt-debian-9/ws/> [libvirt-go-xml-master] $ /bin/sh -xe /tmp/jenkins5232093222312970852.sh + export TEST_ARGS=-tags xmlroundtrip + go test -tags xmlroundtrip --- FAIL: TestRoundTrip (9.55s) xml_test.go:383: testdata/libvirt/tests/capabilityschemadata/caps-test2.xml: /capabilities[0]/host[0]/cpu[0]/microcode[0]: element in expected XML missing in actual XML FAIL exit status 1 FAIL _<https://ci.centos.org/job/libvirt-go-xml-master-check/systems=libvirt-debian-9/ws/> 9.778s Build step 'Execute shell' marked build as failure

See <https://ci.centos.org/job/libvirt-go-xml-master-check/systems=libvirt-debian-9/423/display/redirect> ------------------------------------------ Started by upstream project "libvirt-go-xml-master-check" build number 423 originally caused by: Started by upstream project "libvirt-go-xml-master-build" build number 431 originally caused by: Started by upstream project "libvirt-master-build" build number 1481 originally caused by: Started by an SCM change Started by an SCM change [EnvInject] - Loading node environment variables. Building remotely on libvirt-debian-9 (libvirt) in workspace <https://ci.centos.org/job/libvirt-go-xml-master-check/systems=libvirt-debian-9/ws/> [libvirt-go-xml-master] $ /bin/sh -xe /tmp/jenkins8933948604034673929.sh + export TEST_ARGS=-tags xmlroundtrip + go test -tags xmlroundtrip --- FAIL: TestRoundTrip (2.11s) xml_test.go:383: testdata/libvirt/tests/capabilityschemadata/caps-test2.xml: /capabilities[0]/host[0]/cpu[0]/microcode[0]: element in expected XML missing in actual XML FAIL exit status 1 FAIL _<https://ci.centos.org/job/libvirt-go-xml-master-check/systems=libvirt-debian-9/ws/> 2.285s Build step 'Execute shell' marked build as failure

participants (1)
-
ci@centos.org