[Libvirt-ci] Build failed in Jenkins: libvirt-go-master-check » libvirt-fedora-27 #1057

See <https://ci.centos.org/job/libvirt-go-master-check/systems=libvirt-fedora-27/1057/display/redirect> ------------------------------------------ Started by upstream project "libvirt-go-master-check" build number 1057 originally caused by: Started by upstream project "libvirt-go-master-build" build number 1068 originally caused by: Started by upstream project "libvirt-master-build" build number 1465 originally caused by: Started by an SCM change [EnvInject] - Loading node environment variables. Building remotely on libvirt-fedora-27 (libvirt) in workspace <https://ci.centos.org/job/libvirt-go-master-check/systems=libvirt-fedora-27/ws/> [libvirt-go-master] $ /bin/sh -xe /tmp/jenkins5545002244163989360.sh + export 'TEST_ARGS=-tags api' + TEST_ARGS='-tags api' + go test -tags api 2018-05-28 12:27:39.617+0000: 21692: info : libvirt version: 4.4.0 2018-05-28 12:27:39.617+0000: 21692: info : hostname: libvirt-fedora-27 2018-05-28 12:27:39.617+0000: 21692: warning : virEventRegisterImpl:245 : Ignoring attempt to replace registered event loop 2018-05-28 12:27:39.618+0000: 21692: warning : virEventRegisterImpl:245 : Ignoring attempt to replace registered event loop 2018-05-28 12:27:39.618+0000: 21692: warning : virEventRegisterImpl:245 : Ignoring attempt to replace registered event loop Missing function 'virDomainDetachDeviceAlias' --- FAIL: TestAPICoverage (1.84s) panic: Missing symbols found [recovered] panic: Missing symbols found goroutine 5 [running]: testing.tRunner.func1(0xc4200980f0) /usr/lib/golang/src/testing/testing.go:711 +0x2d2 panic(0x5b5d80, 0x61a2e0) /usr/lib/golang/src/runtime/panic.go:491 +0x283 _<https://ci.centos.org/job/libvirt-go-master-check/systems=libvirt-fedora-27/ws/.TestAPICoverage(0xc4200980f0)> <https://ci.centos.org/job/libvirt-go-master-check/systems=libvirt-fedora-27/ws/api_test.go>:504 +0x5b1 testing.tRunner(0xc4200980f0, 0x604b28) /usr/lib/golang/src/testing/testing.go:746 +0xd0 created by testing.(*T).Run /usr/lib/golang/src/testing/testing.go:789 +0x2de exit status 2 FAIL _<https://ci.centos.org/job/libvirt-go-master-check/systems=libvirt-fedora-27/ws/> 2.495s Build step 'Execute shell' marked build as failure

See <https://ci.centos.org/job/libvirt-go-master-check/systems=libvirt-fedora-27/1058/display/redirect> ------------------------------------------ Started by upstream project "libvirt-go-master-check" build number 1058 originally caused by: Started by upstream project "libvirt-go-master-build" build number 1069 originally caused by: Started by upstream project "libvirt-master-build" build number 1466 originally caused by: Started by an SCM change [EnvInject] - Loading node environment variables. Building remotely on libvirt-fedora-27 (libvirt) in workspace <https://ci.centos.org/job/libvirt-go-master-check/systems=libvirt-fedora-27/ws/> [libvirt-go-master] $ /bin/sh -xe /tmp/jenkins8877152299939967251.sh + export 'TEST_ARGS=-tags api' + TEST_ARGS='-tags api' + go test -tags api 2018-05-28 15:29:12.259+0000: 24266: info : libvirt version: 4.4.0 2018-05-28 15:29:12.259+0000: 24266: info : hostname: libvirt-fedora-27 2018-05-28 15:29:12.259+0000: 24266: warning : virEventRegisterImpl:245 : Ignoring attempt to replace registered event loop 2018-05-28 15:29:12.260+0000: 24266: warning : virEventRegisterImpl:245 : Ignoring attempt to replace registered event loop 2018-05-28 15:29:12.260+0000: 24266: warning : virEventRegisterImpl:245 : Ignoring attempt to replace registered event loop Missing function 'virConnectBaselineHypervisorCPU' Missing function 'virConnectCompareHypervisorCPU' Missing function 'virDomainDetachDeviceAlias' --- FAIL: TestAPICoverage (1.18s) panic: Missing symbols found [recovered] panic: Missing symbols found goroutine 19 [running]: testing.tRunner.func1(0xc4200b00f0) /usr/lib/golang/src/testing/testing.go:711 +0x2d2 panic(0x5b5d80, 0x61a2e0) /usr/lib/golang/src/runtime/panic.go:491 +0x283 _<https://ci.centos.org/job/libvirt-go-master-check/systems=libvirt-fedora-27/ws/.TestAPICoverage(0xc4200b00f0)> <https://ci.centos.org/job/libvirt-go-master-check/systems=libvirt-fedora-27/ws/api_test.go>:504 +0x5b1 testing.tRunner(0xc4200b00f0, 0x604b28) /usr/lib/golang/src/testing/testing.go:746 +0xd0 created by testing.(*T).Run /usr/lib/golang/src/testing/testing.go:789 +0x2de exit status 2 FAIL _<https://ci.centos.org/job/libvirt-go-master-check/systems=libvirt-fedora-27/ws/> 1.485s Build step 'Execute shell' marked build as failure

See <https://ci.centos.org/job/libvirt-go-master-check/systems=libvirt-fedora-27/1059/display/redirect> ------------------------------------------ Started by upstream project "libvirt-go-master-check" build number 1059 originally caused by: Started by upstream project "libvirt-go-master-build" build number 1070 originally caused by: Started by upstream project "libvirt-master-build" build number 1467 originally caused by: Started by an SCM change Started by an SCM change [EnvInject] - Loading node environment variables. Building remotely on libvirt-fedora-27 (libvirt) in workspace <https://ci.centos.org/job/libvirt-go-master-check/systems=libvirt-fedora-27/ws/> [libvirt-go-master] $ /bin/sh -xe /tmp/jenkins6731223789467352924.sh + export 'TEST_ARGS=-tags api' + TEST_ARGS='-tags api' + go test -tags api 2018-05-28 16:51:10.196+0000: 1450: info : libvirt version: 4.4.0 2018-05-28 16:51:10.196+0000: 1450: info : hostname: libvirt-fedora-27 2018-05-28 16:51:10.196+0000: 1450: warning : virEventRegisterImpl:245 : Ignoring attempt to replace registered event loop 2018-05-28 16:51:10.196+0000: 1450: warning : virEventRegisterImpl:245 : Ignoring attempt to replace registered event loop 2018-05-28 16:51:10.196+0000: 1450: warning : virEventRegisterImpl:245 : Ignoring attempt to replace registered event loop Missing function 'virConnectBaselineHypervisorCPU' Missing function 'virConnectCompareHypervisorCPU' Missing function 'virDomainDetachDeviceAlias' --- FAIL: TestAPICoverage (0.49s) panic: Missing symbols found [recovered] panic: Missing symbols found goroutine 5 [running]: testing.tRunner.func1(0xc4200980f0) /usr/lib/golang/src/testing/testing.go:711 +0x2d2 panic(0x5b5d80, 0x61a2e0) /usr/lib/golang/src/runtime/panic.go:491 +0x283 _<https://ci.centos.org/job/libvirt-go-master-check/systems=libvirt-fedora-27/ws/.TestAPICoverage(0xc4200980f0)> <https://ci.centos.org/job/libvirt-go-master-check/systems=libvirt-fedora-27/ws/api_test.go>:504 +0x5b1 testing.tRunner(0xc4200980f0, 0x604b28) /usr/lib/golang/src/testing/testing.go:746 +0xd0 created by testing.(*T).Run /usr/lib/golang/src/testing/testing.go:789 +0x2de exit status 2 FAIL _<https://ci.centos.org/job/libvirt-go-master-check/systems=libvirt-fedora-27/ws/> 0.567s Build step 'Execute shell' marked build as failure

See <https://ci.centos.org/job/libvirt-go-master-check/systems=libvirt-fedora-27/1060/display/redirect> ------------------------------------------ Started by upstream project "libvirt-go-master-check" build number 1060 originally caused by: Started by upstream project "libvirt-go-master-build" build number 1071 originally caused by: Started by upstream project "libvirt-master-build" build number 1468 originally caused by: Started by an SCM change [EnvInject] - Loading node environment variables. Building remotely on libvirt-fedora-27 (libvirt) in workspace <https://ci.centos.org/job/libvirt-go-master-check/systems=libvirt-fedora-27/ws/> [libvirt-go-master] $ /bin/sh -xe /tmp/jenkins5863864825506114828.sh + export 'TEST_ARGS=-tags api' + TEST_ARGS='-tags api' + go test -tags api 2018-05-29 09:48:54.212+0000: 10692: info : libvirt version: 4.4.0 2018-05-29 09:48:54.212+0000: 10692: info : hostname: libvirt-fedora-27 2018-05-29 09:48:54.212+0000: 10692: warning : virEventRegisterImpl:245 : Ignoring attempt to replace registered event loop 2018-05-29 09:48:54.212+0000: 10692: warning : virEventRegisterImpl:245 : Ignoring attempt to replace registered event loop 2018-05-29 09:48:54.212+0000: 10692: warning : virEventRegisterImpl:245 : Ignoring attempt to replace registered event loop Missing function 'virConnectBaselineHypervisorCPU' Missing function 'virConnectCompareHypervisorCPU' Missing function 'virDomainDetachDeviceAlias' --- FAIL: TestAPICoverage (0.73s) panic: Missing symbols found [recovered] panic: Missing symbols found goroutine 5 [running]: testing.tRunner.func1(0xc4200980f0) /usr/lib/golang/src/testing/testing.go:711 +0x2d2 panic(0x5b5d80, 0x61a2e0) /usr/lib/golang/src/runtime/panic.go:491 +0x283 _<https://ci.centos.org/job/libvirt-go-master-check/systems=libvirt-fedora-27/ws/.TestAPICoverage(0xc4200980f0)> <https://ci.centos.org/job/libvirt-go-master-check/systems=libvirt-fedora-27/ws/api_test.go>:504 +0x5b1 testing.tRunner(0xc4200980f0, 0x604b28) /usr/lib/golang/src/testing/testing.go:746 +0xd0 created by testing.(*T).Run /usr/lib/golang/src/testing/testing.go:789 +0x2de exit status 2 FAIL _<https://ci.centos.org/job/libvirt-go-master-check/systems=libvirt-fedora-27/ws/> 0.913s Build step 'Execute shell' marked build as failure

See <https://ci.centos.org/job/libvirt-go-master-check/systems=libvirt-fedora-27/1061/display/redirect> ------------------------------------------ Started by upstream project "libvirt-go-master-check" build number 1061 originally caused by: Started by upstream project "libvirt-go-master-build" build number 1072 originally caused by: Started by upstream project "libvirt-master-build" build number 1469 originally caused by: Started by an SCM change [EnvInject] - Loading node environment variables. Building remotely on libvirt-fedora-27 (libvirt) in workspace <https://ci.centos.org/job/libvirt-go-master-check/systems=libvirt-fedora-27/ws/> [libvirt-go-master] $ /bin/sh -xe /tmp/jenkins318117133614569823.sh + export 'TEST_ARGS=-tags api' + TEST_ARGS='-tags api' + go test -tags api 2018-05-29 13:30:10.359+0000: 26387: info : libvirt version: 4.4.0 2018-05-29 13:30:10.359+0000: 26387: info : hostname: libvirt-fedora-27 2018-05-29 13:30:10.359+0000: 26387: warning : virEventRegisterImpl:245 : Ignoring attempt to replace registered event loop 2018-05-29 13:30:10.360+0000: 26387: warning : virEventRegisterImpl:245 : Ignoring attempt to replace registered event loop 2018-05-29 13:30:10.360+0000: 26387: warning : virEventRegisterImpl:245 : Ignoring attempt to replace registered event loop Missing function 'virConnectBaselineHypervisorCPU' Missing function 'virConnectCompareHypervisorCPU' Missing function 'virDomainDetachDeviceAlias' --- FAIL: TestAPICoverage (0.23s) panic: Missing symbols found [recovered] panic: Missing symbols found goroutine 5 [running]: testing.tRunner.func1(0xc4200980f0) /usr/lib/golang/src/testing/testing.go:711 +0x2d2 panic(0x5b5d80, 0x61a2e0) /usr/lib/golang/src/runtime/panic.go:491 +0x283 _<https://ci.centos.org/job/libvirt-go-master-check/systems=libvirt-fedora-27/ws/.TestAPICoverage(0xc4200980f0)> <https://ci.centos.org/job/libvirt-go-master-check/systems=libvirt-fedora-27/ws/api_test.go>:504 +0x5b1 testing.tRunner(0xc4200980f0, 0x604b28) /usr/lib/golang/src/testing/testing.go:746 +0xd0 created by testing.(*T).Run /usr/lib/golang/src/testing/testing.go:789 +0x2de exit status 2 FAIL _<https://ci.centos.org/job/libvirt-go-master-check/systems=libvirt-fedora-27/ws/> 0.303s Build step 'Execute shell' marked build as failure

See <https://ci.centos.org/job/libvirt-go-master-check/systems=libvirt-fedora-27/1062/display/redirect> ------------------------------------------ Started by upstream project "libvirt-go-master-check" build number 1062 originally caused by: Started by upstream project "libvirt-go-master-build" build number 1073 originally caused by: Started by upstream project "libvirt-master-build" build number 1470 originally caused by: Started by an SCM change [EnvInject] - Loading node environment variables. Building remotely on libvirt-fedora-27 (libvirt) in workspace <https://ci.centos.org/job/libvirt-go-master-check/systems=libvirt-fedora-27/ws/> [libvirt-go-master] $ /bin/sh -xe /tmp/jenkins1413598165956851590.sh + export 'TEST_ARGS=-tags api' + TEST_ARGS='-tags api' + go test -tags api 2018-05-29 15:13:27.115+0000: 22358: info : libvirt version: 4.4.0 2018-05-29 15:13:27.115+0000: 22358: info : hostname: libvirt-fedora-27 2018-05-29 15:13:27.115+0000: 22358: warning : virEventRegisterImpl:245 : Ignoring attempt to replace registered event loop 2018-05-29 15:13:27.115+0000: 22358: warning : virEventRegisterImpl:245 : Ignoring attempt to replace registered event loop 2018-05-29 15:13:27.115+0000: 22358: warning : virEventRegisterImpl:245 : Ignoring attempt to replace registered event loop Missing function 'virConnectBaselineHypervisorCPU' Missing function 'virConnectCompareHypervisorCPU' Missing function 'virDomainDetachDeviceAlias' --- FAIL: TestAPICoverage (0.16s) panic: Missing symbols found [recovered] panic: Missing symbols found goroutine 5 [running]: testing.tRunner.func1(0xc4200980f0) /usr/lib/golang/src/testing/testing.go:711 +0x2d2 panic(0x5b5d80, 0x61a2e0) /usr/lib/golang/src/runtime/panic.go:491 +0x283 _<https://ci.centos.org/job/libvirt-go-master-check/systems=libvirt-fedora-27/ws/.TestAPICoverage(0xc4200980f0)> <https://ci.centos.org/job/libvirt-go-master-check/systems=libvirt-fedora-27/ws/api_test.go>:504 +0x5b1 testing.tRunner(0xc4200980f0, 0x604b28) /usr/lib/golang/src/testing/testing.go:746 +0xd0 created by testing.(*T).Run /usr/lib/golang/src/testing/testing.go:789 +0x2de exit status 2 FAIL _<https://ci.centos.org/job/libvirt-go-master-check/systems=libvirt-fedora-27/ws/> 0.216s Build step 'Execute shell' marked build as failure

See <https://ci.centos.org/job/libvirt-go-master-check/systems=libvirt-fedora-27/1063/display/redirect> ------------------------------------------ Started by upstream project "libvirt-go-master-check" build number 1063 originally caused by: Started by upstream project "libvirt-go-master-build" build number 1074 originally caused by: Started by upstream project "libvirt-master-build" build number 1471 originally caused by: Started by an SCM change Started by an SCM change [EnvInject] - Loading node environment variables. Building remotely on libvirt-fedora-27 (libvirt) in workspace <https://ci.centos.org/job/libvirt-go-master-check/systems=libvirt-fedora-27/ws/> [libvirt-go-master] $ /bin/sh -xe /tmp/jenkins2406288603570845138.sh + export 'TEST_ARGS=-tags api' + TEST_ARGS='-tags api' + go test -tags api 2018-05-29 16:10:50.918+0000: 19854: info : libvirt version: 4.4.0 2018-05-29 16:10:50.918+0000: 19854: info : hostname: libvirt-fedora-27 2018-05-29 16:10:50.918+0000: 19854: warning : virEventRegisterImpl:245 : Ignoring attempt to replace registered event loop 2018-05-29 16:10:50.918+0000: 19854: warning : virEventRegisterImpl:245 : Ignoring attempt to replace registered event loop 2018-05-29 16:10:50.918+0000: 19854: warning : virEventRegisterImpl:245 : Ignoring attempt to replace registered event loop Missing function 'virConnectBaselineHypervisorCPU' Missing function 'virConnectCompareHypervisorCPU' Missing function 'virDomainDetachDeviceAlias' --- FAIL: TestAPICoverage (0.36s) panic: Missing symbols found [recovered] panic: Missing symbols found goroutine 19 [running]: testing.tRunner.func1(0xc4200b00f0) /usr/lib/golang/src/testing/testing.go:711 +0x2d2 panic(0x5b5d80, 0x61a2e0) /usr/lib/golang/src/runtime/panic.go:491 +0x283 _<https://ci.centos.org/job/libvirt-go-master-check/systems=libvirt-fedora-27/ws/.TestAPICoverage(0xc4200b00f0)> <https://ci.centos.org/job/libvirt-go-master-check/systems=libvirt-fedora-27/ws/api_test.go>:504 +0x5b1 testing.tRunner(0xc4200b00f0, 0x604b28) /usr/lib/golang/src/testing/testing.go:746 +0xd0 created by testing.(*T).Run /usr/lib/golang/src/testing/testing.go:789 +0x2de exit status 2 FAIL _<https://ci.centos.org/job/libvirt-go-master-check/systems=libvirt-fedora-27/ws/> 0.424s Build step 'Execute shell' marked build as failure

See <https://ci.centos.org/job/libvirt-go-master-check/systems=libvirt-fedora-27/1064/display/redirect> ------------------------------------------ Started by upstream project "libvirt-go-master-check" build number 1064 originally caused by: Started by upstream project "libvirt-go-master-build" build number 1075 originally caused by: Started by upstream project "libvirt-master-build" build number 1472 originally caused by: Started by an SCM change [EnvInject] - Loading node environment variables. Building remotely on libvirt-fedora-27 (libvirt) in workspace <https://ci.centos.org/job/libvirt-go-master-check/systems=libvirt-fedora-27/ws/> [libvirt-go-master] $ /bin/sh -xe /tmp/jenkins7455934957328086221.sh + export 'TEST_ARGS=-tags api' + TEST_ARGS='-tags api' + go test -tags api 2018-05-30 10:20:05.731+0000: 14034: info : libvirt version: 4.4.0 2018-05-30 10:20:05.731+0000: 14034: info : hostname: libvirt-fedora-27 2018-05-30 10:20:05.731+0000: 14034: warning : virEventRegisterImpl:245 : Ignoring attempt to replace registered event loop 2018-05-30 10:20:05.731+0000: 14034: warning : virEventRegisterImpl:245 : Ignoring attempt to replace registered event loop 2018-05-30 10:20:05.731+0000: 14034: warning : virEventRegisterImpl:245 : Ignoring attempt to replace registered event loop Missing function 'virConnectBaselineHypervisorCPU' Missing function 'virConnectCompareHypervisorCPU' Missing function 'virDomainDetachDeviceAlias' --- FAIL: TestAPICoverage (0.53s) panic: Missing symbols found [recovered] panic: Missing symbols found goroutine 5 [running]: testing.tRunner.func1(0xc4200980f0) /usr/lib/golang/src/testing/testing.go:711 +0x2d2 panic(0x5b5d80, 0x61a2e0) /usr/lib/golang/src/runtime/panic.go:491 +0x283 _<https://ci.centos.org/job/libvirt-go-master-check/systems=libvirt-fedora-27/ws/.TestAPICoverage(0xc4200980f0)> <https://ci.centos.org/job/libvirt-go-master-check/systems=libvirt-fedora-27/ws/api_test.go>:504 +0x5b1 testing.tRunner(0xc4200980f0, 0x604b28) /usr/lib/golang/src/testing/testing.go:746 +0xd0 created by testing.(*T).Run /usr/lib/golang/src/testing/testing.go:789 +0x2de exit status 2 FAIL _<https://ci.centos.org/job/libvirt-go-master-check/systems=libvirt-fedora-27/ws/> 0.699s Build step 'Execute shell' marked build as failure

See <https://ci.centos.org/job/libvirt-go-master-check/systems=libvirt-fedora-27/1065/display/redirect> ------------------------------------------ Started by upstream project "libvirt-go-master-check" build number 1065 originally caused by: Started by upstream project "libvirt-go-master-build" build number 1076 originally caused by: Started by upstream project "libvirt-master-build" build number 1473 originally caused by: Started by an SCM change [EnvInject] - Loading node environment variables. Building remotely on libvirt-fedora-27 (libvirt) in workspace <https://ci.centos.org/job/libvirt-go-master-check/systems=libvirt-fedora-27/ws/> [libvirt-go-master] $ /bin/sh -xe /tmp/jenkins7897665342246443862.sh + export 'TEST_ARGS=-tags api' + TEST_ARGS='-tags api' + go test -tags api 2018-05-30 14:51:09.815+0000: 23087: info : libvirt version: 4.4.0 2018-05-30 14:51:09.815+0000: 23087: info : hostname: libvirt-fedora-27 2018-05-30 14:51:09.815+0000: 23087: warning : virEventRegisterImpl:245 : Ignoring attempt to replace registered event loop 2018-05-30 14:51:09.815+0000: 23087: warning : virEventRegisterImpl:245 : Ignoring attempt to replace registered event loop 2018-05-30 14:51:09.815+0000: 23087: warning : virEventRegisterImpl:245 : Ignoring attempt to replace registered event loop Missing function 'virConnectBaselineHypervisorCPU' Missing function 'virConnectCompareHypervisorCPU' Missing function 'virDomainDetachDeviceAlias' --- FAIL: TestAPICoverage (0.58s) panic: Missing symbols found [recovered] panic: Missing symbols found goroutine 5 [running]: testing.tRunner.func1(0xc4200980f0) /usr/lib/golang/src/testing/testing.go:711 +0x2d2 panic(0x5b5d80, 0x61a2e0) /usr/lib/golang/src/runtime/panic.go:491 +0x283 _<https://ci.centos.org/job/libvirt-go-master-check/systems=libvirt-fedora-27/ws/.TestAPICoverage(0xc4200980f0)> <https://ci.centos.org/job/libvirt-go-master-check/systems=libvirt-fedora-27/ws/api_test.go>:504 +0x5b1 testing.tRunner(0xc4200980f0, 0x604b28) /usr/lib/golang/src/testing/testing.go:746 +0xd0 created by testing.(*T).Run /usr/lib/golang/src/testing/testing.go:789 +0x2de exit status 2 FAIL _<https://ci.centos.org/job/libvirt-go-master-check/systems=libvirt-fedora-27/ws/> 0.660s Build step 'Execute shell' marked build as failure

See <https://ci.centos.org/job/libvirt-go-master-check/systems=libvirt-fedora-27/1066/display/redirect> ------------------------------------------ Started by upstream project "libvirt-go-master-check" build number 1066 originally caused by: Started by upstream project "libvirt-go-master-build" build number 1077 originally caused by: Started by upstream project "libvirt-master-build" build number 1474 originally caused by: Started by an SCM change Started by an SCM change Started by an SCM change [EnvInject] - Loading node environment variables. Building remotely on libvirt-fedora-27 (libvirt) in workspace <https://ci.centos.org/job/libvirt-go-master-check/systems=libvirt-fedora-27/ws/> [libvirt-go-master] $ /bin/sh -xe /tmp/jenkins807192903237595037.sh + export 'TEST_ARGS=-tags api' + TEST_ARGS='-tags api' + go test -tags api 2018-05-30 15:57:57.990+0000: 1468: info : libvirt version: 4.4.0 2018-05-30 15:57:57.990+0000: 1468: info : hostname: libvirt-fedora-27 2018-05-30 15:57:57.990+0000: 1468: warning : virEventRegisterImpl:245 : Ignoring attempt to replace registered event loop 2018-05-30 15:57:57.991+0000: 1468: warning : virEventRegisterImpl:245 : Ignoring attempt to replace registered event loop 2018-05-30 15:57:57.991+0000: 1468: warning : virEventRegisterImpl:245 : Ignoring attempt to replace registered event loop Missing function 'virConnectBaselineHypervisorCPU' Missing function 'virConnectCompareHypervisorCPU' Missing function 'virDomainDetachDeviceAlias' --- FAIL: TestAPICoverage (0.47s) panic: Missing symbols found [recovered] panic: Missing symbols found goroutine 5 [running]: testing.tRunner.func1(0xc4200980f0) /usr/lib/golang/src/testing/testing.go:711 +0x2d2 panic(0x5b5d80, 0x61a2e0) /usr/lib/golang/src/runtime/panic.go:491 +0x283 _<https://ci.centos.org/job/libvirt-go-master-check/systems=libvirt-fedora-27/ws/.TestAPICoverage(0xc4200980f0)> <https://ci.centos.org/job/libvirt-go-master-check/systems=libvirt-fedora-27/ws/api_test.go>:504 +0x5b1 testing.tRunner(0xc4200980f0, 0x604b28) /usr/lib/golang/src/testing/testing.go:746 +0xd0 created by testing.(*T).Run /usr/lib/golang/src/testing/testing.go:789 +0x2de exit status 2 FAIL _<https://ci.centos.org/job/libvirt-go-master-check/systems=libvirt-fedora-27/ws/> 0.626s Build step 'Execute shell' marked build as failure

See <https://ci.centos.org/job/libvirt-go-master-check/systems=libvirt-fedora-27/1067/display/redirect> ------------------------------------------ Started by upstream project "libvirt-go-master-check" build number 1067 originally caused by: Started by upstream project "libvirt-go-master-build" build number 1078 originally caused by: Started by upstream project "libvirt-master-build" build number 1475 originally caused by: Started by an SCM change [EnvInject] - Loading node environment variables. Building remotely on libvirt-fedora-27 (libvirt) in workspace <https://ci.centos.org/job/libvirt-go-master-check/systems=libvirt-fedora-27/ws/> [libvirt-go-master] $ /bin/sh -xe /tmp/jenkins8241676613743524057.sh + export 'TEST_ARGS=-tags api' + TEST_ARGS='-tags api' + go test -tags api 2018-05-31 08:28:14.388+0000: 10359: info : libvirt version: 4.4.0 2018-05-31 08:28:14.388+0000: 10359: info : hostname: libvirt-fedora-27 2018-05-31 08:28:14.388+0000: 10359: warning : virEventRegisterImpl:245 : Ignoring attempt to replace registered event loop 2018-05-31 08:28:14.388+0000: 10359: warning : virEventRegisterImpl:245 : Ignoring attempt to replace registered event loop 2018-05-31 08:28:14.388+0000: 10359: warning : virEventRegisterImpl:245 : Ignoring attempt to replace registered event loop Missing function 'virConnectBaselineHypervisorCPU' Missing function 'virConnectCompareHypervisorCPU' Missing function 'virDomainDetachDeviceAlias' --- FAIL: TestAPICoverage (0.37s) panic: Missing symbols found [recovered] panic: Missing symbols found goroutine 5 [running]: testing.tRunner.func1(0xc4200980f0) /usr/lib/golang/src/testing/testing.go:711 +0x2d2 panic(0x5b5d80, 0x61a2e0) /usr/lib/golang/src/runtime/panic.go:491 +0x283 _<https://ci.centos.org/job/libvirt-go-master-check/systems=libvirt-fedora-27/ws/.TestAPICoverage(0xc4200980f0)> <https://ci.centos.org/job/libvirt-go-master-check/systems=libvirt-fedora-27/ws/api_test.go>:504 +0x5b1 testing.tRunner(0xc4200980f0, 0x604b28) /usr/lib/golang/src/testing/testing.go:746 +0xd0 created by testing.(*T).Run /usr/lib/golang/src/testing/testing.go:789 +0x2de exit status 2 FAIL _<https://ci.centos.org/job/libvirt-go-master-check/systems=libvirt-fedora-27/ws/> 0.499s Build step 'Execute shell' marked build as failure

See <https://ci.centos.org/job/libvirt-go-master-check/systems=libvirt-fedora-27/1068/display/redirect> ------------------------------------------ Started by upstream project "libvirt-go-master-check" build number 1068 originally caused by: Started by upstream project "libvirt-go-master-build" build number 1079 originally caused by: Started by upstream project "libvirt-master-build" build number 1476 originally caused by: Started by an SCM change [EnvInject] - Loading node environment variables. Building remotely on libvirt-fedora-27 (libvirt) in workspace <https://ci.centos.org/job/libvirt-go-master-check/systems=libvirt-fedora-27/ws/> [libvirt-go-master] $ /bin/sh -xe /tmp/jenkins5462266699672569437.sh + export 'TEST_ARGS=-tags api' + TEST_ARGS='-tags api' + go test -tags api 2018-05-31 10:29:54.915+0000: 20795: info : libvirt version: 4.4.0 2018-05-31 10:29:54.915+0000: 20795: info : hostname: libvirt-fedora-27 2018-05-31 10:29:54.915+0000: 20795: warning : virEventRegisterImpl:245 : Ignoring attempt to replace registered event loop 2018-05-31 10:29:54.922+0000: 20795: warning : virEventRegisterImpl:245 : Ignoring attempt to replace registered event loop 2018-05-31 10:29:54.922+0000: 20795: warning : virEventRegisterImpl:245 : Ignoring attempt to replace registered event loop Missing function 'virConnectBaselineHypervisorCPU' Missing function 'virConnectCompareHypervisorCPU' Missing function 'virDomainDetachDeviceAlias' --- FAIL: TestAPICoverage (0.51s) panic: Missing symbols found [recovered] panic: Missing symbols found goroutine 5 [running]: testing.tRunner.func1(0xc4200980f0) /usr/lib/golang/src/testing/testing.go:711 +0x2d2 panic(0x5b5d80, 0x61a2e0) /usr/lib/golang/src/runtime/panic.go:491 +0x283 _<https://ci.centos.org/job/libvirt-go-master-check/systems=libvirt-fedora-27/ws/.TestAPICoverage(0xc4200980f0)> <https://ci.centos.org/job/libvirt-go-master-check/systems=libvirt-fedora-27/ws/api_test.go>:504 +0x5b1 testing.tRunner(0xc4200980f0, 0x604b28) /usr/lib/golang/src/testing/testing.go:746 +0xd0 created by testing.(*T).Run /usr/lib/golang/src/testing/testing.go:789 +0x2de exit status 2 FAIL _<https://ci.centos.org/job/libvirt-go-master-check/systems=libvirt-fedora-27/ws/> 0.653s Build step 'Execute shell' marked build as failure

See <https://ci.centos.org/job/libvirt-go-master-check/systems=libvirt-fedora-27/1069/display/redirect> ------------------------------------------ Started by upstream project "libvirt-go-master-check" build number 1069 originally caused by: Started by upstream project "libvirt-go-master-build" build number 1080 originally caused by: Started by upstream project "libvirt-master-build" build number 1477 originally caused by: Started by an SCM change Started by an SCM change Started by an SCM change [EnvInject] - Loading node environment variables. Building remotely on libvirt-fedora-27 (libvirt) in workspace <https://ci.centos.org/job/libvirt-go-master-check/systems=libvirt-fedora-27/ws/> [libvirt-go-master] $ /bin/sh -xe /tmp/jenkins7619034797042543246.sh + export 'TEST_ARGS=-tags api' + TEST_ARGS='-tags api' + go test -tags api 2018-05-31 11:49:31.527+0000: 1770: info : libvirt version: 4.4.0 2018-05-31 11:49:31.527+0000: 1770: info : hostname: libvirt-fedora-27 2018-05-31 11:49:31.527+0000: 1770: warning : virEventRegisterImpl:245 : Ignoring attempt to replace registered event loop 2018-05-31 11:49:31.528+0000: 1770: warning : virEventRegisterImpl:245 : Ignoring attempt to replace registered event loop 2018-05-31 11:49:31.528+0000: 1770: warning : virEventRegisterImpl:245 : Ignoring attempt to replace registered event loop Missing function 'virConnectBaselineHypervisorCPU' Missing function 'virConnectCompareHypervisorCPU' Missing function 'virDomainDetachDeviceAlias' --- FAIL: TestAPICoverage (0.26s) panic: Missing symbols found [recovered] panic: Missing symbols found goroutine 5 [running]: testing.tRunner.func1(0xc4200980f0) /usr/lib/golang/src/testing/testing.go:711 +0x2d2 panic(0x5b5d80, 0x61a2e0) /usr/lib/golang/src/runtime/panic.go:491 +0x283 _<https://ci.centos.org/job/libvirt-go-master-check/systems=libvirt-fedora-27/ws/.TestAPICoverage(0xc4200980f0)> <https://ci.centos.org/job/libvirt-go-master-check/systems=libvirt-fedora-27/ws/api_test.go>:504 +0x5b1 testing.tRunner(0xc4200980f0, 0x604b28) /usr/lib/golang/src/testing/testing.go:746 +0xd0 created by testing.(*T).Run /usr/lib/golang/src/testing/testing.go:789 +0x2de exit status 2 FAIL _<https://ci.centos.org/job/libvirt-go-master-check/systems=libvirt-fedora-27/ws/> 0.309s Build step 'Execute shell' marked build as failure

See <https://ci.centos.org/job/libvirt-go-master-check/systems=libvirt-fedora-27/1070/display/redirect> ------------------------------------------ Started by upstream project "libvirt-go-master-check" build number 1070 originally caused by: Started by upstream project "libvirt-go-master-build" build number 1081 originally caused by: Started by upstream project "libvirt-master-build" build number 1478 originally caused by: Started by an SCM change [EnvInject] - Loading node environment variables. Building remotely on libvirt-fedora-27 (libvirt) in workspace <https://ci.centos.org/job/libvirt-go-master-check/systems=libvirt-fedora-27/ws/> [libvirt-go-master] $ /bin/sh -xe /tmp/jenkins8652635986895487950.sh + export 'TEST_ARGS=-tags api' + TEST_ARGS='-tags api' + go test -tags api 2018-05-31 14:20:00.052+0000: 10500: info : libvirt version: 4.4.0 2018-05-31 14:20:00.052+0000: 10500: info : hostname: libvirt-fedora-27 2018-05-31 14:20:00.052+0000: 10500: warning : virEventRegisterImpl:245 : Ignoring attempt to replace registered event loop 2018-05-31 14:20:00.052+0000: 10500: warning : virEventRegisterImpl:245 : Ignoring attempt to replace registered event loop 2018-05-31 14:20:00.052+0000: 10500: warning : virEventRegisterImpl:245 : Ignoring attempt to replace registered event loop Missing function 'virConnectBaselineHypervisorCPU' Missing function 'virConnectCompareHypervisorCPU' Missing function 'virDomainDetachDeviceAlias' --- FAIL: TestAPICoverage (0.81s) panic: Missing symbols found [recovered] panic: Missing symbols found goroutine 5 [running]: testing.tRunner.func1(0xc4200980f0) /usr/lib/golang/src/testing/testing.go:711 +0x2d2 panic(0x5b5d80, 0x61a2e0) /usr/lib/golang/src/runtime/panic.go:491 +0x283 _<https://ci.centos.org/job/libvirt-go-master-check/systems=libvirt-fedora-27/ws/.TestAPICoverage(0xc4200980f0)> <https://ci.centos.org/job/libvirt-go-master-check/systems=libvirt-fedora-27/ws/api_test.go>:504 +0x5b1 testing.tRunner(0xc4200980f0, 0x604b28) /usr/lib/golang/src/testing/testing.go:746 +0xd0 created by testing.(*T).Run /usr/lib/golang/src/testing/testing.go:789 +0x2de exit status 2 FAIL _<https://ci.centos.org/job/libvirt-go-master-check/systems=libvirt-fedora-27/ws/> 1.008s Build step 'Execute shell' marked build as failure

See <https://ci.centos.org/job/libvirt-go-master-check/systems=libvirt-fedora-27/1071/display/redirect> ------------------------------------------ Started by upstream project "libvirt-go-master-check" build number 1071 originally caused by: Started by upstream project "libvirt-go-master-build" build number 1082 originally caused by: Started by upstream project "libvirt-master-build" build number 1479 originally caused by: Started by an SCM change [EnvInject] - Loading node environment variables. Building remotely on libvirt-fedora-27 (libvirt) in workspace <https://ci.centos.org/job/libvirt-go-master-check/systems=libvirt-fedora-27/ws/> [libvirt-go-master] $ /bin/sh -xe /tmp/jenkins8348021055287322195.sh + export 'TEST_ARGS=-tags api' + TEST_ARGS='-tags api' + go test -tags api 2018-05-31 15:46:45.074+0000: 24295: info : libvirt version: 4.4.0 2018-05-31 15:46:45.074+0000: 24295: info : hostname: libvirt-fedora-27 2018-05-31 15:46:45.074+0000: 24295: warning : virEventRegisterImpl:245 : Ignoring attempt to replace registered event loop 2018-05-31 15:46:45.075+0000: 24295: warning : virEventRegisterImpl:245 : Ignoring attempt to replace registered event loop 2018-05-31 15:46:45.075+0000: 24295: warning : virEventRegisterImpl:245 : Ignoring attempt to replace registered event loop Missing function 'virConnectBaselineHypervisorCPU' Missing function 'virConnectCompareHypervisorCPU' Missing function 'virDomainDetachDeviceAlias' --- FAIL: TestAPICoverage (0.62s) panic: Missing symbols found [recovered] panic: Missing symbols found goroutine 4 [running]: testing.tRunner.func1(0xc4200b20f0) /usr/lib/golang/src/testing/testing.go:711 +0x2d2 panic(0x5b5d80, 0x61a2e0) /usr/lib/golang/src/runtime/panic.go:491 +0x283 _<https://ci.centos.org/job/libvirt-go-master-check/systems=libvirt-fedora-27/ws/.TestAPICoverage(0xc4200b20f0)> <https://ci.centos.org/job/libvirt-go-master-check/systems=libvirt-fedora-27/ws/api_test.go>:504 +0x5b1 testing.tRunner(0xc4200b20f0, 0x604b28) /usr/lib/golang/src/testing/testing.go:746 +0xd0 created by testing.(*T).Run /usr/lib/golang/src/testing/testing.go:789 +0x2de exit status 2 FAIL _<https://ci.centos.org/job/libvirt-go-master-check/systems=libvirt-fedora-27/ws/> 0.709s Build step 'Execute shell' marked build as failure

See <https://ci.centos.org/job/libvirt-go-master-check/systems=libvirt-fedora-27/1072/display/redirect> ------------------------------------------ Started by upstream project "libvirt-go-master-check" build number 1072 originally caused by: Started by upstream project "libvirt-go-master-build" build number 1083 originally caused by: Started by upstream project "libvirt-master-build" build number 1480 originally caused by: Started by an SCM change [EnvInject] - Loading node environment variables. Building remotely on libvirt-fedora-27 (libvirt) in workspace <https://ci.centos.org/job/libvirt-go-master-check/systems=libvirt-fedora-27/ws/> [libvirt-go-master] $ /bin/sh -xe /tmp/jenkins2616187732452100105.sh + export 'TEST_ARGS=-tags api' + TEST_ARGS='-tags api' + go test -tags api 2018-06-01 12:40:00.822+0000: 17706: info : libvirt version: 4.4.0 2018-06-01 12:40:00.822+0000: 17706: info : hostname: libvirt-fedora-27 2018-06-01 12:40:00.822+0000: 17706: warning : virEventRegisterImpl:245 : Ignoring attempt to replace registered event loop 2018-06-01 12:40:00.822+0000: 17706: warning : virEventRegisterImpl:245 : Ignoring attempt to replace registered event loop 2018-06-01 12:40:00.822+0000: 17706: warning : virEventRegisterImpl:245 : Ignoring attempt to replace registered event loop Missing function 'virConnectBaselineHypervisorCPU' Missing function 'virConnectCompareHypervisorCPU' Missing function 'virDomainDetachDeviceAlias' --- FAIL: TestAPICoverage (0.86s) panic: Missing symbols found [recovered] panic: Missing symbols found goroutine 4 [running]: testing.tRunner.func1(0xc4200b20f0) /usr/lib/golang/src/testing/testing.go:711 +0x2d2 panic(0x5b5d80, 0x61a2e0) /usr/lib/golang/src/runtime/panic.go:491 +0x283 _<https://ci.centos.org/job/libvirt-go-master-check/systems=libvirt-fedora-27/ws/.TestAPICoverage(0xc4200b20f0)> <https://ci.centos.org/job/libvirt-go-master-check/systems=libvirt-fedora-27/ws/api_test.go>:504 +0x5b1 testing.tRunner(0xc4200b20f0, 0x604b28) /usr/lib/golang/src/testing/testing.go:746 +0xd0 created by testing.(*T).Run /usr/lib/golang/src/testing/testing.go:789 +0x2de exit status 2 FAIL _<https://ci.centos.org/job/libvirt-go-master-check/systems=libvirt-fedora-27/ws/> 0.989s Build step 'Execute shell' marked build as failure

See <https://ci.centos.org/job/libvirt-go-master-check/systems=libvirt-fedora-27/1073/display/redirect> ------------------------------------------ Started by upstream project "libvirt-go-master-check" build number 1073 originally caused by: Started by upstream project "libvirt-go-master-build" build number 1084 originally caused by: Started by upstream project "libvirt-master-build" build number 1481 originally caused by: Started by an SCM change Started by an SCM change [EnvInject] - Loading node environment variables. Building remotely on libvirt-fedora-27 (libvirt) in workspace <https://ci.centos.org/job/libvirt-go-master-check/systems=libvirt-fedora-27/ws/> [libvirt-go-master] $ /bin/sh -xe /tmp/jenkins1635192976504920201.sh + export 'TEST_ARGS=-tags api' + TEST_ARGS='-tags api' + go test -tags api 2018-06-01 13:59:18.568+0000: 16974: info : libvirt version: 4.4.0 2018-06-01 13:59:18.568+0000: 16974: info : hostname: libvirt-fedora-27 2018-06-01 13:59:18.568+0000: 16974: warning : virEventRegisterImpl:245 : Ignoring attempt to replace registered event loop 2018-06-01 13:59:18.568+0000: 16974: warning : virEventRegisterImpl:245 : Ignoring attempt to replace registered event loop 2018-06-01 13:59:18.568+0000: 16974: warning : virEventRegisterImpl:245 : Ignoring attempt to replace registered event loop Missing function 'virConnectBaselineHypervisorCPU' Missing function 'virConnectCompareHypervisorCPU' Missing function 'virDomainDetachDeviceAlias' --- FAIL: TestAPICoverage (0.94s) panic: Missing symbols found [recovered] panic: Missing symbols found goroutine 19 [running]: testing.tRunner.func1(0xc4200b00f0) /usr/lib/golang/src/testing/testing.go:711 +0x2d2 panic(0x5b5d80, 0x61a2e0) /usr/lib/golang/src/runtime/panic.go:491 +0x283 _<https://ci.centos.org/job/libvirt-go-master-check/systems=libvirt-fedora-27/ws/.TestAPICoverage(0xc4200b00f0)> <https://ci.centos.org/job/libvirt-go-master-check/systems=libvirt-fedora-27/ws/api_test.go>:504 +0x5b1 testing.tRunner(0xc4200b00f0, 0x604b28) /usr/lib/golang/src/testing/testing.go:746 +0xd0 created by testing.(*T).Run /usr/lib/golang/src/testing/testing.go:789 +0x2de exit status 2 FAIL _<https://ci.centos.org/job/libvirt-go-master-check/systems=libvirt-fedora-27/ws/> 1.241s Build step 'Execute shell' marked build as failure

See <https://ci.centos.org/job/libvirt-go-master-check/systems=libvirt-fedora-27/1074/display/redirect> ------------------------------------------ Started by upstream project "libvirt-go-master-check" build number 1074 originally caused by: Started by upstream project "libvirt-go-master-build" build number 1085 originally caused by: Started by upstream project "libvirt-master-build" build number 1482 originally caused by: Started by an SCM change [EnvInject] - Loading node environment variables. Building remotely on libvirt-fedora-27 (libvirt) in workspace <https://ci.centos.org/job/libvirt-go-master-check/systems=libvirt-fedora-27/ws/> [libvirt-go-master] $ /bin/sh -xe /tmp/jenkins4838954596507691633.sh + export 'TEST_ARGS=-tags api' + TEST_ARGS='-tags api' + go test -tags api 2018-06-01 16:31:00.569+0000: 13452: info : libvirt version: 4.4.0 2018-06-01 16:31:00.569+0000: 13452: info : hostname: libvirt-fedora-27 2018-06-01 16:31:00.569+0000: 13452: warning : virEventRegisterImpl:245 : Ignoring attempt to replace registered event loop 2018-06-01 16:31:00.569+0000: 13452: warning : virEventRegisterImpl:245 : Ignoring attempt to replace registered event loop 2018-06-01 16:31:00.569+0000: 13452: warning : virEventRegisterImpl:245 : Ignoring attempt to replace registered event loop Missing function 'virConnectBaselineHypervisorCPU' Missing function 'virConnectCompareHypervisorCPU' Missing function 'virDomainDetachDeviceAlias' --- FAIL: TestAPICoverage (0.40s) panic: Missing symbols found [recovered] panic: Missing symbols found goroutine 19 [running]: testing.tRunner.func1(0xc4200b00f0) /usr/lib/golang/src/testing/testing.go:711 +0x2d2 panic(0x5b5d80, 0x61a2e0) /usr/lib/golang/src/runtime/panic.go:491 +0x283 _<https://ci.centos.org/job/libvirt-go-master-check/systems=libvirt-fedora-27/ws/.TestAPICoverage(0xc4200b00f0)> <https://ci.centos.org/job/libvirt-go-master-check/systems=libvirt-fedora-27/ws/api_test.go>:504 +0x5b1 testing.tRunner(0xc4200b00f0, 0x604b28) /usr/lib/golang/src/testing/testing.go:746 +0xd0 created by testing.(*T).Run /usr/lib/golang/src/testing/testing.go:789 +0x2de exit status 2 FAIL _<https://ci.centos.org/job/libvirt-go-master-check/systems=libvirt-fedora-27/ws/> 0.573s Build step 'Execute shell' marked build as failure

participants (1)
-
ci@centos.org