[Libvirt-ci] Build failed in Jenkins: libvirt-go-master-check » libvirt-centos-7 #1109

See <https://ci.centos.org/job/libvirt-go-master-check/systems=libvirt-centos-7/1109/display/redirect> ------------------------------------------ Started by upstream project "libvirt-go-master-check" build number 1109 originally caused by: Started by upstream project "libvirt-go-master-build" build number 1120 originally caused by: Started by upstream project "libvirt-master-build" build number 1519 originally caused by: Started by an SCM change Started by an SCM change [EnvInject] - Loading node environment variables. Building remotely on libvirt-centos-7 (libvirt) in workspace <https://ci.centos.org/job/libvirt-go-master-check/systems=libvirt-centos-7/ws/> [libvirt-go-master] $ /bin/sh -xe /tmp/jenkins8265302244691237052.sh + export 'TEST_ARGS=-tags api' + TEST_ARGS='-tags api' + go test -tags api Missing function 'virDomainGetLaunchSecurityInfo' Missing function 'virNodeGetSEVInfo' Missing macro 'VIR_DOMAIN_LAUNCH_SECURITY_SEV_MEASUREMENT' Missing macro 'VIR_NODE_SEV_CBITPOS' Missing macro 'VIR_NODE_SEV_CERT_CHAIN' Missing macro 'VIR_NODE_SEV_PDH' Missing macro 'VIR_NODE_SEV_REDUCED_PHYS_BITS' --- FAIL: TestAPICoverage (0.29s) panic: Missing symbols found [recovered] panic: Missing symbols found goroutine 5 [running]: testing.tRunner.func1(0xc4200980f0) /usr/lib/golang/src/testing/testing.go:711 +0x2d2 panic(0x5b6140, 0x61a700) /usr/lib/golang/src/runtime/panic.go:491 +0x283 _<https://ci.centos.org/job/libvirt-go-master-check/systems=libvirt-centos-7/ws/.TestAPICoverage(0xc4200980f0)> <https://ci.centos.org/job/libvirt-go-master-check/systems=libvirt-centos-7/ws/api_test.go>:506 +0x5b1 testing.tRunner(0xc4200980f0, 0x604f40) /usr/lib/golang/src/testing/testing.go:746 +0xd0 created by testing.(*T).Run /usr/lib/golang/src/testing/testing.go:789 +0x2de exit status 2 FAIL _<https://ci.centos.org/job/libvirt-go-master-check/systems=libvirt-centos-7/ws/> 0.363s Build step 'Execute shell' marked build as failure

See <https://ci.centos.org/job/libvirt-go-master-check/systems=libvirt-centos-7/1110/display/redirect> ------------------------------------------ Started by upstream project "libvirt-go-master-check" build number 1110 originally caused by: Started by upstream project "libvirt-go-master-build" build number 1121 originally caused by: Started by upstream project "libvirt-master-build" build number 1520 originally caused by: Started by an SCM change Started by an SCM change Started by an SCM change Started by an SCM change [EnvInject] - Loading node environment variables. Building remotely on libvirt-centos-7 (libvirt) in workspace <https://ci.centos.org/job/libvirt-go-master-check/systems=libvirt-centos-7/ws/> [libvirt-go-master] $ /bin/sh -xe /tmp/jenkins3643389044761231622.sh + export 'TEST_ARGS=-tags api' + TEST_ARGS='-tags api' + go test -tags api Missing function 'virDomainGetLaunchSecurityInfo' Missing function 'virNodeGetSEVInfo' Missing macro 'VIR_DOMAIN_LAUNCH_SECURITY_SEV_MEASUREMENT' Missing macro 'VIR_NODE_SEV_CBITPOS' Missing macro 'VIR_NODE_SEV_CERT_CHAIN' Missing macro 'VIR_NODE_SEV_PDH' Missing macro 'VIR_NODE_SEV_REDUCED_PHYS_BITS' --- FAIL: TestAPICoverage (0.71s) panic: Missing symbols found [recovered] panic: Missing symbols found goroutine 19 [running]: testing.tRunner.func1(0xc4200ae0f0) /usr/lib/golang/src/testing/testing.go:711 +0x2d2 panic(0x5b6140, 0x61a700) /usr/lib/golang/src/runtime/panic.go:491 +0x283 _<https://ci.centos.org/job/libvirt-go-master-check/systems=libvirt-centos-7/ws/.TestAPICoverage(0xc4200ae0f0)> <https://ci.centos.org/job/libvirt-go-master-check/systems=libvirt-centos-7/ws/api_test.go>:506 +0x5b1 testing.tRunner(0xc4200ae0f0, 0x604f40) /usr/lib/golang/src/testing/testing.go:746 +0xd0 created by testing.(*T).Run /usr/lib/golang/src/testing/testing.go:789 +0x2de exit status 2 FAIL _<https://ci.centos.org/job/libvirt-go-master-check/systems=libvirt-centos-7/ws/> 0.875s Build step 'Execute shell' marked build as failure

See <https://ci.centos.org/job/libvirt-go-master-check/systems=libvirt-centos-7/1111/display/redirect> ------------------------------------------ Started by upstream project "libvirt-go-master-check" build number 1111 originally caused by: Started by upstream project "libvirt-go-master-build" build number 1122 originally caused by: Started by upstream project "libvirt-master-build" build number 1521 originally caused by: Started by an SCM change [EnvInject] - Loading node environment variables. Building remotely on libvirt-centos-7 (libvirt) in workspace <https://ci.centos.org/job/libvirt-go-master-check/systems=libvirt-centos-7/ws/> [libvirt-go-master] $ /bin/sh -xe /tmp/jenkins6239600879001859886.sh + export 'TEST_ARGS=-tags api' + TEST_ARGS='-tags api' + go test -tags api Missing function 'virDomainGetLaunchSecurityInfo' Missing function 'virNodeGetSEVInfo' Missing macro 'VIR_DOMAIN_LAUNCH_SECURITY_SEV_MEASUREMENT' Missing macro 'VIR_NODE_SEV_CBITPOS' Missing macro 'VIR_NODE_SEV_CERT_CHAIN' Missing macro 'VIR_NODE_SEV_PDH' Missing macro 'VIR_NODE_SEV_REDUCED_PHYS_BITS' --- FAIL: TestAPICoverage (0.38s) panic: Missing symbols found [recovered] panic: Missing symbols found goroutine 5 [running]: testing.tRunner.func1(0xc4200980f0) /usr/lib/golang/src/testing/testing.go:711 +0x2d2 panic(0x5b6140, 0x61a700) /usr/lib/golang/src/runtime/panic.go:491 +0x283 _<https://ci.centos.org/job/libvirt-go-master-check/systems=libvirt-centos-7/ws/.TestAPICoverage(0xc4200980f0)> <https://ci.centos.org/job/libvirt-go-master-check/systems=libvirt-centos-7/ws/api_test.go>:506 +0x5b1 testing.tRunner(0xc4200980f0, 0x604f40) /usr/lib/golang/src/testing/testing.go:746 +0xd0 created by testing.(*T).Run /usr/lib/golang/src/testing/testing.go:789 +0x2de exit status 2 FAIL _<https://ci.centos.org/job/libvirt-go-master-check/systems=libvirt-centos-7/ws/> 0.478s Build step 'Execute shell' marked build as failure

See <https://ci.centos.org/job/libvirt-go-master-check/systems=libvirt-centos-7/1112/display/redirect> ------------------------------------------ Started by upstream project "libvirt-go-master-check" build number 1112 originally caused by: Started by upstream project "libvirt-go-master-build" build number 1123 originally caused by: Started by upstream project "libvirt-master-build" build number 1522 originally caused by: Started by an SCM change [EnvInject] - Loading node environment variables. Building remotely on libvirt-centos-7 (libvirt) in workspace <https://ci.centos.org/job/libvirt-go-master-check/systems=libvirt-centos-7/ws/> [libvirt-go-master] $ /bin/sh -xe /tmp/jenkins4776750706004559443.sh + export 'TEST_ARGS=-tags api' + TEST_ARGS='-tags api' + go test -tags api Missing function 'virDomainGetLaunchSecurityInfo' Missing function 'virNodeGetSEVInfo' Missing macro 'VIR_DOMAIN_LAUNCH_SECURITY_SEV_MEASUREMENT' Missing macro 'VIR_NODE_SEV_CBITPOS' Missing macro 'VIR_NODE_SEV_CERT_CHAIN' Missing macro 'VIR_NODE_SEV_PDH' Missing macro 'VIR_NODE_SEV_REDUCED_PHYS_BITS' --- FAIL: TestAPICoverage (0.36s) panic: Missing symbols found [recovered] panic: Missing symbols found goroutine 5 [running]: testing.tRunner.func1(0xc4200980f0) /usr/lib/golang/src/testing/testing.go:711 +0x2d2 panic(0x5b6140, 0x61a700) /usr/lib/golang/src/runtime/panic.go:491 +0x283 _<https://ci.centos.org/job/libvirt-go-master-check/systems=libvirt-centos-7/ws/.TestAPICoverage(0xc4200980f0)> <https://ci.centos.org/job/libvirt-go-master-check/systems=libvirt-centos-7/ws/api_test.go>:506 +0x5b1 testing.tRunner(0xc4200980f0, 0x604f40) /usr/lib/golang/src/testing/testing.go:746 +0xd0 created by testing.(*T).Run /usr/lib/golang/src/testing/testing.go:789 +0x2de exit status 2 FAIL _<https://ci.centos.org/job/libvirt-go-master-check/systems=libvirt-centos-7/ws/> 0.486s Build step 'Execute shell' marked build as failure

See <https://ci.centos.org/job/libvirt-go-master-check/systems=libvirt-centos-7/1113/display/redirect> ------------------------------------------ Started by upstream project "libvirt-go-master-check" build number 1113 originally caused by: Started by upstream project "libvirt-go-master-build" build number 1124 originally caused by: Started by upstream project "libvirt-master-build" build number 1523 originally caused by: Started by an SCM change [EnvInject] - Loading node environment variables. Building remotely on libvirt-centos-7 (libvirt) in workspace <https://ci.centos.org/job/libvirt-go-master-check/systems=libvirt-centos-7/ws/> [libvirt-go-master] $ /bin/sh -xe /tmp/jenkins3749200581523587701.sh + export 'TEST_ARGS=-tags api' + TEST_ARGS='-tags api' + go test -tags api Missing function 'virDomainGetLaunchSecurityInfo' Missing function 'virNodeGetSEVInfo' Missing macro 'VIR_DOMAIN_LAUNCH_SECURITY_SEV_MEASUREMENT' Missing macro 'VIR_NODE_SEV_CBITPOS' Missing macro 'VIR_NODE_SEV_CERT_CHAIN' Missing macro 'VIR_NODE_SEV_PDH' Missing macro 'VIR_NODE_SEV_REDUCED_PHYS_BITS' --- FAIL: TestAPICoverage (0.22s) panic: Missing symbols found [recovered] panic: Missing symbols found goroutine 5 [running]: testing.tRunner.func1(0xc4200980f0) /usr/lib/golang/src/testing/testing.go:711 +0x2d2 panic(0x5b6140, 0x61a700) /usr/lib/golang/src/runtime/panic.go:491 +0x283 _<https://ci.centos.org/job/libvirt-go-master-check/systems=libvirt-centos-7/ws/.TestAPICoverage(0xc4200980f0)> <https://ci.centos.org/job/libvirt-go-master-check/systems=libvirt-centos-7/ws/api_test.go>:506 +0x5b1 testing.tRunner(0xc4200980f0, 0x604f40) /usr/lib/golang/src/testing/testing.go:746 +0xd0 created by testing.(*T).Run /usr/lib/golang/src/testing/testing.go:789 +0x2de exit status 2 FAIL _<https://ci.centos.org/job/libvirt-go-master-check/systems=libvirt-centos-7/ws/> 0.261s Build step 'Execute shell' marked build as failure

See <https://ci.centos.org/job/libvirt-go-master-check/systems=libvirt-centos-7/1114/display/redirect> ------------------------------------------ Started by upstream project "libvirt-go-master-check" build number 1114 originally caused by: Started by upstream project "libvirt-go-master-build" build number 1125 originally caused by: Started by upstream project "libvirt-master-build" build number 1524 originally caused by: Started by an SCM change Started by an SCM change Started by an SCM change [EnvInject] - Loading node environment variables. Building remotely on libvirt-centos-7 (libvirt) in workspace <https://ci.centos.org/job/libvirt-go-master-check/systems=libvirt-centos-7/ws/> [libvirt-go-master] $ /bin/sh -xe /tmp/jenkins6257393430721259944.sh + export 'TEST_ARGS=-tags api' + TEST_ARGS='-tags api' + go test -tags api Missing function 'virDomainGetLaunchSecurityInfo' Missing function 'virNodeGetSEVInfo' Missing macro 'VIR_DOMAIN_LAUNCH_SECURITY_SEV_MEASUREMENT' Missing macro 'VIR_NODE_SEV_CBITPOS' Missing macro 'VIR_NODE_SEV_CERT_CHAIN' Missing macro 'VIR_NODE_SEV_PDH' Missing macro 'VIR_NODE_SEV_REDUCED_PHYS_BITS' --- FAIL: TestAPICoverage (0.32s) panic: Missing symbols found [recovered] panic: Missing symbols found goroutine 5 [running]: testing.tRunner.func1(0xc4200980f0) /usr/lib/golang/src/testing/testing.go:711 +0x2d2 panic(0x5b6140, 0x61a700) /usr/lib/golang/src/runtime/panic.go:491 +0x283 _<https://ci.centos.org/job/libvirt-go-master-check/systems=libvirt-centos-7/ws/.TestAPICoverage(0xc4200980f0)> <https://ci.centos.org/job/libvirt-go-master-check/systems=libvirt-centos-7/ws/api_test.go>:506 +0x5b1 testing.tRunner(0xc4200980f0, 0x604f40) /usr/lib/golang/src/testing/testing.go:746 +0xd0 created by testing.(*T).Run /usr/lib/golang/src/testing/testing.go:789 +0x2de exit status 2 FAIL _<https://ci.centos.org/job/libvirt-go-master-check/systems=libvirt-centos-7/ws/> 0.392s Build step 'Execute shell' marked build as failure

See <https://ci.centos.org/job/libvirt-go-master-check/systems=libvirt-centos-7/1115/display/redirect> ------------------------------------------ Started by upstream project "libvirt-go-master-check" build number 1115 originally caused by: Started by upstream project "libvirt-go-master-build" build number 1126 originally caused by: Started by upstream project "libvirt-master-build" build number 1525 originally caused by: Started by an SCM change [EnvInject] - Loading node environment variables. Building remotely on libvirt-centos-7 (libvirt) in workspace <https://ci.centos.org/job/libvirt-go-master-check/systems=libvirt-centos-7/ws/> [libvirt-go-master] $ /bin/sh -xe /tmp/jenkins6175649070393505843.sh + export 'TEST_ARGS=-tags api' + TEST_ARGS='-tags api' + go test -tags api Missing function 'virDomainGetLaunchSecurityInfo' Missing function 'virNodeGetSEVInfo' Missing macro 'VIR_DOMAIN_LAUNCH_SECURITY_SEV_MEASUREMENT' Missing macro 'VIR_NODE_SEV_CBITPOS' Missing macro 'VIR_NODE_SEV_CERT_CHAIN' Missing macro 'VIR_NODE_SEV_PDH' Missing macro 'VIR_NODE_SEV_REDUCED_PHYS_BITS' --- FAIL: TestAPICoverage (0.43s) panic: Missing symbols found [recovered] panic: Missing symbols found goroutine 5 [running]: testing.tRunner.func1(0xc4200980f0) /usr/lib/golang/src/testing/testing.go:711 +0x2d2 panic(0x5b6140, 0x61a700) /usr/lib/golang/src/runtime/panic.go:491 +0x283 _<https://ci.centos.org/job/libvirt-go-master-check/systems=libvirt-centos-7/ws/.TestAPICoverage(0xc4200980f0)> <https://ci.centos.org/job/libvirt-go-master-check/systems=libvirt-centos-7/ws/api_test.go>:506 +0x5b1 testing.tRunner(0xc4200980f0, 0x604f40) /usr/lib/golang/src/testing/testing.go:746 +0xd0 created by testing.(*T).Run /usr/lib/golang/src/testing/testing.go:789 +0x2de exit status 2 FAIL _<https://ci.centos.org/job/libvirt-go-master-check/systems=libvirt-centos-7/ws/> 0.525s Build step 'Execute shell' marked build as failure

See <https://ci.centos.org/job/libvirt-go-master-check/systems=libvirt-centos-7/1116/display/redirect> ------------------------------------------ Started by upstream project "libvirt-go-master-check" build number 1116 originally caused by: Started by upstream project "libvirt-go-master-build" build number 1127 originally caused by: Started by upstream project "libvirt-master-build" build number 1526 originally caused by: Started by an SCM change [EnvInject] - Loading node environment variables. Building remotely on libvirt-centos-7 (libvirt) in workspace <https://ci.centos.org/job/libvirt-go-master-check/systems=libvirt-centos-7/ws/> [libvirt-go-master] $ /bin/sh -xe /tmp/jenkins2120643259924785678.sh + export 'TEST_ARGS=-tags api' + TEST_ARGS='-tags api' + go test -tags api Missing function 'virDomainGetLaunchSecurityInfo' Missing function 'virNodeGetSEVInfo' Missing macro 'VIR_DOMAIN_LAUNCH_SECURITY_SEV_MEASUREMENT' Missing macro 'VIR_NODE_SEV_CBITPOS' Missing macro 'VIR_NODE_SEV_CERT_CHAIN' Missing macro 'VIR_NODE_SEV_PDH' Missing macro 'VIR_NODE_SEV_REDUCED_PHYS_BITS' --- FAIL: TestAPICoverage (0.50s) panic: Missing symbols found [recovered] panic: Missing symbols found goroutine 19 [running]: testing.tRunner.func1(0xc4200ae0f0) /usr/lib/golang/src/testing/testing.go:711 +0x2d2 panic(0x5b6140, 0x61a700) /usr/lib/golang/src/runtime/panic.go:491 +0x283 _<https://ci.centos.org/job/libvirt-go-master-check/systems=libvirt-centos-7/ws/.TestAPICoverage(0xc4200ae0f0)> <https://ci.centos.org/job/libvirt-go-master-check/systems=libvirt-centos-7/ws/api_test.go>:506 +0x5b1 testing.tRunner(0xc4200ae0f0, 0x604f40) /usr/lib/golang/src/testing/testing.go:746 +0xd0 created by testing.(*T).Run /usr/lib/golang/src/testing/testing.go:789 +0x2de exit status 2 FAIL _<https://ci.centos.org/job/libvirt-go-master-check/systems=libvirt-centos-7/ws/> 0.615s Build step 'Execute shell' marked build as failure

See <https://ci.centos.org/job/libvirt-go-master-check/systems=libvirt-centos-7/1117/display/redirect> ------------------------------------------ Started by upstream project "libvirt-go-master-check" build number 1117 originally caused by: Started by upstream project "libvirt-go-master-build" build number 1128 originally caused by: Started by upstream project "libvirt-master-build" build number 1527 originally caused by: Started by an SCM change [EnvInject] - Loading node environment variables. Building remotely on libvirt-centos-7 (libvirt) in workspace <https://ci.centos.org/job/libvirt-go-master-check/systems=libvirt-centos-7/ws/> [libvirt-go-master] $ /bin/sh -xe /tmp/jenkins7802922930772711333.sh + export 'TEST_ARGS=-tags api' + TEST_ARGS='-tags api' + go test -tags api Missing function 'virDomainGetLaunchSecurityInfo' Missing function 'virNodeGetSEVInfo' Missing macro 'VIR_DOMAIN_LAUNCH_SECURITY_SEV_MEASUREMENT' Missing macro 'VIR_NODE_SEV_CBITPOS' Missing macro 'VIR_NODE_SEV_CERT_CHAIN' Missing macro 'VIR_NODE_SEV_PDH' Missing macro 'VIR_NODE_SEV_REDUCED_PHYS_BITS' --- FAIL: TestAPICoverage (0.46s) panic: Missing symbols found [recovered] panic: Missing symbols found goroutine 5 [running]: testing.tRunner.func1(0xc4200980f0) /usr/lib/golang/src/testing/testing.go:711 +0x2d2 panic(0x5b6140, 0x61a700) /usr/lib/golang/src/runtime/panic.go:491 +0x283 _<https://ci.centos.org/job/libvirt-go-master-check/systems=libvirt-centos-7/ws/.TestAPICoverage(0xc4200980f0)> <https://ci.centos.org/job/libvirt-go-master-check/systems=libvirt-centos-7/ws/api_test.go>:506 +0x5b1 testing.tRunner(0xc4200980f0, 0x604f40) /usr/lib/golang/src/testing/testing.go:746 +0xd0 created by testing.(*T).Run /usr/lib/golang/src/testing/testing.go:789 +0x2de exit status 2 FAIL _<https://ci.centos.org/job/libvirt-go-master-check/systems=libvirt-centos-7/ws/> 0.536s Build step 'Execute shell' marked build as failure

See <https://ci.centos.org/job/libvirt-go-master-check/systems=libvirt-centos-7/1118/display/redirect> ------------------------------------------ Started by upstream project "libvirt-go-master-check" build number 1118 originally caused by: Started by upstream project "libvirt-go-master-build" build number 1129 originally caused by: Started by upstream project "libvirt-master-build" build number 1528 originally caused by: Started by an SCM change [EnvInject] - Loading node environment variables. Building remotely on libvirt-centos-7 (libvirt) in workspace <https://ci.centos.org/job/libvirt-go-master-check/systems=libvirt-centos-7/ws/> [libvirt-go-master] $ /bin/sh -xe /tmp/jenkins784615588466653093.sh + export 'TEST_ARGS=-tags api' + TEST_ARGS='-tags api' + go test -tags api Missing function 'virDomainGetLaunchSecurityInfo' Missing function 'virNodeGetSEVInfo' Missing macro 'VIR_DOMAIN_LAUNCH_SECURITY_SEV_MEASUREMENT' Missing macro 'VIR_NODE_SEV_CBITPOS' Missing macro 'VIR_NODE_SEV_CERT_CHAIN' Missing macro 'VIR_NODE_SEV_PDH' Missing macro 'VIR_NODE_SEV_REDUCED_PHYS_BITS' --- FAIL: TestAPICoverage (0.58s) panic: Missing symbols found [recovered] panic: Missing symbols found goroutine 5 [running]: testing.tRunner.func1(0xc4200980f0) /usr/lib/golang/src/testing/testing.go:711 +0x2d2 panic(0x5b6140, 0x61a700) /usr/lib/golang/src/runtime/panic.go:491 +0x283 _<https://ci.centos.org/job/libvirt-go-master-check/systems=libvirt-centos-7/ws/.TestAPICoverage(0xc4200980f0)> <https://ci.centos.org/job/libvirt-go-master-check/systems=libvirt-centos-7/ws/api_test.go>:506 +0x5b1 testing.tRunner(0xc4200980f0, 0x604f40) /usr/lib/golang/src/testing/testing.go:746 +0xd0 created by testing.(*T).Run /usr/lib/golang/src/testing/testing.go:789 +0x2de exit status 2 FAIL _<https://ci.centos.org/job/libvirt-go-master-check/systems=libvirt-centos-7/ws/> 0.685s Build step 'Execute shell' marked build as failure

See <https://ci.centos.org/job/libvirt-go-master-check/systems=libvirt-centos-7/1119/display/redirect> ------------------------------------------ Started by upstream project "libvirt-go-master-check" build number 1119 originally caused by: Started by upstream project "libvirt-go-master-build" build number 1130 originally caused by: Started by upstream project "libvirt-master-build" build number 1529 originally caused by: Started by an SCM change Started by an SCM change Started by an SCM change [EnvInject] - Loading node environment variables. Building remotely on libvirt-centos-7 (libvirt) in workspace <https://ci.centos.org/job/libvirt-go-master-check/systems=libvirt-centos-7/ws/> [libvirt-go-master] $ /bin/sh -xe /tmp/jenkins1923861116181008697.sh + export 'TEST_ARGS=-tags api' + TEST_ARGS='-tags api' + go test -tags api Missing function 'virDomainGetLaunchSecurityInfo' Missing function 'virNodeGetSEVInfo' Missing macro 'VIR_DOMAIN_LAUNCH_SECURITY_SEV_MEASUREMENT' Missing macro 'VIR_NODE_SEV_CBITPOS' Missing macro 'VIR_NODE_SEV_CERT_CHAIN' Missing macro 'VIR_NODE_SEV_PDH' Missing macro 'VIR_NODE_SEV_REDUCED_PHYS_BITS' --- FAIL: TestAPICoverage (0.84s) panic: Missing symbols found [recovered] panic: Missing symbols found goroutine 5 [running]: testing.tRunner.func1(0xc4200980f0) /usr/lib/golang/src/testing/testing.go:711 +0x2d2 panic(0x5b6140, 0x61a700) /usr/lib/golang/src/runtime/panic.go:491 +0x283 _<https://ci.centos.org/job/libvirt-go-master-check/systems=libvirt-centos-7/ws/.TestAPICoverage(0xc4200980f0)> <https://ci.centos.org/job/libvirt-go-master-check/systems=libvirt-centos-7/ws/api_test.go>:506 +0x5b1 testing.tRunner(0xc4200980f0, 0x604f40) /usr/lib/golang/src/testing/testing.go:746 +0xd0 created by testing.(*T).Run /usr/lib/golang/src/testing/testing.go:789 +0x2de exit status 2 FAIL _<https://ci.centos.org/job/libvirt-go-master-check/systems=libvirt-centos-7/ws/> 1.061s Build step 'Execute shell' marked build as failure

See <https://ci.centos.org/job/libvirt-go-master-check/systems=libvirt-centos-7/1120/display/redirect> ------------------------------------------ Started by upstream project "libvirt-go-master-check" build number 1120 originally caused by: Started by upstream project "libvirt-go-master-build" build number 1131 originally caused by: Started by upstream project "libvirt-master-build" build number 1530 originally caused by: Started by an SCM change [EnvInject] - Loading node environment variables. Building remotely on libvirt-centos-7 (libvirt) in workspace <https://ci.centos.org/job/libvirt-go-master-check/systems=libvirt-centos-7/ws/> [libvirt-go-master] $ /bin/sh -xe /tmp/jenkins5733576326659547683.sh + export 'TEST_ARGS=-tags api' + TEST_ARGS='-tags api' + go test -tags api Missing function 'virDomainGetLaunchSecurityInfo' Missing function 'virNodeGetSEVInfo' Missing macro 'VIR_DOMAIN_LAUNCH_SECURITY_SEV_MEASUREMENT' Missing macro 'VIR_NODE_SEV_CBITPOS' Missing macro 'VIR_NODE_SEV_CERT_CHAIN' Missing macro 'VIR_NODE_SEV_PDH' Missing macro 'VIR_NODE_SEV_REDUCED_PHYS_BITS' --- FAIL: TestAPICoverage (0.53s) panic: Missing symbols found [recovered] panic: Missing symbols found goroutine 5 [running]: testing.tRunner.func1(0xc4200980f0) /usr/lib/golang/src/testing/testing.go:711 +0x2d2 panic(0x5b6140, 0x61a700) /usr/lib/golang/src/runtime/panic.go:491 +0x283 _<https://ci.centos.org/job/libvirt-go-master-check/systems=libvirt-centos-7/ws/.TestAPICoverage(0xc4200980f0)> <https://ci.centos.org/job/libvirt-go-master-check/systems=libvirt-centos-7/ws/api_test.go>:506 +0x5b1 testing.tRunner(0xc4200980f0, 0x604f40) /usr/lib/golang/src/testing/testing.go:746 +0xd0 created by testing.(*T).Run /usr/lib/golang/src/testing/testing.go:789 +0x2de exit status 2 FAIL _<https://ci.centos.org/job/libvirt-go-master-check/systems=libvirt-centos-7/ws/> 0.598s Build step 'Execute shell' marked build as failure

See <https://ci.centos.org/job/libvirt-go-master-check/systems=libvirt-centos-7/1121/display/redirect> ------------------------------------------ Started by upstream project "libvirt-go-master-check" build number 1121 originally caused by: Started by upstream project "libvirt-go-master-build" build number 1132 originally caused by: Started by upstream project "libvirt-master-build" build number 1531 originally caused by: Started by an SCM change [EnvInject] - Loading node environment variables. Building remotely on libvirt-centos-7 (libvirt) in workspace <https://ci.centos.org/job/libvirt-go-master-check/systems=libvirt-centos-7/ws/> [libvirt-go-master] $ /bin/sh -xe /tmp/jenkins2309337625494368145.sh + export 'TEST_ARGS=-tags api' + TEST_ARGS='-tags api' + go test -tags api Missing function 'virDomainGetLaunchSecurityInfo' Missing function 'virNodeGetSEVInfo' Missing macro 'VIR_DOMAIN_LAUNCH_SECURITY_SEV_MEASUREMENT' Missing macro 'VIR_NODE_SEV_CBITPOS' Missing macro 'VIR_NODE_SEV_CERT_CHAIN' Missing macro 'VIR_NODE_SEV_PDH' Missing macro 'VIR_NODE_SEV_REDUCED_PHYS_BITS' --- FAIL: TestAPICoverage (0.89s) panic: Missing symbols found [recovered] panic: Missing symbols found goroutine 5 [running]: testing.tRunner.func1(0xc4200980f0) /usr/lib/golang/src/testing/testing.go:711 +0x2d2 panic(0x5b6140, 0x61a700) /usr/lib/golang/src/runtime/panic.go:491 +0x283 _<https://ci.centos.org/job/libvirt-go-master-check/systems=libvirt-centos-7/ws/.TestAPICoverage(0xc4200980f0)> <https://ci.centos.org/job/libvirt-go-master-check/systems=libvirt-centos-7/ws/api_test.go>:506 +0x5b1 testing.tRunner(0xc4200980f0, 0x604f40) /usr/lib/golang/src/testing/testing.go:746 +0xd0 created by testing.(*T).Run /usr/lib/golang/src/testing/testing.go:789 +0x2de exit status 2 FAIL _<https://ci.centos.org/job/libvirt-go-master-check/systems=libvirt-centos-7/ws/> 1.068s Build step 'Execute shell' marked build as failure

See <https://ci.centos.org/job/libvirt-go-master-check/systems=libvirt-centos-7/1122/display/redirect> ------------------------------------------ Started by upstream project "libvirt-go-master-check" build number 1122 originally caused by: Started by upstream project "libvirt-go-master-build" build number 1133 originally caused by: Started by upstream project "libvirt-master-build" build number 1532 originally caused by: Started by an SCM change [EnvInject] - Loading node environment variables. Building remotely on libvirt-centos-7 (libvirt) in workspace <https://ci.centos.org/job/libvirt-go-master-check/systems=libvirt-centos-7/ws/> [libvirt-go-master] $ /bin/sh -xe /tmp/jenkins2857843138561461900.sh + export 'TEST_ARGS=-tags api' + TEST_ARGS='-tags api' + go test -tags api Missing function 'virDomainGetLaunchSecurityInfo' Missing function 'virNodeGetSEVInfo' Missing macro 'VIR_DOMAIN_LAUNCH_SECURITY_SEV_MEASUREMENT' Missing macro 'VIR_NODE_SEV_CBITPOS' Missing macro 'VIR_NODE_SEV_CERT_CHAIN' Missing macro 'VIR_NODE_SEV_PDH' Missing macro 'VIR_NODE_SEV_REDUCED_PHYS_BITS' --- FAIL: TestAPICoverage (0.40s) panic: Missing symbols found [recovered] panic: Missing symbols found goroutine 5 [running]: testing.tRunner.func1(0xc4200980f0) /usr/lib/golang/src/testing/testing.go:711 +0x2d2 panic(0x5b6140, 0x61a700) /usr/lib/golang/src/runtime/panic.go:491 +0x283 _<https://ci.centos.org/job/libvirt-go-master-check/systems=libvirt-centos-7/ws/.TestAPICoverage(0xc4200980f0)> <https://ci.centos.org/job/libvirt-go-master-check/systems=libvirt-centos-7/ws/api_test.go>:506 +0x5b1 testing.tRunner(0xc4200980f0, 0x604f40) /usr/lib/golang/src/testing/testing.go:746 +0xd0 created by testing.(*T).Run /usr/lib/golang/src/testing/testing.go:789 +0x2de exit status 2 FAIL _<https://ci.centos.org/job/libvirt-go-master-check/systems=libvirt-centos-7/ws/> 0.499s Build step 'Execute shell' marked build as failure

See <https://ci.centos.org/job/libvirt-go-master-check/systems=libvirt-centos-7/1123/display/redirect> ------------------------------------------ Started by upstream project "libvirt-go-master-check" build number 1123 originally caused by: Started by upstream project "libvirt-go-master-build" build number 1134 originally caused by: Started by upstream project "libvirt-master-build" build number 1533 originally caused by: Started by an SCM change [EnvInject] - Loading node environment variables. Building remotely on libvirt-centos-7 (libvirt) in workspace <https://ci.centos.org/job/libvirt-go-master-check/systems=libvirt-centos-7/ws/> [libvirt-go-master] $ /bin/sh -xe /tmp/jenkins8794302987357843055.sh + export 'TEST_ARGS=-tags api' + TEST_ARGS='-tags api' + go test -tags api Missing function 'virDomainGetLaunchSecurityInfo' Missing function 'virNodeGetSEVInfo' Missing macro 'VIR_DOMAIN_LAUNCH_SECURITY_SEV_MEASUREMENT' Missing macro 'VIR_NODE_SEV_CBITPOS' Missing macro 'VIR_NODE_SEV_CERT_CHAIN' Missing macro 'VIR_NODE_SEV_PDH' Missing macro 'VIR_NODE_SEV_REDUCED_PHYS_BITS' --- FAIL: TestAPICoverage (0.66s) panic: Missing symbols found [recovered] panic: Missing symbols found goroutine 5 [running]: testing.tRunner.func1(0xc4200980f0) /usr/lib/golang/src/testing/testing.go:711 +0x2d2 panic(0x5b6140, 0x61a700) /usr/lib/golang/src/runtime/panic.go:491 +0x283 _<https://ci.centos.org/job/libvirt-go-master-check/systems=libvirt-centos-7/ws/.TestAPICoverage(0xc4200980f0)> <https://ci.centos.org/job/libvirt-go-master-check/systems=libvirt-centos-7/ws/api_test.go>:506 +0x5b1 testing.tRunner(0xc4200980f0, 0x604f40) /usr/lib/golang/src/testing/testing.go:746 +0xd0 created by testing.(*T).Run /usr/lib/golang/src/testing/testing.go:789 +0x2de exit status 2 FAIL _<https://ci.centos.org/job/libvirt-go-master-check/systems=libvirt-centos-7/ws/> 0.806s Build step 'Execute shell' marked build as failure

See <https://ci.centos.org/job/libvirt-go-master-check/systems=libvirt-centos-7/1124/display/redirect> ------------------------------------------ Started by upstream project "libvirt-go-master-check" build number 1124 originally caused by: Started by upstream project "libvirt-go-master-build" build number 1135 originally caused by: Started by upstream project "libvirt-master-build" build number 1534 originally caused by: Started by an SCM change [EnvInject] - Loading node environment variables. Building remotely on libvirt-centos-7 (libvirt) in workspace <https://ci.centos.org/job/libvirt-go-master-check/systems=libvirt-centos-7/ws/> [libvirt-go-master] $ /bin/sh -xe /tmp/jenkins1910921802763071932.sh + export 'TEST_ARGS=-tags api' + TEST_ARGS='-tags api' + go test -tags api Missing function 'virDomainGetLaunchSecurityInfo' Missing function 'virNodeGetSEVInfo' Missing macro 'VIR_DOMAIN_LAUNCH_SECURITY_SEV_MEASUREMENT' Missing macro 'VIR_NODE_SEV_CBITPOS' Missing macro 'VIR_NODE_SEV_CERT_CHAIN' Missing macro 'VIR_NODE_SEV_PDH' Missing macro 'VIR_NODE_SEV_REDUCED_PHYS_BITS' --- FAIL: TestAPICoverage (0.69s) panic: Missing symbols found [recovered] panic: Missing symbols found goroutine 19 [running]: testing.tRunner.func1(0xc4200ae0f0) /usr/lib/golang/src/testing/testing.go:711 +0x2d2 panic(0x5b6140, 0x61a700) /usr/lib/golang/src/runtime/panic.go:491 +0x283 _<https://ci.centos.org/job/libvirt-go-master-check/systems=libvirt-centos-7/ws/.TestAPICoverage(0xc4200ae0f0)> <https://ci.centos.org/job/libvirt-go-master-check/systems=libvirt-centos-7/ws/api_test.go>:506 +0x5b1 testing.tRunner(0xc4200ae0f0, 0x604f40) /usr/lib/golang/src/testing/testing.go:746 +0xd0 created by testing.(*T).Run /usr/lib/golang/src/testing/testing.go:789 +0x2de exit status 2 FAIL _<https://ci.centos.org/job/libvirt-go-master-check/systems=libvirt-centos-7/ws/> 0.843s Build step 'Execute shell' marked build as failure

See <https://ci.centos.org/job/libvirt-go-master-check/systems=libvirt-centos-7/1125/display/redirect> ------------------------------------------ Started by upstream project "libvirt-go-master-check" build number 1125 originally caused by: Started by upstream project "libvirt-go-master-build" build number 1136 originally caused by: Started by upstream project "libvirt-master-build" build number 1535 originally caused by: Started by an SCM change [EnvInject] - Loading node environment variables. Building remotely on libvirt-centos-7 (libvirt) in workspace <https://ci.centos.org/job/libvirt-go-master-check/systems=libvirt-centos-7/ws/> [libvirt-go-master] $ /bin/sh -xe /tmp/jenkins8146876399602054848.sh + export 'TEST_ARGS=-tags api' + TEST_ARGS='-tags api' + go test -tags api Missing function 'virDomainGetLaunchSecurityInfo' Missing function 'virNodeGetSEVInfo' Missing macro 'VIR_DOMAIN_LAUNCH_SECURITY_SEV_MEASUREMENT' Missing macro 'VIR_NODE_SEV_CBITPOS' Missing macro 'VIR_NODE_SEV_CERT_CHAIN' Missing macro 'VIR_NODE_SEV_PDH' Missing macro 'VIR_NODE_SEV_REDUCED_PHYS_BITS' --- FAIL: TestAPICoverage (0.29s) panic: Missing symbols found [recovered] panic: Missing symbols found goroutine 5 [running]: testing.tRunner.func1(0xc4200980f0) /usr/lib/golang/src/testing/testing.go:711 +0x2d2 panic(0x5b6140, 0x61a700) /usr/lib/golang/src/runtime/panic.go:491 +0x283 _<https://ci.centos.org/job/libvirt-go-master-check/systems=libvirt-centos-7/ws/.TestAPICoverage(0xc4200980f0)> <https://ci.centos.org/job/libvirt-go-master-check/systems=libvirt-centos-7/ws/api_test.go>:506 +0x5b1 testing.tRunner(0xc4200980f0, 0x604f40) /usr/lib/golang/src/testing/testing.go:746 +0xd0 created by testing.(*T).Run /usr/lib/golang/src/testing/testing.go:789 +0x2de exit status 2 FAIL _<https://ci.centos.org/job/libvirt-go-master-check/systems=libvirt-centos-7/ws/> 0.381s Build step 'Execute shell' marked build as failure

See <https://ci.centos.org/job/libvirt-go-master-check/systems=libvirt-centos-7/1126/display/redirect> ------------------------------------------ Started by upstream project "libvirt-go-master-check" build number 1126 originally caused by: Started by upstream project "libvirt-go-master-build" build number 1138 originally caused by: Started by upstream project "libvirt-master-build" build number 1537 originally caused by: Started by user Libvirt [EnvInject] - Loading node environment variables. Building remotely on libvirt-centos-7 (libvirt) in workspace <https://ci.centos.org/job/libvirt-go-master-check/systems=libvirt-centos-7/ws/> [libvirt-go-master] $ /bin/sh -xe /tmp/jenkins8091589168763733020.sh + export 'TEST_ARGS=-tags api' + TEST_ARGS='-tags api' + go test -tags api Missing function 'virConnectListAllNWFilterBindings' Missing function 'virNWFilterBindingCreateXML' Missing function 'virNWFilterBindingDelete' Missing function 'virNWFilterBindingFree' Missing function 'virNWFilterBindingGetFilterName' Missing function 'virNWFilterBindingGetPortDev' Missing function 'virNWFilterBindingGetXMLDesc' Missing function 'virNWFilterBindingLookupByPortDev' Missing function 'virNWFilterBindingRef' Missing enum 'VIR_CONNECT_GET_ALL_DOMAINS_STATS_NOWAIT' Missing enum 'VIR_ERR_INVALID_NWFILTER_BINDING' Missing enum 'VIR_ERR_NO_NWFILTER_BINDING' --- FAIL: TestAPICoverage (0.52s) panic: Missing symbols found [recovered] panic: Missing symbols found goroutine 19 [running]: testing.tRunner.func1(0xc4200ae0f0) /usr/lib/golang/src/testing/testing.go:711 +0x2d2 panic(0x5b63c0, 0x61a9a0) /usr/lib/golang/src/runtime/panic.go:491 +0x283 _<https://ci.centos.org/job/libvirt-go-master-check/systems=libvirt-centos-7/ws/.TestAPICoverage(0xc4200ae0f0)> <https://ci.centos.org/job/libvirt-go-master-check/systems=libvirt-centos-7/ws/api_test.go>:506 +0x5b1 testing.tRunner(0xc4200ae0f0, 0x6051d0) /usr/lib/golang/src/testing/testing.go:746 +0xd0 created by testing.(*T).Run /usr/lib/golang/src/testing/testing.go:789 +0x2de exit status 2 FAIL _<https://ci.centos.org/job/libvirt-go-master-check/systems=libvirt-centos-7/ws/> 0.809s Build step 'Execute shell' marked build as failure

See <https://ci.centos.org/job/libvirt-go-master-check/systems=libvirt-centos-7/1127/display/redirect> ------------------------------------------ Started by upstream project "libvirt-go-master-check" build number 1127 originally caused by: Started by upstream project "libvirt-go-master-build" build number 1139 originally caused by: Started by upstream project "libvirt-master-build" build number 1538 originally caused by: Started by an SCM change Started by an SCM change [EnvInject] - Loading node environment variables. Building remotely on libvirt-centos-7 (libvirt) in workspace <https://ci.centos.org/job/libvirt-go-master-check/systems=libvirt-centos-7/ws/> [libvirt-go-master] $ /bin/sh -xe /tmp/jenkins2106001533225019157.sh + export 'TEST_ARGS=-tags api' + TEST_ARGS='-tags api' + go test -tags api Missing function 'virConnectListAllNWFilterBindings' Missing function 'virNWFilterBindingCreateXML' Missing function 'virNWFilterBindingDelete' Missing function 'virNWFilterBindingFree' Missing function 'virNWFilterBindingGetFilterName' Missing function 'virNWFilterBindingGetPortDev' Missing function 'virNWFilterBindingGetXMLDesc' Missing function 'virNWFilterBindingLookupByPortDev' Missing function 'virNWFilterBindingRef' Missing enum 'VIR_CONNECT_GET_ALL_DOMAINS_STATS_NOWAIT' Missing enum 'VIR_ERR_INVALID_NWFILTER_BINDING' Missing enum 'VIR_ERR_NO_NWFILTER_BINDING' --- FAIL: TestAPICoverage (0.64s) panic: Missing symbols found [recovered] panic: Missing symbols found goroutine 19 [running]: testing.tRunner.func1(0xc4200ae0f0) /usr/lib/golang/src/testing/testing.go:711 +0x2d2 panic(0x5b63c0, 0x61a9a0) /usr/lib/golang/src/runtime/panic.go:491 +0x283 _<https://ci.centos.org/job/libvirt-go-master-check/systems=libvirt-centos-7/ws/.TestAPICoverage(0xc4200ae0f0)> <https://ci.centos.org/job/libvirt-go-master-check/systems=libvirt-centos-7/ws/api_test.go>:506 +0x5b1 testing.tRunner(0xc4200ae0f0, 0x6051d0) /usr/lib/golang/src/testing/testing.go:746 +0xd0 created by testing.(*T).Run /usr/lib/golang/src/testing/testing.go:789 +0x2de exit status 2 FAIL _<https://ci.centos.org/job/libvirt-go-master-check/systems=libvirt-centos-7/ws/> 0.811s Build step 'Execute shell' marked build as failure

See <https://ci.centos.org/job/libvirt-go-master-check/systems=libvirt-centos-7/1128/display/redirect> ------------------------------------------ Started by upstream project "libvirt-go-master-check" build number 1128 originally caused by: Started by upstream project "libvirt-go-master-build" build number 1140 originally caused by: Started by upstream project "libvirt-master-build" build number 1539 originally caused by: Started by an SCM change Started by an SCM change Started by an SCM change [EnvInject] - Loading node environment variables. Building remotely on libvirt-centos-7 (libvirt) in workspace <https://ci.centos.org/job/libvirt-go-master-check/systems=libvirt-centos-7/ws/> [libvirt-go-master] $ /bin/sh -xe /tmp/jenkins7618213737402050231.sh + export 'TEST_ARGS=-tags api' + TEST_ARGS='-tags api' + go test -tags api Missing function 'virConnectListAllNWFilterBindings' Missing function 'virNWFilterBindingCreateXML' Missing function 'virNWFilterBindingDelete' Missing function 'virNWFilterBindingFree' Missing function 'virNWFilterBindingGetFilterName' Missing function 'virNWFilterBindingGetPortDev' Missing function 'virNWFilterBindingGetXMLDesc' Missing function 'virNWFilterBindingLookupByPortDev' Missing function 'virNWFilterBindingRef' Missing enum 'VIR_CONNECT_GET_ALL_DOMAINS_STATS_NOWAIT' Missing enum 'VIR_ERR_INVALID_NWFILTER_BINDING' Missing enum 'VIR_ERR_NO_NWFILTER_BINDING' --- FAIL: TestAPICoverage (0.34s) panic: Missing symbols found [recovered] panic: Missing symbols found goroutine 5 [running]: testing.tRunner.func1(0xc4200980f0) /usr/lib/golang/src/testing/testing.go:711 +0x2d2 panic(0x5b63c0, 0x61a9a0) /usr/lib/golang/src/runtime/panic.go:491 +0x283 _<https://ci.centos.org/job/libvirt-go-master-check/systems=libvirt-centos-7/ws/.TestAPICoverage(0xc4200980f0)> <https://ci.centos.org/job/libvirt-go-master-check/systems=libvirt-centos-7/ws/api_test.go>:506 +0x5b1 testing.tRunner(0xc4200980f0, 0x6051d0) /usr/lib/golang/src/testing/testing.go:746 +0xd0 created by testing.(*T).Run /usr/lib/golang/src/testing/testing.go:789 +0x2de exit status 2 FAIL _<https://ci.centos.org/job/libvirt-go-master-check/systems=libvirt-centos-7/ws/> 0.418s Build step 'Execute shell' marked build as failure

participants (1)
-
ci@centos.org